2020-11-12 19:07:53>> MBT-PC Application has Started
2020-11-12 19:07:53>> E:\work\MIN\workspace\mbt1000_pc\MBT1000_PC\bin\Release\x86\mtWrapper.dll
2020-11-12 19:08:37>> MBT-PC Application has Started
2020-11-12 19:08:37>> E:\work\MIN\workspace\mbt1000_pc\MBT1000_PC\bin\Release\x86\mtWrapper.dll
2020-11-12 19:09:05>> MBT-PC Application has Started
2020-11-12 19:09:05>> E:\work\MIN\workspace\mbt1000_pc\MBT1000_PC\bin\Release\x86\mtWrapper.dll
2020-11-12 19:09:29>> MBT-PC Application has Closed
2020-11-12 19:11:20>> MBT-PC Application has Started
2020-11-12 19:11:20>> E:\work\MIN\workspace\mbt1000_pc\MBT1000_PC\bin\Release\x86\mtWrapper.dll
2020-11-12 19:12:31>> MBT-PC Application has Started
2020-11-12 19:12:31>> E:\work\MIN\workspace\mbt1000_pc\MBT1000_PC\bin\Release\x86\mtWrapper.dll
2020-11-12 19:13:04>> MBT-PC Application has Started
2020-11-12 19:13:04>> E:\work\MIN\workspace\mbt1000_pc\MBT1000_PC\bin\Release\x86\mtWrapper.dll
2020-11-12 19:13:56>> MBT-PC Application has Started
2020-11-12 19:13:56>> E:\work\MIN\workspace\mbt1000_pc\MBT1000_PC\bin\Release\x86\mtWrapper.dll
2020-11-12 19:24:33>> MBT-PC Application has Started
2020-11-12 19:24:33>> E:\work\MIN\workspace\mbt1000_pc\MBT1000_PC\bin\Release\x86\mtWrapper.dll
2020-11-12 19:24:57>> MBT-PC Application has Started
2020-11-12 19:24:57>> E:\work\MIN\workspace\mbt1000_pc\MBT1000_PC\bin\Release\x86\mtWrapper.dll
2020-11-12 19:25:16>> MBT-PC Application has Started
2020-11-12 19:25:16>> E:\work\MIN\workspace\mbt1000_pc\MBT1000_PC\bin\Release\x86\mtWrapper.dll
2020-12-02 11:43:06>> MBT-PC Application has Started
2020-12-02 11:43:06>> E:\work\MIN\workspace\mbt1000_pc\MBT1000_PC\bin\Release\x86\mtWrapper.dll
2020-12-02 11:46:57>> MBT-PC Application has Started
2020-12-02 11:46:57>> E:\work\MIN\workspace\mbt1000_pc\MBT1000_PC\bin\Release\x86\mtWrapper.dll
2020-12-02 11:47:44>> MBT-PC Application has Started
2020-12-02 11:47:44>> E:\work\MIN\workspace\mbt1000_pc\MBT1000_PC\bin\Release\x86\mtWrapper.dll
2020-12-02 11:53:28>> MBT-PC Application has Started
2020-12-02 11:53:28>> E:\work\MIN\workspace\mbt1000_pc\MBT1000_PC\bin\Release\x86\mtWrapper.dll
2021-02-03 14:20:29>> MBT-PC Application has Started
2021-02-03 14:20:29>> E:\work\MIN\workspace\mbt1000_pc\MBT1000_PC\bin\Release\x86\mtWrapper.dll
2021-02-03 14:22:18>> MBT-PC Application has Started
2021-02-03 14:22:18>> E:\work\MIN\workspace\mbt1000_pc\MBT1000_PC\bin\Release\x86\mtWrapper.dll
2021-02-03 14:22:26>> MBT-PC Application has Closed
2021-02-03 14:22:31>> MBT-PC Application has Started
2021-02-03 14:22:31>> E:\work\MIN\workspace\mbt1000_pc\MBT1000_PC\bin\Release\x86\mtWrapper.dll
2021-02-03 14:22:35>> MBT-PC Application has Closed
2021-02-03 14:22:42>> MBT-PC Application has Started
2021-02-03 14:22:42>> E:\work\MIN\workspace\mbt1000_pc\MBT1000_PC\bin\Release\x86\mtWrapper.dll
2021-02-03 14:24:54>> MBT-PC Application has Started
2021-02-03 14:24:54>> E:\work\MIN\workspace\mbt1000_pc\MBT1000_PC\bin\Release\x86\mtWrapper.dll
2021-02-03 14:30:48>> MBT-PC Application has Started
2021-02-03 14:30:48>> C:\Users\isin\Desktop\MBT PC\x86\mtWrapper.dll
2021-02-03 14:30:59>> MBT-PC Application has Closed
