{
  "BlocType.Gravier|block": "Gravier",
  "BlocType.Herbe|block": "Herbe",
  "BlocType.Pierre|block": "Pierre",
  "BlocType.Sable|block": "Sable",
  "BlocType.Terre|block": "Terre",
  "blocs.onDestroy|block": "Lorsque l'on détruit un bloc de type %bloc",
  "blocs.onPick|block": "Lorsque l'on prend un bloc de type %bloc",
  "blocs|block": "blocs",
  "{id:category}Blocs": "Blocs"
}