{
  "products": [
    {
      "id": 1,
      "product": "Vestido Festa",
      "price": 300,
      "image": "https://ph-cdn3.ecosweb.com.br/Web/posthaus/foto/moda-feminina/vestido-curto//vestido-com-decote-transpassado-poa_215305_301_1.jpg",
      "categoria": 1
    },
    {
      "id": 2,
      "product": "Vestido Florido",
      "price": 250,
      "image": "https://assets.xtechcommerce.com/uploads/images/medium/c9097046d9ad715fb5de85be871a1c5f.jpg",
      "categoria": 1
    },
    {
      "id": 3,
      "product": "Vestido Longo",
      "price": 500,
      "image": "https://cdn-1.jjshouse.com/upimg/jjshouse/s1140/c6/b8/0133ade95497d67a40f8467f87c1c6b8.jpg",
      "categoria": 1
    },
    {
      "id": 4,
      "product": "Camisa Social",
      "price": 249.9,
      "image": "https://images-americanas.b2w.io/produtos/01/00/img1/42757/9/42757991_1GG.jpg",
      "categoria": 2
    },
    {
      "id": 5,
      "product": "Camisa John John",
      "price": 30,
      "image": "https://img.elo7.com.br/product/zoom/1DD0E7B/camisas-camisetas-blusas-varias-marcas-famosas-renda-extra.jpg",
      "categoria": 2
    }
  ],
  "categories": [
    {
      "id": 1,
      "category": "Vestidos"
    },
    {
      "id": 2,
      "category": "Camisas"
    }
  ]
}