%!PS-Adobe-3.0 EPSF-3.0
%%Creator: cairo 1.14.2 (http://cairographics.org)
%%CreationDate: Wed Apr 29 20:44:20 2015
%%Pages: 1
%%DocumentData: Clean7Bit
%%LanguageLevel: 2
%%BoundingBox: 0 -1 17 19
%%EndComments
%%BeginProlog
save
50 dict begin
/q { gsave } bind def
/Q { grestore } bind def
/cm { 6 array astore concat } bind def
/w { setlinewidth } bind def
/J { setlinecap } bind def
/j { setlinejoin } bind def
/M { setmiterlimit } bind def
/d { setdash } bind def
/m { moveto } bind def
/l { lineto } bind def
/c { curveto } bind def
/h { closepath } bind def
/re { exch dup neg 3 1 roll 5 3 roll moveto 0 rlineto
      0 exch rlineto 0 rlineto closepath } bind def
/S { stroke } bind def
/f { fill } bind def
/f* { eofill } bind def
/n { newpath } bind def
/W { clip } bind def
/W* { eoclip } bind def
/BT { } bind def
/ET { } bind def
/pdfmark where { pop globaldict /?pdfmark /exec load put }
    { globaldict begin /?pdfmark /pop load def /pdfmark
    /cleartomark load def end } ifelse
/BDC { mark 3 1 roll /BDC pdfmark } bind def
/EMC { mark /EMC pdfmark } bind def
/cairo_store_point { /cairo_point_y exch def /cairo_point_x exch def } def
/Tj { show currentpoint cairo_store_point } bind def
/TJ {
  {
    dup
    type /stringtype eq
    { show } { -0.001 mul 0 cairo_font_matrix dtransform rmoveto } ifelse
  } forall
  currentpoint cairo_store_point
} bind def
/cairo_selectfont { cairo_font_matrix aload pop pop pop 0 0 6 array astore
    cairo_font exch selectfont cairo_point_x cairo_point_y moveto } bind def
/Tf { pop /cairo_font exch def /cairo_font_matrix where
      { pop cairo_selectfont } if } bind def
/Td { matrix translate cairo_font_matrix matrix concatmatrix dup
      /cairo_font_matrix exch def dup 4 get exch 5 get cairo_store_point
      /cairo_font where { pop cairo_selectfont } if } bind def
/Tm { 2 copy 8 2 roll 6 array astore /cairo_font_matrix exch def
      cairo_store_point /cairo_font where { pop cairo_selectfont } if } bind def
/g { setgray } bind def
/rg { setrgbcolor } bind def
/d1 { setcachedevice } bind def
%%EndProlog
%%BeginSetup
%%EndSetup
%%Page: 1 1
%%BeginPageSetup
%%PageBoundingBox: 0 -1 17 19
%%EndPageSetup
q 0 -1 17 20 rectclip q
0 g
16.594 17.779 m 16.594 18.432 16.062 18.963 15.406 18.963 c 1.184 18.963
 l 0.531 18.963 0 18.432 0 17.779 c 0 1.186 l 0 0.529 0.531 -0.002 1.184
 -0.002 c 15.406 -0.002 l 16.062 -0.002 16.594 0.529 16.594 1.186 c h
3.555 15.408 m 4.738 15.408 l 4.738 14.221 l 3.555 14.221 l h
3.555 11.854 m 4.738 11.854 l 4.738 10.666 l 3.555 10.666 l h
3.555 8.295 m 4.738 8.295 l 4.738 7.111 l 3.555 7.111 l h
3.555 3.557 m 3.555 4.74 l 4.738 4.74 l 4.738 3.557 l h
13.035 3.557 m 5.926 3.557 l 5.926 4.74 l 13.035 4.74 l h
13.035 7.111 m 5.926 7.111 l 5.926 8.295 l 13.035 8.295 l h
13.035 10.666 m 5.926 10.666 l 5.926 11.854 l 13.035 11.854 l h
13.035 14.221 m 5.926 14.221 l 5.926 15.408 l 13.035 15.408 l h
13.035 14.221 m f
Q Q
showpage
%%Trailer
end restore
%%EOF
