%!PS-Adobe-3.0 EPSF-3.0
%%Creator: cairo 1.14.2 (http://cairographics.org)
%%CreationDate: Thu Apr 30 14:35:19 2015
%%Pages: 1
%%DocumentData: Clean7Bit
%%LanguageLevel: 2
%%BoundingBox: 19 4 61 76
%%EndComments
%%BeginProlog
save
50 dict begin
/q { gsave } bind def
/Q { grestore } bind def
/cm { 6 array astore concat } bind def
/w { setlinewidth } bind def
/J { setlinecap } bind def
/j { setlinejoin } bind def
/M { setmiterlimit } bind def
/d { setdash } bind def
/m { moveto } bind def
/l { lineto } bind def
/c { curveto } bind def
/h { closepath } bind def
/re { exch dup neg 3 1 roll 5 3 roll moveto 0 rlineto
      0 exch rlineto 0 rlineto closepath } bind def
/S { stroke } bind def
/f { fill } bind def
/f* { eofill } bind def
/n { newpath } bind def
/W { clip } bind def
/W* { eoclip } bind def
/BT { } bind def
/ET { } bind def
/pdfmark where { pop globaldict /?pdfmark /exec load put }
    { globaldict begin /?pdfmark /pop load def /pdfmark
    /cleartomark load def end } ifelse
/BDC { mark 3 1 roll /BDC pdfmark } bind def
/EMC { mark /EMC pdfmark } bind def
/cairo_store_point { /cairo_point_y exch def /cairo_point_x exch def } def
/Tj { show currentpoint cairo_store_point } bind def
/TJ {
  {
    dup
    type /stringtype eq
    { show } { -0.001 mul 0 cairo_font_matrix dtransform rmoveto } ifelse
  } forall
  currentpoint cairo_store_point
} bind def
/cairo_selectfont { cairo_font_matrix aload pop pop pop 0 0 6 array astore
    cairo_font exch selectfont cairo_point_x cairo_point_y moveto } bind def
/Tf { pop /cairo_font exch def /cairo_font_matrix where
      { pop cairo_selectfont } if } bind def
/Td { matrix translate cairo_font_matrix matrix concatmatrix dup
      /cairo_font_matrix exch def dup 4 get exch 5 get cairo_store_point
      /cairo_font where { pop cairo_selectfont } if } bind def
/Tm { 2 copy 8 2 roll 6 array astore /cairo_font_matrix exch def
      cairo_store_point /cairo_font where { pop cairo_selectfont } if } bind def
/g { setgray } bind def
/rg { setrgbcolor } bind def
/d1 { setcachedevice } bind def
%%EndProlog
%%BeginSetup
%%EndSetup
%%Page: 1 1
%%BeginPageSetup
%%PageBoundingBox: 19 4 61 76
%%EndPageSetup
q 19 4 42 72 rectclip q
0 g
40 76 m 28.746 76 19.625 66.879 19.625 55.625 c 19.625 41.352 40 23.855
 40 12.801 c 40 23.855 60.375 40.359 60.375 55.625 c 60.375 66.879 51.254
 76 40 76 c h
40 46.191 m 34.789 46.191 30.566 50.414 30.566 55.625 c 30.566 60.836 34.789
 65.059 40 65.059 c 45.211 65.059 49.434 60.836 49.434 55.625 c 49.434 50.414
 45.211 46.191 40 46.191 c h
40 46.191 m f
44.387 12.113 m 44.387 11.434 42.422 10.883 40 10.883 c 37.574 10.883 35.613
 11.434 35.613 12.113 c 35.613 12.793 37.574 13.344 40 13.344 c 42.422 13.344
 44.387 12.793 44.387 12.113 c h
44.387 12.113 m f
0.980392 0.411765 0 rg
52.84 13.785 m 53.801 13.223 54.355 12.59 54.355 11.914 c 54.359 9.594 
47.934 7.707 40.004 7.699 c 32.074 7.691 25.648 9.57 25.645 11.895 c 25.645
 12.578 26.215 13.227 27.211 13.797 c 23.203 12.77 20.668 11.273 20.668 
9.602 c 20.668 6.508 29.324 4 40 4 c 50.676 4 59.328 6.508 59.328 9.602 
c 59.328 11.266 56.82 12.762 52.84 13.785 c h
52.84 13.785 m f
Q Q
showpage
%%Trailer
end restore
%%EOF
