<?xml version="1.0" encoding="UTF-8" standalone="no"?>
<svg
   xmlns:dc="http://purl.org/dc/elements/1.1/"
   xmlns:cc="http://creativecommons.org/ns#"
   xmlns:rdf="http://www.w3.org/1999/02/22-rdf-syntax-ns#"
   xmlns:svg="http://www.w3.org/2000/svg"
   xmlns="http://www.w3.org/2000/svg"
   xml:space="preserve"
   enable-background="new 0 0 32 32"
   viewBox="1.6 -3.2 32.0 43.2"
   height="32px"
   width="32px"
   y="0px"
   x="0px"
   id="Layer_1"
   version="1.0"><metadata
     id="metadata4258"><rdf:RDF><cc:Work
         rdf:about=""><dc:format>image/svg+xml</dc:format><dc:type
           rdf:resource="http://purl.org/dc/dcmitype/StillImage" /><dc:title></dc:title></cc:Work></rdf:RDF></metadata><defs
     id="defs4256" /><path
     id="path4218"
     d="m 31.6,4.4000007 c 0,-1.105 -0.895,-2 -2,-2 l -24,0 c -1.104,0 -2,0.895 -2,2 l 0,28.0000003 c 0,1.105 0.896,2 2,2 l 24,0 c 1.105,0 2,-0.895 2,-2 l 0,-28.0000003 z m -22.001,4 2,0 0,2.0000003 -2,0 0,-2.0000003 z m 0,6.0000003 2,0 0,2 -2,0 0,-2 z m 0,6 2,0 0,2 -2,0 0,-2 z m 0,8 0,-2 2,0 0,2 -2,0 z m 16.001,0 -12,0 0,-2 12,0 0,2 z m 0,-6 -12,0 0,-2 12,0 0,2 z m 0,-6 -12,0 0,-2 12,0 0,2 z m 0,-6 -12,0 0,-2.0000003 12,0 0,2.0000003 z" /><g
     id="g4220" /><g
     id="g4222" /><g
     id="g4224" /><g
     id="g4226" /><g
     id="g4228" /><g
     id="g4230" /><g
     id="g4232" /><g
     id="g4234" /><g
     id="g4236" /><g
     id="g4238" /><g
     id="g4240" /><g
     id="g4242" /><g
     id="g4244" /><g
     id="g4246" /><g
     id="g4248" /></svg>