%!PS-Adobe-3.0 EPSF-3.0
%%Creator: cairo 1.14.2 (http://cairographics.org)
%%CreationDate: Wed Apr 29 20:15:24 2015
%%Pages: 1
%%DocumentData: Clean7Bit
%%LanguageLevel: 2
%%BoundingBox: 0 -1 713 318
%%EndComments
%%BeginProlog
save
50 dict begin
/q { gsave } bind def
/Q { grestore } bind def
/cm { 6 array astore concat } bind def
/w { setlinewidth } bind def
/J { setlinecap } bind def
/j { setlinejoin } bind def
/M { setmiterlimit } bind def
/d { setdash } bind def
/m { moveto } bind def
/l { lineto } bind def
/c { curveto } bind def
/h { closepath } bind def
/re { exch dup neg 3 1 roll 5 3 roll moveto 0 rlineto
      0 exch rlineto 0 rlineto closepath } bind def
/S { stroke } bind def
/f { fill } bind def
/f* { eofill } bind def
/n { newpath } bind def
/W { clip } bind def
/W* { eoclip } bind def
/BT { } bind def
/ET { } bind def
/pdfmark where { pop globaldict /?pdfmark /exec load put }
    { globaldict begin /?pdfmark /pop load def /pdfmark
    /cleartomark load def end } ifelse
/BDC { mark 3 1 roll /BDC pdfmark } bind def
/EMC { mark /EMC pdfmark } bind def
/cairo_store_point { /cairo_point_y exch def /cairo_point_x exch def } def
/Tj { show currentpoint cairo_store_point } bind def
/TJ {
  {
    dup
    type /stringtype eq
    { show } { -0.001 mul 0 cairo_font_matrix dtransform rmoveto } ifelse
  } forall
  currentpoint cairo_store_point
} bind def
/cairo_selectfont { cairo_font_matrix aload pop pop pop 0 0 6 array astore
    cairo_font exch selectfont cairo_point_x cairo_point_y moveto } bind def
/Tf { pop /cairo_font exch def /cairo_font_matrix where
      { pop cairo_selectfont } if } bind def
/Td { matrix translate cairo_font_matrix matrix concatmatrix dup
      /cairo_font_matrix exch def dup 4 get exch 5 get cairo_store_point
      /cairo_font where { pop cairo_selectfont } if } bind def
/Tm { 2 copy 8 2 roll 6 array astore /cairo_font_matrix exch def
      cairo_store_point /cairo_font where { pop cairo_selectfont } if } bind def
/g { setgray } bind def
/rg { setrgbcolor } bind def
/d1 { setcachedevice } bind def
%%EndProlog
%%BeginSetup
%%EndSetup
%%Page: 1 1
%%BeginPageSetup
%%PageBoundingBox: 0 -1 713 318
%%EndPageSetup
q 0 -1 713 319 rectclip q
0.980392 0.411765 0 rg
471.43 245.369 m 471 244.943 l 468.574 242.517 467.148 239.095 467.148 
235.525 c 467.148 228.107 473.281 221.974 480.699 221.974 c 484.41 221.974
 487.691 223.4 490.117 225.826 c 490.547 226.396 l 534.484 289.31 l h
480.559 228.962 m 476.707 228.962 473.566 232.103 473.566 235.954 c 473.566
 239.806 476.707 242.947 480.559 242.947 c 484.41 242.947 487.551 239.806
 487.551 235.954 c 487.551 232.103 484.41 228.962 480.559 228.962 c h
480.559 228.962 m f
0 g
526.355 273.333 m 517.082 260.064 l 526.641 251.22 532.633 238.665 532.633
 224.826 c 548.609 224.826 l 548.609 244.228 539.906 261.494 526.355 273.333
 c h
526.355 273.333 m f
484.555 288.884 m 449.172 288.884 420.496 260.208 420.496 224.826 c 436.473
 224.826 l 436.473 251.22 458.016 272.763 484.555 272.763 c 490.832 272.763
 496.68 271.622 502.242 269.337 c 517.223 279.896 l 507.664 285.603 496.535
 288.884 484.555 288.884 c h
484.555 288.884 m f
693.871 289.232 m 683.359 289.232 674.836 280.712 674.836 270.201 c 674.836
 256.865 693.871 240.521 693.871 230.193 c 693.871 240.521 712.906 255.939
 712.906 270.201 c 712.906 280.712 704.383 289.232 693.871 289.232 c h
693.871 261.388 m 689 261.388 685.055 265.333 685.055 270.201 c 685.055
 275.068 689 279.013 693.871 279.013 c 698.738 279.013 702.684 275.068 702.684
 270.201 c 702.684 265.333 698.738 261.388 693.871 261.388 c h
693.871 261.388 m f
697.969 229.552 m 697.969 228.915 696.133 228.4 693.871 228.4 c 691.605
 228.4 689.77 228.915 689.77 229.552 c 689.77 230.185 691.605 230.701 693.871
 230.701 c 696.133 230.701 697.969 230.185 697.969 229.552 c h
697.969 229.552 m f
0.980392 0.411765 0 rg
705.863 231.115 m 706.762 230.587 707.281 229.997 707.281 229.365 c 707.285
 227.197 701.281 225.435 693.871 225.431 c 686.469 225.423 680.461 227.177
 680.461 229.349 c 680.461 229.99 680.992 230.591 681.922 231.126 c 678.176
 230.165 675.812 228.767 675.812 227.204 c 675.812 224.314 683.898 221.974
 693.871 221.974 c 703.844 221.974 711.926 224.318 711.926 227.204 c 711.926
 228.759 709.582 230.158 705.863 231.115 c h
705.863 231.115 m f
0 g
630.453 260.798 m 618.605 272.646 l 613.449 267.494 l 625.297 255.642 l
 613.449 243.794 l 618.605 238.638 l 635.609 255.642 l h
630.453 260.798 m f
639.422 255.642 m 627.574 243.794 l 632.727 238.638 l 649.73 255.642 l 
632.727 272.646 l 627.57 267.494 l h
639.422 255.642 m f
604.84 272.646 m 609.996 267.494 l 598.148 255.642 l 609.996 243.794 l 
604.84 238.638 l 587.836 255.642 l 592.996 260.798 l h
604.84 272.646 m f
595.871 243.794 m 590.719 238.638 l 573.715 255.642 l 590.719 272.646 l
 595.875 267.494 l 584.027 255.642 l h
595.871 243.794 m f
238.57 124.544 m 233.816 124.544 229.965 128.396 229.965 133.15 c 229.965
 137.9 233.816 141.755 238.57 141.755 c 243.324 141.755 247.176 137.9 247.176
 133.15 c 247.176 128.396 243.324 124.544 238.57 124.544 c h
238.57 124.544 m f
0.980392 0.411765 0 rg
274.16 118.536 m 274.16 120.13 272.871 121.423 271.273 121.423 c 269.68
 121.423 268.387 120.13 268.387 118.536 c 268.387 107.54 l 252.484 123.056
 l 254.543 125.892 255.762 129.376 255.762 133.15 c 255.762 142.642 248.062
 150.341 238.57 150.341 c 229.074 150.341 221.379 142.646 221.379 133.15
 c 221.379 123.654 229.074 115.954 238.57 115.954 c 242.207 115.954 245.578
 117.087 248.355 119.017 c 264.18 103.579 l 253.43 103.579 l 251.836 103.579
 250.543 102.286 250.543 100.693 c 250.543 99.099 251.836 97.806 253.43 
97.806 c 274.16 97.806 l h
226.426 133.15 m 226.426 139.857 231.863 145.294 238.57 145.294 c 245.277
 145.294 250.719 139.857 250.719 133.15 c 250.719 126.439 245.277 121.001
 238.57 121.001 c 231.859 121.001 226.426 126.439 226.426 133.15 c h
226.426 133.15 m f
0 g
195.703 158.06 m 190.949 158.06 187.098 161.911 187.098 166.665 c 187.098
 171.415 190.949 175.271 195.703 175.271 c 200.457 175.271 204.309 171.415
 204.309 166.665 c 204.309 161.911 200.457 158.06 195.703 158.06 c h
195.703 158.06 m f
160.113 181.275 m 160.113 179.681 161.406 178.388 163 178.388 c 164.594
 178.388 165.887 179.681 165.887 181.275 c 165.887 192.271 l 181.789 176.755
 l 179.727 173.923 178.512 170.435 178.512 166.665 c 178.512 157.169 186.207
 149.474 195.703 149.474 c 205.195 149.474 212.895 157.169 212.895 166.665
 c 212.895 176.158 205.199 183.857 195.703 183.857 c 192.066 183.857 188.695
 182.724 185.914 180.798 c 170.09 196.232 l 180.84 196.232 l 182.434 196.232
 183.73 197.525 183.73 199.119 c 183.73 200.716 182.438 202.005 180.84 202.005
 c 160.113 202.005 l h
207.848 166.665 m 207.848 159.958 202.41 154.517 195.703 154.517 c 188.996
 154.517 183.555 159.958 183.555 166.665 c 183.555 173.372 188.996 178.814
 195.703 178.814 c 202.414 178.814 207.848 173.372 207.848 166.665 c h
207.848 166.665 m f
508.5 189.736 m 508.5 194.49 512.352 198.341 517.105 198.341 c 521.855 
198.341 525.711 194.49 525.711 189.736 c 525.711 184.986 521.855 181.13 
517.105 181.13 c 512.352 181.13 508.5 184.986 508.5 189.736 c h
508.5 189.736 m f
0.980392 0.411765 0 rg
502.492 154.146 m 504.086 154.146 505.379 155.439 505.379 157.033 c 505.379
 158.626 504.086 159.919 502.492 159.919 c 491.496 159.919 l 507.012 175.822
 l 509.848 173.763 513.332 172.548 517.105 172.548 c 526.598 172.548 534.297
 180.244 534.297 189.736 c 534.297 199.232 526.602 206.931 517.105 206.931
 c 507.609 206.931 499.91 199.232 499.91 189.736 c 499.91 186.099 501.043
 182.728 502.973 179.951 c 487.535 164.126 l 487.535 174.876 l 487.535 176.47
 486.242 177.763 484.648 177.763 c 483.055 177.763 481.762 176.47 481.762
 174.876 c 481.762 154.146 l h
517.105 201.88 m 523.812 201.88 529.25 196.447 529.25 189.736 c 529.25 
183.029 523.812 177.591 517.105 177.591 c 510.395 177.591 504.957 183.029
 504.957 189.736 c 504.957 196.447 510.395 201.88 517.105 201.88 c h
517.105 201.88 m f
0 g
429.082 110.072 m 429.082 114.826 432.934 118.677 437.688 118.677 c 442.438
 118.677 446.293 114.826 446.293 110.072 c 446.293 105.318 442.438 101.466
 437.688 101.466 c 432.934 101.466 429.082 105.318 429.082 110.072 c h
429.082 110.072 m f
452.297 145.661 m 450.703 145.661 449.41 144.369 449.41 142.775 c 449.41
 141.181 450.703 139.888 452.297 139.888 c 463.293 139.888 l 447.777 123.986
 l 444.945 126.048 441.457 127.263 437.688 127.263 c 428.195 127.263 420.496
 119.568 420.496 110.072 c 420.496 100.579 428.195 92.88 437.688 92.88 c
 447.18 92.88 454.879 100.576 454.879 110.072 c 454.879 113.708 453.746 
117.079 451.82 119.857 c 467.254 135.685 l 467.254 124.931 l 467.254 123.341
 468.547 122.044 470.141 122.044 c 471.738 122.044 473.027 123.337 473.027
 124.931 c 473.027 145.661 l h
437.688 97.927 m 430.98 97.927 425.539 103.365 425.539 110.072 c 425.539
 116.779 430.98 122.22 437.688 122.22 c 444.395 122.22 449.836 116.779 449.836
 110.072 c 449.836 103.361 444.395 97.927 437.688 97.927 c h
437.688 97.927 m f
59.762 289.986 m 30.02 289.986 l 27.48 289.986 25.418 287.927 25.418 285.384
 c 25.418 259.091 l 25.418 256.548 27.48 254.494 30.02 254.494 c 31.438 
254.494 l 31.438 221.974 l 57.805 221.974 l 57.805 254.494 l 59.762 254.494
 l 62.305 254.494 64.359 256.552 64.359 259.091 c 64.359 285.384 l 64.359
 287.923 62.305 289.986 59.762 289.986 c h
59.762 289.986 m f
18.93 259.091 m 18.93 285.384 l 18.93 287.029 19.312 288.579 19.957 289.986
 c 4.598 289.986 l 2.059 289.986 0 287.923 0 285.384 c 0 259.091 l 0 256.548
 2.059 254.49 4.598 254.49 c 6.016 254.49 l 6.016 221.974 l 24.945 221.974
 l 24.945 249.232 l 21.379 251.072 18.93 254.802 18.93 259.091 c h
18.93 259.091 m f
85.59 289.986 m 69.824 289.986 l 70.469 288.579 70.852 287.029 70.852 285.384
 c 70.852 259.091 l 70.852 254.587 68.156 250.708 64.293 248.97 c 64.293
 221.974 l 83.633 221.974 l 83.633 254.494 l 85.586 254.494 l 88.129 254.494
 90.188 256.552 90.188 259.091 c 90.188 285.384 l 90.191 287.923 88.129 
289.986 85.59 289.986 c h
85.59 289.986 m f
0.980392 0.411765 0 rg
69.895 307.447 m 70.125 307.509 70.266 307.747 70.203 307.982 c 70.137 
308.212 69.898 308.349 69.668 308.29 c 69.434 308.228 69.297 307.986 69.359
 307.755 c 69.422 307.521 69.66 307.384 69.895 307.447 c h
69.895 307.447 m f
72.461 307.447 m 72.695 307.384 72.934 307.521 72.996 307.755 c 73.059 
307.986 72.918 308.228 72.688 308.29 c 72.453 308.349 72.215 308.212 72.152
 307.982 c 72.09 307.747 72.23 307.509 72.461 307.447 c h
72.461 307.447 m f
74.684 306.779 m 74.516 306.607 74.516 306.333 74.684 306.161 c 74.855 
305.994 75.129 305.994 75.301 306.161 c 75.469 306.333 75.469 306.607 75.301
 306.779 c 75.129 306.951 74.855 306.951 74.684 306.779 c h
74.684 306.779 m f
76.5 303.63 m 76.734 303.693 76.871 303.935 76.809 304.165 c 76.746 304.396
 76.508 304.536 76.277 304.474 c 76.043 304.411 75.906 304.173 75.969 303.939
 c 76.031 303.704 76.27 303.572 76.5 303.63 c h
76.5 303.63 m f
76.504 301.681 m 76.27 301.744 76.031 301.603 75.969 301.372 c 75.906 301.138
 76.043 300.9 76.277 300.837 c 76.508 300.775 76.746 300.911 76.809 301.146
 c 76.871 301.376 76.734 301.619 76.504 301.681 c h
76.504 301.681 m f
74.684 299.146 m 74.516 298.978 74.516 298.701 74.684 298.533 c 74.855 
298.361 75.129 298.361 75.301 298.533 c 75.469 298.701 75.469 298.978 75.301
 299.146 c 75.129 299.318 74.855 299.318 74.684 299.146 c h
74.684 299.146 m f
72.461 297.865 m 72.23 297.802 72.09 297.564 72.152 297.329 c 72.215 297.099
 72.453 296.962 72.688 297.021 c 72.918 297.083 73.059 297.322 72.996 297.556
 c 72.934 297.786 72.695 297.927 72.461 297.865 c h
72.461 297.865 m f
69.895 297.865 m 69.66 297.927 69.422 297.786 69.359 297.556 c 69.297 297.322
 69.434 297.083 69.668 297.021 c 69.898 296.962 70.141 297.099 70.203 297.329
 c 70.266 297.564 70.125 297.802 69.895 297.865 c h
69.895 297.865 m f
67.055 299.146 m 66.883 298.978 66.883 298.701 67.055 298.533 c 67.223 
298.361 67.5 298.361 67.668 298.533 c 67.84 298.701 67.84 298.978 67.668
 299.146 c 67.5 299.318 67.223 299.318 67.055 299.146 c h
67.055 299.146 m f
65.852 301.681 m 65.621 301.619 65.48 301.38 65.543 301.146 c 65.605 300.911
 65.844 300.775 66.078 300.837 c 66.309 300.9 66.449 301.138 66.387 301.372
 c 66.324 301.603 66.086 301.744 65.852 301.681 c h
65.852 301.681 m f
65.852 303.63 m 66.086 303.572 66.324 303.704 66.387 303.939 c 66.449 304.173
 66.309 304.411 66.078 304.474 c 65.844 304.536 65.605 304.396 65.543 304.165
 c 65.48 303.935 65.621 303.693 65.852 303.63 c h
65.852 303.63 m f
72.012 303.49 m 71.957 303.54 71.902 303.583 71.844 303.622 c 71.848 303.63
 l 67.668 306.779 l 67.5 306.951 67.223 306.951 67.055 306.779 c 66.883 
306.607 66.883 306.333 67.055 306.161 c 70.203 301.986 l 70.211 301.99 l
 70.25 301.931 70.293 301.876 70.344 301.826 c 70.805 301.365 71.551 301.365
 72.012 301.826 c 72.469 302.283 72.469 303.029 72.012 303.49 c h
72.012 303.49 m f
78 308.38 m 78.438 308.818 l 78.59 308.665 l 78.719 308.536 78.926 308.536
 79.051 308.665 c 79.625 309.24 l 79.754 309.369 79.754 309.576 79.625 309.701
 c 79.625 309.704 l 78.254 311.076 l 78.125 311.201 77.918 311.201 77.793
 311.076 c 77.219 310.501 l 77.09 310.372 77.09 310.165 77.219 310.04 c 
77.367 309.892 l 76.93 309.454 l 75.898 310.326 74.668 310.97 73.316 311.302
 c 74.082 311.923 74.57 312.869 74.57 313.931 c 74.57 315.806 73.051 317.326
 71.176 317.326 c 69.305 317.326 67.785 315.806 67.785 313.931 c 67.785 
312.869 68.273 311.923 69.039 311.302 c 67.688 310.966 66.457 310.326 65.426
 309.454 c 64.988 309.892 l 65.137 310.04 l 65.266 310.165 65.266 310.372
 65.137 310.501 c 64.562 311.076 l 64.434 311.201 64.23 311.201 64.102 311.076
 c 62.73 309.704 l 62.73 309.701 l 62.602 309.576 62.602 309.369 62.73 309.24
 c 63.305 308.665 l 63.43 308.54 63.637 308.54 63.766 308.665 c 63.918 308.818
 l 64.355 308.38 l 63.055 306.829 62.273 304.833 62.273 302.658 c 62.273
 297.736 66.258 293.751 71.176 293.751 c 76.094 293.751 80.082 297.736 80.082
 302.658 c 80.082 304.833 79.301 306.829 78 308.38 c h
68.895 313.931 m 68.895 315.193 69.918 316.212 71.176 316.212 c 72.438 
316.212 73.457 315.193 73.457 313.931 c 73.457 312.947 72.832 312.107 71.953
 311.786 c 71.953 313.244 l 72.168 313.244 l 72.348 313.244 72.496 313.392
 72.496 313.572 c 72.496 314.384 l 72.496 314.564 72.348 314.708 72.168 
314.708 c 70.227 314.708 l 70.047 314.708 69.902 314.564 69.902 314.384 
c 69.902 313.572 l 69.902 313.392 70.047 313.244 70.227 313.244 c 70.438
 313.244 l 70.438 311.775 l 69.543 312.083 68.895 312.931 68.895 313.931
 c h
71.176 295.927 m 67.473 295.927 64.469 298.931 64.469 302.634 c 64.469 
306.341 67.473 309.345 71.176 309.345 c 74.883 309.345 77.887 306.341 77.887
 302.634 c 77.887 298.931 74.883 295.927 71.176 295.927 c h
71.176 295.927 m f
14.434 309.931 m 23.543 309.931 l 23.574 309.419 23.867 308.978 24.293 
308.744 c 15.371 308.744 l 15.324 308.744 15.289 308.708 15.289 308.661 
c 15.289 308.619 15.324 308.583 15.371 308.583 c 24.777 308.583 l 24.848
 308.572 24.918 308.564 24.992 308.564 c 25.793 308.564 26.445 309.216 26.445
 310.017 c 26.445 310.822 25.793 311.47 24.992 311.47 c 24.891 311.47 24.793
 311.462 24.695 311.443 c 15.328 311.443 l 15.285 311.443 15.25 311.404 
15.25 311.361 c 15.25 311.318 15.285 311.279 15.328 311.279 c 24.273 311.279
 l 23.855 311.04 23.57 310.603 23.543 310.091 c 14.434 310.091 l 14.387 
310.091 14.352 310.056 14.352 310.013 c 14.352 309.966 14.387 309.931 14.434
 309.931 c h
14.434 309.931 m f
26.129 298.892 m 24.953 298.892 l 24.953 298.888 l 24.953 296.111 22.723
 293.857 19.953 293.814 c 19.945 293.779 19.918 293.751 19.879 293.751 c
 10.801 293.751 l 10.758 293.751 10.719 293.786 10.719 293.833 c 10.719 
293.876 10.758 293.911 10.801 293.911 c 18.871 293.911 l 17.973 294.091 
17.168 294.513 16.508 295.099 c 7.324 295.099 l 7.281 295.099 7.242 295.134
 7.242 295.181 c 7.242 295.224 7.281 295.259 7.324 295.259 c 16.328 295.259
 l 15.973 295.611 15.668 296.009 15.426 296.447 c 6.277 296.447 l 6.23 296.447
 6.195 296.486 6.195 296.529 c 6.195 296.572 6.23 296.611 6.277 296.611 
c 15.348 296.611 l 15.16 296.982 15.016 297.38 14.922 297.798 c 5.793 297.798
 l 5.75 297.798 5.711 297.833 5.711 297.876 c 5.711 297.923 5.75 297.958
 5.793 297.958 c 14.891 297.958 l 14.836 298.259 14.801 298.568 14.801 298.888
 c 14.801 298.974 14.809 299.06 14.812 299.146 c 5.711 299.146 l 5.668 299.146
 5.633 299.181 5.633 299.224 c 5.633 299.271 5.668 299.306 5.711 299.306
 c 14.82 299.306 l 14.855 299.72 14.941 300.115 15.066 300.494 c 5.965 300.494
 l 5.918 300.494 5.883 300.529 5.883 300.576 c 5.883 300.619 5.918 300.654
 5.965 300.654 c 15.121 300.654 l 15.281 301.079 15.492 301.478 15.754 301.841
 c 6.73 301.841 l 6.684 301.841 6.648 301.876 6.648 301.923 c 6.648 301.966
 6.684 302.001 6.73 302.001 c 15.875 302.001 l 16.242 302.47 16.688 302.876
 17.191 303.189 c 8.242 303.189 l 8.195 303.189 8.16 303.228 8.16 303.271
 c 8.16 303.314 8.195 303.353 8.242 303.353 c 17.469 303.353 l 18.012 303.646
 18.617 303.845 19.258 303.923 c 18.855 304.54 l 10.156 304.54 l 10.109 
304.54 10.074 304.576 10.074 304.619 c 10.074 304.665 10.109 304.701 10.156
 304.701 c 18.75 304.701 l 17.969 305.888 l 8.945 305.888 l 8.902 305.888
 8.867 305.923 8.867 305.966 c 8.867 306.013 8.902 306.048 8.945 306.048
 c 17.859 306.048 l 21.711 307.236 l 12.07 307.236 l 12.027 307.236 11.988
 307.271 11.988 307.318 c 11.988 307.361 12.027 307.396 12.07 307.396 c 
22.234 307.396 l 22.25 307.396 23.957 307.927 23.957 307.927 c 23.957 303.122
 l 27.648 301.009 l 29.34 293.794 l h
19.879 294.794 m 22.141 294.794 23.973 296.626 23.973 298.888 c 23.973 
301.15 22.141 302.982 19.879 302.982 c 17.617 302.982 15.785 301.15 15.785
 298.888 c 15.785 296.626 17.617 294.794 19.879 294.794 c h
19.879 294.794 m f
45.805 312.681 m 50.91 312.681 55.047 308.544 55.047 303.439 c 55.047 298.333
 50.91 294.197 45.805 294.197 c 40.703 294.197 36.562 298.333 36.562 303.439
 c 36.562 308.544 40.703 312.681 45.805 312.681 c 45.805 313.126 m 44.5 
313.126 43.23 312.869 42.035 312.365 c 40.883 311.876 39.844 311.177 38.957
 310.286 c 38.066 309.4 37.367 308.361 36.879 307.208 c 36.375 306.013 36.117
 304.747 36.117 303.439 c 36.117 302.13 36.375 300.861 36.879 299.665 c 
37.367 298.513 38.066 297.478 38.957 296.587 c 39.844 295.701 40.883 295.001
 42.035 294.513 c 43.23 294.005 44.5 293.751 45.805 293.751 c 47.113 293.751
 48.383 294.005 49.578 294.513 c 50.73 295.001 51.766 295.701 52.656 296.587
 c 53.547 297.478 54.242 298.513 54.73 299.665 c 55.238 300.861 55.492 302.13
 55.492 303.439 c 55.492 304.747 55.238 306.013 54.73 307.208 c 54.242 308.361
 53.547 309.4 52.656 310.286 c 51.766 311.177 50.73 311.876 49.578 312.365
 c 48.383 312.869 47.113 313.126 45.805 313.126 c h
45.805 313.126 m f
45.145 307.876 m 45.156 307.837 45.176 307.818 45.195 307.818 c 45.207 
307.818 45.215 307.822 45.227 307.833 c 45.227 307.802 45.23 307.775 45.234
 307.747 c 45.258 307.568 45.277 307.478 45.379 307.372 c 45.543 307.201
 45.664 307.138 45.809 307.138 c 45.953 307.138 46.07 307.201 46.23 307.372
 c 46.332 307.478 46.355 307.568 46.379 307.747 c 46.379 307.775 46.383 
307.802 46.387 307.833 c 46.395 307.822 46.406 307.818 46.418 307.818 c 
46.438 307.818 46.457 307.837 46.465 307.876 c 46.48 307.939 46.484 307.978
 46.527 308.115 c 46.566 308.247 46.539 308.283 46.52 308.302 c 46.512 308.31
 46.5 308.314 46.488 308.314 c 46.465 308.314 46.438 308.302 46.418 308.283
 c 46.422 308.411 46.426 308.548 46.426 308.701 c 46.426 309.138 45.922 
309.204 45.805 309.204 c 45.691 309.204 45.188 309.138 45.188 308.701 c 
45.188 308.548 45.191 308.411 45.195 308.283 c 45.176 308.302 45.148 308.314
 45.125 308.314 c 45.113 308.314 45.102 308.31 45.094 308.302 c 45.07 308.283
 45.047 308.247 45.086 308.115 c 45.125 307.978 45.133 307.939 45.145 307.876
 c h
47.25 294.786 m 47.082 294.896 47.008 294.97 46.926 295.048 c 46.844 295.126
 46.914 295.279 46.887 295.454 c 46.859 295.626 46.855 295.681 46.977 296.22
 c 47.102 296.763 47.164 297.185 47.156 297.642 c 47.152 298.099 47.008 
298.294 47.004 298.474 c 46.996 298.654 47.012 298.869 46.996 299.154 c 
46.984 299.435 47 299.568 47.051 299.904 c 47.102 300.24 47.164 300.704 
47.195 301.314 c 47.23 301.927 47.215 302.341 47.145 302.665 c 47.074 302.99
 46.965 303.189 47.062 303.529 c 47.164 303.869 47.055 304.134 47.043 304.408
 c 47.027 304.685 47.051 304.665 47.176 304.841 c 47.301 305.017 47.465 
305.849 47.559 306.177 c 47.652 306.501 47.68 306.509 47.68 306.509 c 48.441
 306.595 48.695 306.779 48.848 306.88 c 49.004 306.986 48.988 306.966 49.262
 307.005 c 49.539 307.044 49.812 307.111 50.301 307.38 c 50.785 307.654 
51.402 308.119 51.402 308.119 c 51.43 308.115 51.457 308.115 51.48 308.115
 c 51.73 308.115 51.949 308.154 52.051 308.259 c 52.16 308.376 52.223 308.38
 52.277 308.38 c 52.508 308.38 l 52.617 308.38 52.703 308.439 52.66 308.529
 c 52.629 308.595 52.379 308.603 52.242 308.603 c 52.188 308.603 52.152 
308.603 52.152 308.603 c 52.152 308.603 52.266 308.685 52.41 308.81 c 52.559
 308.935 52.594 308.876 52.801 308.997 c 53.004 309.119 52.949 309.201 52.949
 309.201 c 52.688 309.115 52.461 309.056 52.164 308.997 c 51.867 308.943
 51.703 308.775 51.258 308.595 c 50.816 308.415 50.363 308.376 49.621 308.161
 c 48.875 307.943 48.359 307.572 48.359 307.572 c 48.211 307.591 48.074 
307.603 47.949 307.603 c 47.141 307.603 46.848 307.181 46.754 307.181 c 
46.676 307.185 46.504 307.314 46.391 307.411 c 46.371 307.376 46.344 307.337
 46.305 307.298 c 46.125 307.111 45.984 307.036 45.809 307.036 c 45.633 
307.036 45.484 307.111 45.305 307.298 c 45.27 307.337 45.242 307.372 45.219
 307.411 c 45.113 307.314 44.938 307.185 44.859 307.181 c 44.855 307.181
 l 44.766 307.181 44.473 307.603 43.664 307.603 c 43.539 307.603 43.402 
307.591 43.254 307.572 c 43.254 307.572 42.738 307.943 41.992 308.161 c 
41.25 308.376 40.797 308.415 40.355 308.595 c 39.91 308.775 39.746 308.943
 39.449 308.997 c 39.152 309.056 38.926 309.115 38.664 309.201 c 38.664 
309.201 38.605 309.119 38.812 308.997 c 39.02 308.876 39.055 308.935 39.199
 308.81 c 39.348 308.685 39.457 308.603 39.457 308.603 c 39.457 308.603 
39.422 308.603 39.371 308.603 c 39.234 308.603 38.98 308.595 38.949 308.529
 c 38.906 308.439 38.996 308.38 39.105 308.38 c 39.332 308.38 l 39.391 308.38
 39.449 308.376 39.562 308.259 c 39.664 308.154 39.879 308.115 40.129 308.115
 c 40.156 308.115 40.184 308.115 40.211 308.115 c 40.211 308.115 40.828 
307.654 41.312 307.38 c 41.801 307.111 42.074 307.044 42.352 307.005 c 42.625
 306.966 42.609 306.986 42.762 306.88 c 42.918 306.779 43.172 306.595 43.934
 306.509 c 43.934 306.509 43.961 306.501 44.055 306.177 c 44.148 305.849
 44.312 305.017 44.438 304.841 c 44.562 304.665 44.582 304.681 44.57 304.408
 c 44.559 304.134 44.449 303.869 44.547 303.529 c 44.648 303.189 44.539 
302.99 44.469 302.665 c 44.395 302.341 44.383 301.927 44.414 301.314 c 44.449
 300.704 44.512 300.24 44.562 299.904 c 44.613 299.568 44.629 299.435 44.617
 299.154 c 44.602 298.869 44.617 298.654 44.609 298.474 c 44.602 298.294
 44.461 298.099 44.453 297.642 c 44.449 297.185 44.512 296.763 44.637 296.22
 c 44.758 295.681 44.75 295.626 44.727 295.454 c 44.699 295.279 44.77 295.126
 44.688 295.048 c 44.602 294.97 44.531 294.896 44.363 294.786 c 44.195 294.681
 44.105 294.646 44.133 294.579 c 44.156 294.517 44.301 294.458 44.477 294.408
 c 44.531 294.392 44.586 294.384 44.641 294.384 c 44.766 294.384 44.883 
294.419 44.961 294.462 c 45.074 294.529 45.121 294.544 45.25 294.544 c 45.379
 294.544 45.422 294.583 45.426 294.685 c 45.43 294.783 45.367 294.869 45.301
 294.97 c 45.238 295.076 45.223 295.134 45.254 295.224 c 45.285 295.318 
45.273 295.337 45.262 295.47 c 45.254 295.603 45.266 296.181 45.27 296.451
 c 45.277 296.724 45.371 296.915 45.43 297.158 c 45.492 297.4 45.496 297.681
 45.469 297.915 c 45.445 298.146 45.457 298.158 45.48 298.384 c 45.508 298.611
 45.574 298.935 45.637 299.306 c 45.703 299.673 45.73 299.9 45.727 300.283
 c 45.723 300.665 45.762 301.119 45.812 301.119 c 45.859 301.119 45.891 
300.665 45.883 300.283 c 45.879 299.9 45.91 299.673 45.977 299.306 c 46.039
 298.935 46.105 298.611 46.129 298.384 c 46.156 298.158 46.168 298.146 46.145
 297.915 c 46.117 297.681 46.121 297.4 46.18 297.158 c 46.242 296.915 46.336
 296.724 46.34 296.451 c 46.344 296.181 46.359 295.603 46.348 295.47 c 46.34
 295.337 46.328 295.318 46.359 295.224 c 46.387 295.134 46.375 295.076 46.309
 294.97 c 46.246 294.869 46.18 294.783 46.188 294.685 c 46.191 294.583 46.234
 294.544 46.363 294.544 c 46.492 294.544 46.539 294.529 46.652 294.462 c
 46.727 294.419 46.848 294.384 46.969 294.384 c 47.023 294.384 47.082 294.392
 47.137 294.408 c 47.312 294.458 47.453 294.517 47.48 294.579 c 47.508 294.646
 47.418 294.681 47.25 294.786 c h
42.332 306.001 m 42.605 306.064 42.582 306.072 42.762 306.029 c 42.91 305.994
 43.141 305.915 43.609 306.009 c 43.777 306.04 43.879 306.091 43.988 306.025
 c 43.977 306.072 43.965 306.115 43.953 306.146 c 43.91 306.298 43.883 306.372
 43.867 306.411 c 43.148 306.497 42.883 306.677 42.723 306.786 c 42.707 
306.794 l 42.594 306.869 42.594 306.869 42.445 306.888 c 42.414 306.892 
42.379 306.9 42.336 306.904 c 42.234 306.919 42.129 306.935 42.004 306.97
 c 41.875 306.974 41.738 306.97 41.598 306.958 c 40.824 306.904 40.387 306.783
 39.906 306.798 c 39.43 306.81 39.219 306.911 38.922 306.861 c 38.621 306.81
 38.387 306.786 38.113 306.779 c 38.113 306.779 38.086 306.681 38.324 306.638
 c 38.559 306.599 38.57 306.661 38.754 306.595 c 38.934 306.533 39.066 306.494
 39.066 306.494 c 39.066 306.494 38.625 306.349 38.617 306.247 c 38.605 
306.15 38.707 306.122 38.812 306.161 c 38.918 306.201 38.973 306.22 39.027
 306.24 c 39.078 306.259 39.137 306.275 39.281 306.204 c 39.43 306.138 39.68
 306.193 39.941 306.298 c 39.941 306.298 40.68 306.079 41.23 305.994 c 41.781
 305.908 42.062 305.943 42.332 306.001 c h
53.5 306.779 m 53.223 306.786 52.988 306.81 52.691 306.861 c 52.395 306.911
 52.184 306.81 51.703 306.798 c 51.227 306.783 50.789 306.904 50.016 306.958
 c 49.875 306.97 49.738 306.974 49.609 306.97 c 49.484 306.935 49.379 306.919
 49.277 306.904 c 49.234 306.9 49.199 306.892 49.168 306.888 c 49.016 306.869
 49.016 306.869 48.906 306.794 c 48.891 306.786 l 48.73 306.677 48.461 306.497
 47.742 306.411 c 47.727 306.372 47.699 306.298 47.656 306.146 c 47.648 
306.115 47.637 306.072 47.625 306.025 c 47.734 306.091 47.836 306.04 48 
306.009 c 48.473 305.915 48.703 305.994 48.848 306.029 c 49.031 306.072 
49.008 306.064 49.281 306.001 c 49.551 305.943 49.832 305.908 50.383 305.994
 c 50.934 306.079 51.672 306.298 51.672 306.298 c 51.934 306.193 52.184 
306.138 52.328 306.208 c 52.473 306.275 52.531 306.259 52.586 306.24 c 52.637
 306.22 52.695 306.201 52.797 306.161 c 52.902 306.122 53.004 306.15 52.996
 306.247 c 52.988 306.349 52.547 306.494 52.547 306.494 c 52.547 306.494
 52.68 306.533 52.859 306.595 c 53.039 306.661 53.055 306.599 53.289 306.638
 c 53.523 306.681 53.5 306.779 53.5 306.779 c h
44.312 301.31 m 44.285 301.81 44.289 302.185 44.332 302.482 c 44.293 302.404
 44.246 302.31 44.176 302.185 c 43.977 301.826 43.738 301.38 43.574 300.81
 c 43.414 300.244 43.332 300.044 43.145 299.712 c 42.957 299.384 42.965 
299.384 42.75 299.177 c 42.535 298.97 42.184 298.423 41.988 297.654 c 41.793
 296.888 41.777 296.822 41.68 296.665 c 41.582 296.513 41.555 296.435 41.441
 296.408 c 41.324 296.384 41.207 296.357 41 296.365 c 40.793 296.369 40.73
 296.369 40.621 296.408 c 40.512 296.447 40.441 296.466 40.418 296.427 c
 40.391 296.384 40.379 296.251 40.492 296.201 c 40.605 296.146 40.594 296.158
 40.641 296.083 c 40.684 296.009 40.754 295.939 40.895 295.853 c 41.035 
295.771 41.094 295.755 41.191 295.747 c 41.289 295.74 41.277 295.74 41.324
 295.661 c 41.367 295.583 41.402 295.517 41.535 295.427 c 41.664 295.337
 41.75 295.326 41.816 295.388 c 41.887 295.454 41.938 295.556 41.941 295.74
 c 41.949 295.919 41.953 296.005 42.016 296.095 c 42.074 296.185 42.215 
296.505 42.352 296.802 c 42.492 297.099 42.574 297.267 42.793 297.513 c 
43.012 297.759 43.227 297.896 43.363 298.259 c 43.5 298.619 43.5 298.693
 43.621 298.841 c 43.738 298.986 43.766 299.048 43.816 299.15 c 43.867 299.251
 43.906 299.283 44.074 299.47 c 44.184 299.587 44.328 299.767 44.453 299.939
 c 44.387 300.384 44.34 300.833 44.312 301.31 c h
50.992 296.408 m 50.883 296.369 50.816 296.369 50.609 296.365 c 50.406 
296.357 50.289 296.384 50.172 296.408 c 50.055 296.435 50.031 296.513 49.934
 296.665 c 49.836 296.822 49.816 296.888 49.625 297.654 c 49.43 298.423 
49.074 298.97 48.863 299.177 c 48.648 299.384 48.656 299.384 48.469 299.712
 c 48.281 300.044 48.195 300.244 48.035 300.81 c 47.875 301.38 47.637 301.826
 47.438 302.185 c 47.367 302.31 47.316 302.404 47.281 302.482 c 47.324 302.185
 47.328 301.81 47.301 301.31 c 47.273 300.833 47.227 300.384 47.16 299.939
 c 47.281 299.767 47.43 299.587 47.535 299.47 c 47.703 299.283 47.742 299.251
 47.797 299.15 c 47.848 299.048 47.871 298.986 47.992 298.841 c 48.113 298.693
 48.113 298.619 48.25 298.259 c 48.383 297.896 48.602 297.759 48.82 297.513
 c 49.039 297.267 49.121 297.099 49.258 296.802 c 49.398 296.505 49.535 
296.185 49.598 296.095 c 49.66 296.005 49.664 295.919 49.668 295.74 c 49.676
 295.556 49.727 295.454 49.793 295.388 c 49.863 295.326 49.945 295.337 50.078
 295.427 c 50.211 295.517 50.242 295.583 50.289 295.661 c 50.332 295.74 
50.324 295.74 50.422 295.747 c 50.516 295.759 50.574 295.771 50.719 295.853
 c 50.859 295.939 50.926 296.009 50.973 296.083 c 51.02 296.158 51.008 296.146
 51.121 296.201 c 51.234 296.251 51.223 296.384 51.195 296.427 c 51.168 
296.466 51.102 296.447 50.992 296.408 c h
50.992 296.408 m f
53.227 309.22 m 53.227 294.38 l 38.387 294.38 l 38.387 309.22 l 53.227 
309.22 l 53.672 309.665 m 37.941 309.665 l 37.941 293.935 l 53.672 293.935
 l h
53.672 309.665 m f
0 g
135.832 277.99 m 144.176 269.65 l 135.836 261.31 l 139.461 257.681 l 151.434
 269.65 l 147.801 273.279 l 139.461 281.619 l h
135.832 277.99 m f
149.402 257.681 m 161.375 269.65 l 157.746 273.279 l 149.402 281.619 l 
145.773 277.99 l 154.117 269.65 l 145.777 261.31 l h
149.402 257.681 m f
125.062 269.65 m 133.402 261.31 l 129.773 257.681 l 117.805 269.65 l 129.773
 281.619 l 133.402 277.99 l h
125.062 269.65 m f
107.863 269.65 m 119.832 281.619 l 123.461 277.99 l 115.121 269.65 l 123.461
 261.31 l 119.832 257.681 l h
107.863 269.65 m f
217.82 294.064 m 217.828 293.997 217.832 293.935 217.84 293.869 c 218.273
 288.954 221.148 285.158 224.633 285.158 c 228.16 285.158 231.062 289.052
 231.441 294.06 c 231.492 294.419 231.52 294.79 231.52 295.165 c 231.52 
295.54 231.492 295.908 231.441 296.267 c 230.938 299.747 228.078 302.415
 224.633 302.415 c 221.184 302.415 218.324 299.747 217.824 296.263 c 217.77
 295.908 217.746 295.536 217.746 295.165 c 217.746 295.013 217.75 294.861
 217.758 294.712 c 217.77 294.494 217.793 294.279 217.82 294.064 c h
220.383 297.974 m 220.383 297.974 225.141 295.658 228.344 297.974 c 228.344
 297.974 230.242 294.966 229.711 293.786 c 230.676 294.896 l 230.672 294.603
 230.648 294.314 230.609 294.029 c 230.281 289.634 227.73 286.212 224.633
 286.212 c 221.586 286.212 219.066 289.525 218.672 293.818 c 218.941 293.747
 219.27 293.619 219.625 293.369 c 219.625 293.369 218.945 297.408 220.383
 297.974 c h
220.383 297.974 m f
230.941 286.185 m 230.664 286.236 230.383 286.275 230.098 286.302 c 230.098
 286.29 230.094 286.279 230.094 286.263 c 230.09 286.232 230.086 286.201
 230.082 286.161 c 230.082 286.165 230.082 286.165 230.082 286.169 c 230.082
 286.165 230.082 286.165 230.082 286.161 c 230.062 286.005 230.023 285.849
 229.969 285.701 c 230.027 285.849 230.062 286.005 230.082 286.161 c 230.047
 285.951 229.945 285.677 229.793 285.357 c 229.004 283.685 226.84 280.763
 225.5 279.021 c 225.246 282.65 l 225.594 282.829 225.891 283.115 226.098
 283.451 c 226.266 283.724 226.367 284.033 226.367 284.349 c 226.367 284.349
 225.426 283.931 224.469 283.931 c 223.508 283.931 222.57 284.349 222.57
 284.349 c 222.57 284.056 222.656 283.771 222.805 283.513 c 223.008 283.15
 223.324 282.841 223.691 282.65 c 223.434 278.927 l 222.172 280.72 220.031
 283.876 219.371 285.54 c 219.367 285.54 l 219.273 285.775 219.211 285.982
 219.184 286.15 c 219.18 286.189 219.172 286.228 219.172 286.263 c 219.172
 286.275 219.168 286.29 219.168 286.302 c 219.031 286.29 218.898 286.275
 218.766 286.255 c 218.758 286.255 218.75 286.255 218.742 286.251 c 214.363
 285.642 210.996 281.884 210.996 277.337 c 210.996 272.365 215.027 272.376
 220 272.376 c 229.27 272.376 l 234.242 272.376 238.273 272.365 238.273 
277.337 c 238.27 281.74 235.113 285.4 230.941 286.185 c h
230.941 286.185 m f
256.617 262.134 m 256.617 262.372 256.426 262.56 256.191 262.56 c 224.617
 262.56 l 224.617 269.642 l 224.617 269.669 224.426 269.697 224.191 269.697
 c 223.957 269.697 223.766 269.673 223.766 269.642 c 223.766 262.56 l 193.156
 262.56 l 192.918 262.56 192.73 262.369 192.73 262.134 c 192.73 262.119 
192.738 262.103 192.738 262.087 c 192.734 262.083 192.73 262.083 192.73 
262.079 c 192.73 254.204 l 192.73 254.173 192.922 254.146 193.156 254.146
 c 193.391 254.146 193.578 254.173 193.578 254.204 c 193.578 261.708 l 255.766
 261.708 l 255.766 254.204 l 255.766 254.173 255.957 254.146 256.191 254.146
 c 256.43 254.146 256.617 254.173 256.617 254.204 c 256.617 262.079 l 256.617
 262.083 256.609 262.083 256.605 262.087 c 256.609 262.103 256.617 262.119
 256.617 262.134 c h
256.617 262.134 m f
263.215 234.158 m 264.691 233.994 265.988 233.736 265.988 233.736 c 263.043
 235.357 263.117 241.173 263.117 241.173 c 263.633 252.443 256.199 251.849
 256.199 251.849 c 256.191 251.833 l 256.188 251.849 l 256.188 251.849 248.75
 252.439 249.27 241.173 c 249.27 241.173 249.344 235.357 246.395 233.736
 c 246.395 233.736 247.188 233.79 248.25 233.81 c 245.242 232.47 243.148
 229.451 243.148 225.947 c 243.148 221.189 247.004 222.033 251.758 222.033
 c 260.625 222.033 l 265.383 222.033 269.238 221.189 269.238 225.947 c 269.238
 229.798 266.707 233.056 263.215 234.158 c h
258.184 231.9 m 256.191 228.661 l 254.199 231.9 l 252.754 232.228 251.637
 232.904 251.184 233.736 c 252.352 233.634 253.344 233.419 253.598 233.001
 c 252.5 235.447 l 253.551 234.396 254.82 233.783 256.191 233.783 c 257.531
 233.783 258.773 234.369 259.809 235.376 c 259.047 233.783 l 259.301 234.204
 260.266 234.318 261.398 234.29 c 261.219 233.208 259.941 232.298 258.184
 231.9 c h
261.91 242.267 m 261.797 240.775 261.418 239.4 260.844 238.251 c 259.797
 236.154 258.105 234.79 256.191 234.79 c 253.277 234.79 250.867 237.958 
250.492 242.064 c 250.492 242.064 252.793 242.447 254.168 242.986 c 254.168
 242.986 256.656 243.818 259.699 246.009 c 259.715 246.021 259.727 246.029
 259.742 246.04 c 259.742 246.04 259.797 245.962 259.875 245.829 c 260.141
 245.376 260.703 244.029 259.637 243.411 c 261.582 243.165 l 261.617 243.165
 l 261.977 243.099 l 261.969 242.818 261.949 242.54 261.91 242.267 c h
261.91 242.267 m f
0.980392 0.411765 0 rg
203.645 237.544 m 205.117 247.646 199.262 251.919 192.688 251.919 c 186.113
 251.919 180.07 247.681 181.703 237.572 c 180.766 236.806 180.164 235.478
 180.164 233.884 c 180.164 231.755 182.203 229.927 183.785 229.345 c 185.266
 224.419 190.66 222.318 192.688 222.318 c 194.703 222.318 200.078 224.408
 201.574 229.302 c 203.332 229.861 205.207 231.857 205.207 233.884 c 205.207
 235.419 204.582 236.763 203.645 237.544 c h
192.688 231.064 m 191.855 231.064 191.184 231.736 191.184 232.564 c 191.184
 233.396 191.855 234.068 192.688 234.068 c 193.516 234.068 194.188 233.396
 194.188 232.564 c 194.188 231.736 193.516 231.064 192.688 231.064 c h
193.84 235.927 m 191.457 235.927 l 191.457 239.181 194.301 239.451 194.301
 241.138 c 194.301 242.208 193.594 242.794 192.734 242.794 c 191.602 242.794
 190.84 242.361 190.84 240.497 c 188.133 240.497 l 188.133 243.576 190.391
 245.126 192.723 245.126 c 195.461 245.126 197.293 243.665 197.293 241.396
 c 197.293 238.15 193.84 238.595 193.84 235.927 c h
193.84 235.927 m f
380.227 45.841 m 381.656 56.665 377.262 69.634 364.293 75.454 c 354.039
 80.06 335.938 80.052 326.391 71.349 c 318.062 63.755 316.188 52.982 316.188
 52.982 c 316.188 52.982 315.328 48.978 315.328 47.65 c 315.328 46.376 316.758
 45.876 316.594 45.224 c 316.43 44.572 314.828 42.704 313.605 40.661 c 312.379
 38.622 309.25 34.083 309.25 32.861 c 309.25 31.638 309.98 31.185 311.453
 30.693 c 312.922 30.204 314.062 29.794 314.309 29.224 c 314.555 28.654 
313.609 27.021 313.559 25.857 c 313.516 24.865 313.879 24.755 314.621 24.466
 c 315.543 24.107 316.961 24.06 316.961 24.06 c 316.961 24.06 313.805 23.462
 314.121 22.173 c 314.445 20.833 316.344 20.56 316.512 19.513 c 316.598 
18.982 314.906 16.267 315.129 13.626 c 315.422 10.181 318.684 8.638 323.859
 9.47 c 328.793 10.263 331.113 10.997 331.75 8.279 c 332.148 6.564 332.105
 3.673 332.84 0.408 c 332.871 0.279 332.902 0.138 332.93 0.001 c 370.793
 0.001 l 369.172 2.951 367.043 7.689 367.043 13.716 c 367.043 17.849 367.457
 23.99 370.422 27.255 c 374.141 31.345 379.078 37.142 380.227 45.841 c h
364.594 37.259 m 364.594 37.259 364.098 31.845 360.121 31.15 c 356.719 
30.556 354.457 33.833 354.457 33.833 c 353.34 28.544 l 350.957 28.544 l 
350.957 28.544 348.797 36.517 347.305 37.857 c 345.812 39.201 343.504 39.572
 343.504 39.572 c 343.504 39.572 340.375 39.794 338.359 41.806 c 336.348
 43.818 338.211 46.279 338.211 46.279 c 338.211 46.279 335.68 46.13 330.535
 47.247 c 325.395 48.365 326.961 51.646 326.961 51.646 c 326.961 51.646 
325.617 51.419 324.5 52.837 c 323.707 53.841 323.125 56.302 324.574 59.169
 c 325.871 61.736 328.148 62.63 328.148 62.63 c 328.148 62.63 327.305 63.701
 329.086 65.193 c 330.012 65.974 331.652 65.951 331.652 65.951 c 331.652
 65.951 332.055 67.673 334.523 68.79 c 337.32 70.052 339.18 69.005 339.18
 69.005 c 339.18 69.005 339.93 70.646 342.09 71.388 c 344.25 72.134 346.41
 70.869 346.41 70.869 c 346.41 70.869 347.871 72.193 350.555 72.193 c 353.238
 72.193 354.234 70.794 354.234 70.794 c 354.234 70.794 355.852 71.626 357.812
 70.947 c 359.664 70.302 360.199 68.505 360.199 68.505 c 360.199 68.505 
361.539 69.454 363.402 68.708 c 365.266 67.962 366.012 65.951 366.012 65.951
 c 366.012 65.951 367.293 66.138 368.57 65.005 c 369.52 64.161 369.215 62.599
 369.215 62.599 c 369.215 62.599 370.793 62.072 371.738 60.181 c 372.621
 58.419 371.375 56.935 371.375 56.935 c 371.375 56.935 373.984 54.997 374.355
 49.927 c 374.809 43.747 370.855 42.552 370.855 42.552 c 370.855 42.552 
371.637 40.591 370.258 38.454 c 368.379 35.544 364.594 37.259 364.594 37.259
 c h
364.594 37.259 m f
0 g
4 w
1 J
1 j
[] 0.0 d
4 M q 1 0 0 -1 0 317.325562 cm
166.836 104.918 m 527.574 104.918 l 537.465 104.918 545.43 112.883 545.43
 122.773 c 545.43 212.066 l 545.43 221.961 537.465 229.926 527.574 229.926
 c 166.836 229.926 l 156.941 229.926 148.977 221.961 148.977 212.066 c 148.977
 122.773 l 148.977 112.883 156.941 104.918 166.836 104.918 c h
166.836 104.918 m S Q
Q Q
showpage
%%Trailer
end restore
%%EOF
