%!PS-Adobe-3.0 EPSF-3.0
%%Creator: cairo 1.14.2 (http://cairographics.org)
%%CreationDate: Wed Apr 29 20:38:10 2015
%%Pages: 1
%%DocumentData: Clean7Bit
%%LanguageLevel: 2
%%BoundingBox: 26 13 54 67
%%EndComments
%%BeginProlog
save
50 dict begin
/q { gsave } bind def
/Q { grestore } bind def
/cm { 6 array astore concat } bind def
/w { setlinewidth } bind def
/J { setlinecap } bind def
/j { setlinejoin } bind def
/M { setmiterlimit } bind def
/d { setdash } bind def
/m { moveto } bind def
/l { lineto } bind def
/c { curveto } bind def
/h { closepath } bind def
/re { exch dup neg 3 1 roll 5 3 roll moveto 0 rlineto
      0 exch rlineto 0 rlineto closepath } bind def
/S { stroke } bind def
/f { fill } bind def
/f* { eofill } bind def
/n { newpath } bind def
/W { clip } bind def
/W* { eoclip } bind def
/BT { } bind def
/ET { } bind def
/pdfmark where { pop globaldict /?pdfmark /exec load put }
    { globaldict begin /?pdfmark /pop load def /pdfmark
    /cleartomark load def end } ifelse
/BDC { mark 3 1 roll /BDC pdfmark } bind def
/EMC { mark /EMC pdfmark } bind def
/cairo_store_point { /cairo_point_y exch def /cairo_point_x exch def } def
/Tj { show currentpoint cairo_store_point } bind def
/TJ {
  {
    dup
    type /stringtype eq
    { show } { -0.001 mul 0 cairo_font_matrix dtransform rmoveto } ifelse
  } forall
  currentpoint cairo_store_point
} bind def
/cairo_selectfont { cairo_font_matrix aload pop pop pop 0 0 6 array astore
    cairo_font exch selectfont cairo_point_x cairo_point_y moveto } bind def
/Tf { pop /cairo_font exch def /cairo_font_matrix where
      { pop cairo_selectfont } if } bind def
/Td { matrix translate cairo_font_matrix matrix concatmatrix dup
      /cairo_font_matrix exch def dup 4 get exch 5 get cairo_store_point
      /cairo_font where { pop cairo_selectfont } if } bind def
/Tm { 2 copy 8 2 roll 6 array astore /cairo_font_matrix exch def
      cairo_store_point /cairo_font where { pop cairo_selectfont } if } bind def
/g { setgray } bind def
/rg { setrgbcolor } bind def
/d1 { setcachedevice } bind def
%%EndProlog
%%BeginSetup
%%EndSetup
%%Page: 1 1
%%BeginPageSetup
%%PageBoundingBox: 26 13 54 67
%%EndPageSetup
q 26 13 28 54 rectclip q
0 g
48.633 63.652 m 45.273 63.652 l 45.273 64.445 l 45.273 65.828 44.152 66.949
 42.77 66.949 c 37.105 66.949 l 35.723 66.949 34.602 65.828 34.602 64.445
 c 34.602 63.652 l 31.367 63.652 l 28.602 63.652 26.359 61.41 26.359 58.645
 c 26.359 18.059 l 26.359 15.293 28.602 13.051 31.367 13.051 c 48.633 13.051
 l 51.398 13.051 53.641 15.293 53.641 18.059 c 53.641 58.645 l 53.641 61.41
 51.398 63.652 48.633 63.652 c h
48.344 18.352 m 31.66 18.352 l 31.66 58.352 l 48.344 58.352 l h
48.344 18.352 m f
33.34 52.164 m 33.34 20.031 l 46.66 20.031 l 46.66 52.164 l h
43.445 35.516 m 40.492 30.426 l 40.293 30.078 39.926 29.879 39.543 29.879
 c 39.406 29.879 39.266 29.902 39.133 29.957 c 38.625 30.164 38.348 30.711
 38.48 31.242 c 39.586 35.672 l 36.996 36.324 l 36.656 36.406 36.379 36.648
 36.246 36.969 c 36.117 37.289 36.145 37.652 36.32 37.953 c 39.352 42.988
 l 39.625 43.441 40.184 43.637 40.684 43.449 c 41.176 43.262 41.469 42.746
 41.371 42.223 c 40.535 37.695 l 42.766 37.133 l 43.102 37.051 43.375 36.812
 43.508 36.496 c 43.645 36.176 43.621 35.816 43.445 35.516 c h
43.445 35.516 m f
Q Q
showpage
%%Trailer
end restore
%%EOF
