%!PS-Adobe-3.0 EPSF-3.0
%%Creator: cairo 1.14.2 (http://cairographics.org)
%%CreationDate: Tue May  5 11:24:47 2015
%%Pages: 1
%%DocumentData: Clean7Bit
%%LanguageLevel: 2
%%BoundingBox: 0 -1 243 168
%%EndComments
%%BeginProlog
save
50 dict begin
/q { gsave } bind def
/Q { grestore } bind def
/cm { 6 array astore concat } bind def
/w { setlinewidth } bind def
/J { setlinecap } bind def
/j { setlinejoin } bind def
/M { setmiterlimit } bind def
/d { setdash } bind def
/m { moveto } bind def
/l { lineto } bind def
/c { curveto } bind def
/h { closepath } bind def
/re { exch dup neg 3 1 roll 5 3 roll moveto 0 rlineto
      0 exch rlineto 0 rlineto closepath } bind def
/S { stroke } bind def
/f { fill } bind def
/f* { eofill } bind def
/n { newpath } bind def
/W { clip } bind def
/W* { eoclip } bind def
/BT { } bind def
/ET { } bind def
/pdfmark where { pop globaldict /?pdfmark /exec load put }
    { globaldict begin /?pdfmark /pop load def /pdfmark
    /cleartomark load def end } ifelse
/BDC { mark 3 1 roll /BDC pdfmark } bind def
/EMC { mark /EMC pdfmark } bind def
/cairo_store_point { /cairo_point_y exch def /cairo_point_x exch def } def
/Tj { show currentpoint cairo_store_point } bind def
/TJ {
  {
    dup
    type /stringtype eq
    { show } { -0.001 mul 0 cairo_font_matrix dtransform rmoveto } ifelse
  } forall
  currentpoint cairo_store_point
} bind def
/cairo_selectfont { cairo_font_matrix aload pop pop pop 0 0 6 array astore
    cairo_font exch selectfont cairo_point_x cairo_point_y moveto } bind def
/Tf { pop /cairo_font exch def /cairo_font_matrix where
      { pop cairo_selectfont } if } bind def
/Td { matrix translate cairo_font_matrix matrix concatmatrix dup
      /cairo_font_matrix exch def dup 4 get exch 5 get cairo_store_point
      /cairo_font where { pop cairo_selectfont } if } bind def
/Tm { 2 copy 8 2 roll 6 array astore /cairo_font_matrix exch def
      cairo_store_point /cairo_font where { pop cairo_selectfont } if } bind def
/g { setgray } bind def
/rg { setrgbcolor } bind def
/d1 { setcachedevice } bind def
%%EndProlog
%%BeginSetup
%%EndSetup
%%Page: 1 1
%%BeginPageSetup
%%PageBoundingBox: 0 -1 243 168
%%EndPageSetup
q 0 -1 243 169 rectclip q
0 g
1.975309 w
1 J
1 j
[] 0.0 d
10 M q 1 0 0 -1 0 167.889664 cm
41.035 77.098 m 41.035 74.266 38.73 71.895 35.836 71.895 c S Q
q 1 0 0 -1 0 167.889664 cm
45.383 77.098 m 45.383 71.832 41.102 67.551 35.836 67.551 c S Q
q 1 0 0 -1 0 167.889664 cm
157.84 132.992 m 157.84 130.16 155.535 127.793 152.637 127.793 c S Q
q 1 0 0 -1 0 167.889664 cm
162.184 132.992 m 162.184 127.727 157.906 123.445 152.637 123.445 c S Q
q 1 0 0 -1 0 167.889664 cm
237.461 10.535 m 237.461 7.703 235.156 5.332 232.258 5.332 c S Q
q 1 0 0 -1 0 167.889664 cm
241.805 10.535 m 241.805 5.27 237.523 0.988 232.258 0.988 c S Q
0.8 w
0 J
0 j
4 M q 1 0 0 -1 0 167.889664 cm
62.145 77.109 m 190.109 32.488 l S Q
q 1 0 0 -1 0 167.889664 cm
62.145 111.625 m 105.922 137.723 l S Q
q 1 0 0 -1 0 167.889664 cm
172.43 116.676 m 214.523 54.375 l S Q
0.980392 0.411765 0 rg
56 82.616 m 51.555 82.378 l 50.547 82.378 l 50.547 82.616 l 49.719 82.616
 l 49.719 82.319 l 48.711 82.319 l 44.266 82.616 l 43.91 82.616 43.613 82.319
 43.613 81.964 c 43.613 81.608 43.91 81.312 44.266 81.312 c 48.828 81.55
 l 49.719 81.55 l 49.719 79.355 l 49.066 79.355 l 49.066 77.874 l 38.281
 77.874 l 38.281 77.933 l 38.281 77.995 38.281 78.054 38.223 78.112 c 38.164
 78.23 38.105 78.288 38.043 78.409 c 37.984 78.468 37.984 78.526 37.926 
78.585 c 37.75 78.765 l 37.688 78.823 37.57 78.882 37.512 78.94 c 37.453
 78.999 37.395 78.999 37.332 78.999 c 37.215 79.062 37.098 79.12 36.977 
79.12 c 36.801 79.179 36.621 79.179 36.387 79.179 c 32.652 79.179 l 32.117
 79.651 30.34 80.007 28.207 80.007 c 26.074 80.007 24.297 79.651 23.762 
79.179 c 20.031 79.179 l 19.852 79.179 19.613 79.179 19.438 79.12 c 19.32
 79.12 19.258 79.062 19.199 78.999 c 19.082 78.94 19.023 78.94 18.902 78.882
 c 18.844 78.823 18.785 78.765 18.668 78.706 c 18.605 78.644 18.488 78.585
 18.43 78.526 c 18.371 78.468 18.371 78.409 18.312 78.351 c 18.25 78.288
 18.191 78.171 18.133 78.054 c 18.074 77.995 18.074 77.933 18.074 77.815
 c 7.586 77.815 l 7.586 79.296 l 6.875 79.296 l 6.875 81.491 l 7.762 81.491
 l 12.324 81.253 l 12.68 81.253 12.977 81.55 12.977 81.905 c 12.977 82.261
 12.68 82.558 12.324 82.558 c 7.883 82.319 l 6.875 82.319 l 6.875 82.616
 l 6.043 82.616 l 6.043 82.319 l 5.035 82.319 l 0.652 82.616 l 0.297 82.616
 0 82.319 0 81.964 c 0 81.608 0.297 81.312 0.652 81.312 c 5.215 81.55 l 
6.105 81.55 l 6.105 79.355 l 5.395 79.355 l 5.395 75.8 l 7.586 75.8 l 7.586
 76.69 l 17.957 76.69 l 17.957 76.632 17.957 76.511 18.016 76.394 c 18.016
 76.335 18.074 76.214 18.133 76.155 c 18.191 76.038 18.191 75.98 18.25 75.921
 c 18.785 75.21 l 16.18 72.425 15.883 72.007 15.883 68.569 c 15.883 66.261
 16.535 64.069 17.66 62.706 c 17.777 62.526 18.016 62.468 18.191 62.468 
c 18.371 62.468 18.488 62.526 18.668 62.644 c 18.965 62.882 19.023 63.355
 18.785 63.651 c 17.895 64.718 17.363 66.616 17.363 68.632 c 17.363 71.417
 17.422 71.593 19.676 74.022 c 20.387 73.015 l 20.801 72.483 21.395 72.128
 22.105 72.128 c 22.992 72.128 l 23.109 72.483 23.289 72.78 23.586 73.073
 c 24.355 73.964 25.777 74.558 27.438 74.675 c 27.438 73.964 l 25.957 73.667
 24.828 72.601 24.828 71.355 c 24.828 69.874 26.312 68.69 28.148 68.69 c
 29.984 68.69 31.465 69.874 31.465 71.355 c 31.465 72.659 30.34 73.726 28.918
 73.964 c 28.918 74.675 l 30.578 74.558 32 73.905 32.77 73.073 c 33.008 
72.78 33.246 72.483 33.305 72.128 c 34.25 72.128 l 34.902 72.128 35.555 
72.425 35.969 73.015 c 36.621 73.905 l 38.875 71.476 38.875 71.296 38.875
 68.569 c 38.875 66.558 38.34 64.718 37.453 63.593 c 37.215 63.296 37.273
 62.823 37.57 62.585 c 37.688 62.468 37.867 62.409 38.043 62.409 c 38.223
 62.409 38.461 62.468 38.578 62.644 c 39.645 64.007 40.297 66.202 40.297
 68.511 c 40.297 71.89 39.941 72.304 37.453 75.03 c 38.043 75.858 l 38.105
 75.98 38.164 76.038 38.164 76.155 c 38.223 76.214 38.223 76.276 38.281 
76.394 c 38.34 76.511 38.34 76.569 38.34 76.69 c 49.008 76.69 l 49.008 75.8
 l 51.258 75.8 l 51.258 79.355 l 50.488 79.355 l 50.488 81.55 l 51.379 81.55
 l 55.941 81.312 l 56.297 81.312 56.594 81.608 56.594 81.964 c 56.652 82.319
 56.355 82.616 56 82.616 c h
29.57 72.601 m 29.809 72.601 30.043 72.362 30.043 72.128 c 30.043 71.89
 29.867 71.651 29.57 71.651 c 29.332 71.651 29.098 71.831 29.098 72.128 
c 29.098 72.425 29.332 72.601 29.57 72.601 c h
27.613 70.054 m 26.902 70.054 26.371 70.644 26.371 71.296 c 26.371 72.007
 26.965 72.542 27.613 72.542 c 28.324 72.542 28.859 71.948 28.859 71.296
 c 28.859 70.644 28.266 70.054 27.613 70.054 c h
27.613 70.054 m f
0.411765 0.823529 0.905882 rg
158.141 5.464 m 153.07 13.433 l 153.07 16.593 153.137 29.499 153.137 29.499
 c 153.137 31.671 151.359 33.448 149.188 33.448 c 127.656 33.448 l 125.48
 33.448 123.703 31.671 123.703 29.499 c 123.703 29.499 123.77 16.593 123.77
 13.433 c 118.633 5.464 l 117.844 4.542 117.648 3.226 118.109 2.042 c 118.633
 0.792 119.82 -0.001 121.137 -0.001 c 155.641 -0.001 l 156.957 -0.001 158.141
 0.792 158.668 2.042 c 159.129 3.226 158.93 4.542 158.141 5.464 c h
149.188 29.499 m 149.188 29.499 149.121 17.647 149.121 13.894 c 127.656
 13.894 l 127.656 17.647 127.59 29.499 127.59 29.499 c h
122.387 4.015 m 127.129 11.456 l 127.195 11.522 l 127.457 11.983 l 149.449
 11.983 l 149.711 11.522 l 149.711 11.522 149.711 11.456 149.777 11.456 
c 154.52 4.015 l h
122.387 4.015 m f
0.952941 0.52549 0.188235 rg
230.246 126.476 m 203.34 126.476 l 202.945 126.476 202.621 126.8 202.621
 127.194 c 202.621 127.55 l 202.621 127.944 202.945 128.269 203.34 128.269
 c 203.59 128.269 203.84 128.124 203.949 127.909 c 229.922 127.909 l 230.566
 128.558 l 230.566 142.69 l 229.707 143.55 l 229.598 143.694 229.527 143.874
 229.527 144.054 c 229.527 148.358 l 204.055 148.358 l 204.055 146.206 l
 204.055 145.812 203.734 145.487 203.34 145.487 c 202.945 145.487 202.621
 145.812 202.621 146.206 c 202.621 149.077 l 202.621 149.472 202.945 149.792
 203.34 149.792 c 230.246 149.792 l 230.641 149.792 230.961 149.472 230.961
 149.077 c 230.961 144.339 l 231.824 143.48 l 231.965 143.335 232.039 143.155
 232.039 142.976 c 232.039 128.269 l 232.039 128.089 231.965 127.909 231.824
 127.769 c 230.746 126.69 l 230.602 126.546 230.422 126.476 230.246 126.476
 c h
230.246 126.476 m f
203.34 132.933 m 202.945 132.933 202.621 133.257 202.621 133.651 c 202.621
 139.03 l 202.621 139.425 202.945 139.749 203.34 139.749 c 203.734 139.749
 204.055 139.425 204.055 139.03 c 204.055 133.651 l 204.055 133.257 203.734
 132.933 203.34 132.933 c h
203.34 132.933 m f
206.031 140.108 m 200.289 140.108 l 200.004 140.108 199.75 140.358 199.75
 140.644 c 199.75 144.593 l 199.75 144.878 200.004 145.128 200.289 145.128
 c 206.031 145.128 l 206.316 145.128 206.566 144.878 206.566 144.593 c 206.566
 140.644 l 206.566 140.358 206.316 140.108 206.031 140.108 c h
206.031 140.108 m f
207.105 128.628 m 202.082 128.628 l 201.797 128.628 201.547 128.878 201.547
 129.167 c 201.547 132.034 l 201.547 132.323 201.797 132.573 202.082 132.573
 c 207.105 132.573 l 207.395 132.573 207.645 132.323 207.645 132.034 c 207.645
 129.167 l 207.645 128.878 207.395 128.628 207.105 128.628 c h
207.105 128.628 m f
215.535 136.163 m 215.32 136.163 215.176 136.019 215.176 135.804 c 215.176
 135.444 l 215.895 135.444 l 215.895 135.804 l 215.895 136.019 215.75 136.163
 215.535 136.163 c h
215.535 136.163 m f
214.461 136.163 m 214.246 136.163 214.102 136.019 214.102 135.804 c 214.102
 135.444 l 214.82 135.444 l 214.82 135.804 l 214.82 136.019 214.676 136.163
 214.461 136.163 c h
214.461 136.163 m f
216.613 136.163 m 216.398 136.163 216.254 136.019 216.254 135.804 c 216.254
 135.444 l 216.973 135.444 l 216.973 135.804 l 216.973 136.019 216.828 136.163
 216.613 136.163 c h
216.613 136.163 m f
217.688 136.163 m 217.473 136.163 217.328 136.019 217.328 135.804 c 217.328
 135.444 l 218.047 135.444 l 218.047 135.804 l 218.047 136.019 217.902 136.163
 217.688 136.163 c h
217.688 136.163 m f
218.766 136.163 m 218.551 136.163 218.406 136.019 218.406 135.804 c 218.406
 135.444 l 219.125 135.444 l 219.125 135.804 l 219.125 136.019 218.98 136.163
 218.766 136.163 c h
218.766 136.163 m f
219.84 136.163 m 219.625 136.163 219.48 136.019 219.48 135.804 c 219.48
 135.444 l 220.199 135.444 l 220.199 135.804 l 220.199 136.019 220.055 136.163
 219.84 136.163 c h
219.84 136.163 m f
220.918 136.163 m 220.703 136.163 220.559 136.019 220.559 135.804 c 220.559
 135.444 l 221.277 135.444 l 221.277 135.804 l 221.277 136.019 221.133 136.163
 220.918 136.163 c h
220.918 136.163 m f
221.992 136.163 m 221.777 136.163 221.633 136.019 221.633 135.804 c 221.633
 135.444 l 222.352 135.444 l 222.352 135.804 l 222.352 136.019 222.207 136.163
 221.992 136.163 c h
221.992 136.163 m f
223.07 136.163 m 222.855 136.163 222.711 136.019 222.711 135.804 c 222.711
 135.444 l 223.43 135.444 l 223.43 135.804 l 223.43 136.019 223.285 136.163
 223.07 136.163 c h
223.07 136.163 m f
224.145 136.163 m 223.93 136.163 223.785 136.019 223.785 135.804 c 223.785
 135.444 l 224.504 135.444 l 224.504 135.804 l 224.504 136.019 224.359 136.163
 224.145 136.163 c h
224.145 136.163 m f
225.223 136.163 m 225.008 136.163 224.863 136.019 224.863 135.804 c 224.863
 135.444 l 225.582 135.444 l 225.582 135.804 l 225.582 136.019 225.438 136.163
 225.223 136.163 c h
225.223 136.163 m f
226.297 136.163 m 226.082 136.163 225.938 136.019 225.938 135.804 c 225.938
 135.444 l 226.656 135.444 l 226.656 135.804 l 226.656 136.019 226.512 136.163
 226.297 136.163 c h
226.297 136.163 m f
227.375 136.163 m 227.16 136.163 227.016 136.019 227.016 135.804 c 227.016
 135.444 l 227.734 135.444 l 227.734 135.804 l 227.734 136.019 227.59 136.163
 227.375 136.163 c h
227.375 136.163 m f
228.449 136.163 m 228.234 136.163 228.094 136.019 228.094 135.804 c 228.094
 135.444 l 228.809 135.444 l 228.809 135.804 l 228.809 136.019 228.664 136.163
 228.449 136.163 c h
228.449 136.163 m f
227.375 130.78 m 227.59 130.78 227.734 130.925 227.734 131.14 c 227.734
 131.499 l 227.016 131.499 l 227.016 131.14 l 227.016 130.925 227.16 130.78
 227.375 130.78 c h
227.375 130.78 m f
228.449 130.78 m 228.664 130.78 228.809 130.925 228.809 131.14 c 228.809
 131.499 l 228.094 131.499 l 228.094 131.14 l 228.094 130.925 228.234 130.78
 228.449 130.78 c h
228.449 130.78 m f
226.297 130.78 m 226.512 130.78 226.656 130.925 226.656 131.14 c 226.656
 131.499 l 225.938 131.499 l 225.938 131.14 l 225.938 130.925 226.082 130.78
 226.297 130.78 c h
226.297 130.78 m f
225.223 130.78 m 225.438 130.78 225.582 130.925 225.582 131.14 c 225.582
 131.499 l 224.863 131.499 l 224.863 131.14 l 224.863 130.925 225.008 130.78
 225.223 130.78 c h
225.223 130.78 m f
224.145 130.78 m 224.359 130.78 224.504 130.925 224.504 131.14 c 224.504
 131.499 l 223.785 131.499 l 223.785 131.14 l 223.785 130.925 223.93 130.78
 224.145 130.78 c h
224.145 130.78 m f
223.07 130.78 m 223.285 130.78 223.43 130.925 223.43 131.14 c 223.43 131.499
 l 222.711 131.499 l 222.711 131.14 l 222.711 130.925 222.855 130.78 223.07
 130.78 c h
223.07 130.78 m f
221.992 130.78 m 222.207 130.78 222.352 130.925 222.352 131.14 c 222.352
 131.499 l 221.633 131.499 l 221.633 131.14 l 221.633 130.925 221.777 130.78
 221.992 130.78 c h
221.992 130.78 m f
220.918 130.78 m 221.133 130.78 221.277 130.925 221.277 131.14 c 221.277
 131.499 l 220.559 131.499 l 220.559 131.14 l 220.559 130.925 220.703 130.78
 220.918 130.78 c h
220.918 130.78 m f
219.84 130.78 m 220.055 130.78 220.199 130.925 220.199 131.14 c 220.199
 131.499 l 219.48 131.499 l 219.48 131.14 l 219.48 130.925 219.625 130.78
 219.84 130.78 c h
219.84 130.78 m f
218.766 130.78 m 218.98 130.78 219.125 130.925 219.125 131.14 c 219.125
 131.499 l 218.406 131.499 l 218.406 131.14 l 218.406 130.925 218.551 130.78
 218.766 130.78 c h
218.766 130.78 m f
217.688 130.78 m 217.902 130.78 218.047 130.925 218.047 131.14 c 218.047
 131.499 l 217.328 131.499 l 217.328 131.14 l 217.328 130.925 217.473 130.78
 217.688 130.78 c h
217.688 130.78 m f
216.613 130.78 m 216.828 130.78 216.973 130.925 216.973 131.14 c 216.973
 131.499 l 216.254 131.499 l 216.254 131.14 l 216.254 130.925 216.398 130.78
 216.613 130.78 c h
216.613 130.78 m f
215.535 130.78 m 215.75 130.78 215.895 130.925 215.895 131.14 c 215.895
 131.499 l 215.176 131.499 l 215.176 131.14 l 215.176 130.925 215.32 130.78
 215.535 130.78 c h
215.535 130.78 m f
214.461 130.78 m 214.676 130.78 214.82 130.925 214.82 131.14 c 214.82 131.499
 l 214.102 131.499 l 214.102 131.14 l 214.102 130.925 214.246 130.78 214.461
 130.78 c h
214.461 130.78 m f
229.168 135.085 m 213.742 135.085 l 213.527 135.085 213.383 134.94 213.383
 134.726 c 213.383 132.214 l 213.383 131.999 213.527 131.855 213.742 131.855
 c 229.168 131.855 l 229.383 131.855 229.527 131.999 229.527 132.214 c 229.527
 134.726 l 229.527 134.94 229.383 135.085 229.168 135.085 c h
229.168 132.753 m 228.773 132.753 228.449 133.077 228.449 133.472 c 228.449
 133.866 228.773 134.187 229.168 134.187 c h
229.168 132.753 m f
230.234 146.581 m 229.84 146.581 229.52 146.901 229.52 147.296 c 229.52
 152.679 l 229.52 153.073 229.84 153.397 230.234 153.397 c 230.629 153.397
 230.953 153.073 230.953 152.679 c 230.953 147.296 l 230.953 146.901 230.629
 146.581 230.234 146.581 c h
230.234 146.581 m f
210.152 146.878 m 210.051 146.878 209.98 146.644 209.98 146.296 c 209.98
 145.714 l 210.324 145.714 l 210.324 146.296 l 210.324 146.644 210.258 146.878
 210.152 146.878 c h
210.152 146.878 m f
209.637 146.878 m 209.531 146.878 209.461 146.644 209.461 146.296 c 209.461
 145.714 l 209.809 145.714 l 209.809 146.296 l 209.809 146.644 209.738 146.878
 209.637 146.878 c h
209.637 146.878 m f
210.672 146.878 m 210.566 146.878 210.496 146.644 210.496 146.296 c 210.496
 145.714 l 210.844 145.714 l 210.844 146.296 l 210.844 146.644 210.773 146.878
 210.672 146.878 c h
210.672 146.878 m f
211.188 146.878 m 211.086 146.878 211.016 146.644 211.016 146.296 c 211.016
 145.714 l 211.359 145.714 l 211.359 146.296 l 211.359 146.644 211.293 146.878
 211.188 146.878 c h
211.188 146.878 m f
211.707 146.878 m 211.602 146.878 211.531 146.644 211.531 146.296 c 211.531
 145.714 l 211.879 145.714 l 211.879 146.296 l 211.879 146.644 211.809 146.878
 211.707 146.878 c h
211.707 146.878 m f
212.223 146.878 m 212.121 146.878 212.051 146.644 212.051 146.296 c 212.051
 145.714 l 212.395 145.714 l 212.395 146.296 l 212.395 146.644 212.328 146.878
 212.223 146.878 c h
212.223 146.878 m f
212.742 146.878 m 212.637 146.878 212.57 146.644 212.57 146.296 c 212.57
 145.714 l 212.914 145.714 l 212.914 146.296 l 212.914 146.644 212.844 146.878
 212.742 146.878 c h
212.742 146.878 m f
213.258 146.878 m 213.156 146.878 213.086 146.644 213.086 146.296 c 213.086
 145.714 l 213.43 145.714 l 213.43 146.296 l 213.43 146.644 213.363 146.878
 213.258 146.878 c h
213.258 146.878 m f
213.777 146.878 m 213.672 146.878 213.605 146.644 213.605 146.296 c 213.605
 145.714 l 213.949 145.714 l 213.949 146.296 l 213.949 146.644 213.879 146.878
 213.777 146.878 c h
213.777 146.878 m f
214.293 146.878 m 214.191 146.878 214.121 146.644 214.121 146.296 c 214.121
 145.714 l 214.465 145.714 l 214.465 146.296 l 214.465 146.644 214.398 146.878
 214.293 146.878 c h
214.293 146.878 m f
214.812 146.878 m 214.707 146.878 214.641 146.644 214.641 146.296 c 214.641
 145.714 l 214.984 145.714 l 214.984 146.296 l 214.984 146.644 214.914 146.878
 214.812 146.878 c h
214.812 146.878 m f
215.328 146.878 m 215.227 146.878 215.156 146.644 215.156 146.296 c 215.156
 145.714 l 215.5 145.714 l 215.5 146.296 l 215.5 146.644 215.434 146.878
 215.328 146.878 c h
215.328 146.878 m f
215.848 146.878 m 215.742 146.878 215.676 146.644 215.676 146.296 c 215.676
 145.714 l 216.02 145.714 l 216.02 146.296 l 216.02 146.644 215.949 146.878
 215.848 146.878 c h
215.848 146.878 m f
216.363 146.878 m 216.262 146.878 216.191 146.644 216.191 146.296 c 216.191
 145.714 l 216.539 145.714 l 216.539 146.296 l 216.539 146.644 216.469 146.878
 216.363 146.878 c h
216.363 146.878 m f
215.848 138.147 m 215.949 138.147 216.02 138.378 216.02 138.73 c 216.02
 139.312 l 215.676 139.312 l 215.676 138.73 l 215.676 138.378 215.742 138.147
 215.848 138.147 c h
215.848 138.147 m f
216.363 138.147 m 216.469 138.147 216.539 138.378 216.539 138.73 c 216.539
 139.312 l 216.191 139.312 l 216.191 138.73 l 216.191 138.378 216.262 138.147
 216.363 138.147 c h
216.363 138.147 m f
215.328 138.147 m 215.434 138.147 215.5 138.378 215.5 138.73 c 215.5 139.312
 l 215.156 139.312 l 215.156 138.73 l 215.156 138.378 215.227 138.147 215.328
 138.147 c h
215.328 138.147 m f
214.812 138.147 m 214.914 138.147 214.984 138.378 214.984 138.73 c 214.984
 139.312 l 214.641 139.312 l 214.641 138.73 l 214.641 138.378 214.707 138.147
 214.812 138.147 c h
214.812 138.147 m f
214.293 138.147 m 214.398 138.147 214.465 138.378 214.465 138.73 c 214.465
 139.312 l 214.121 139.312 l 214.121 138.73 l 214.121 138.378 214.191 138.147
 214.293 138.147 c h
214.293 138.147 m f
213.777 138.147 m 213.879 138.147 213.949 138.378 213.949 138.73 c 213.949
 139.312 l 213.605 139.312 l 213.605 138.73 l 213.605 138.378 213.672 138.147
 213.777 138.147 c h
213.777 138.147 m f
213.258 138.147 m 213.363 138.147 213.43 138.378 213.43 138.73 c 213.43
 139.312 l 213.086 139.312 l 213.086 138.73 l 213.086 138.378 213.156 138.147
 213.258 138.147 c h
213.258 138.147 m f
212.742 138.147 m 212.844 138.147 212.914 138.378 212.914 138.73 c 212.914
 139.312 l 212.57 139.312 l 212.57 138.73 l 212.57 138.378 212.637 138.147
 212.742 138.147 c h
212.742 138.147 m f
212.223 138.147 m 212.328 138.147 212.395 138.378 212.395 138.73 c 212.395
 139.312 l 212.051 139.312 l 212.051 138.73 l 212.051 138.378 212.121 138.147
 212.223 138.147 c h
212.223 138.147 m f
211.707 138.147 m 211.809 138.147 211.879 138.378 211.879 138.73 c 211.879
 139.312 l 211.531 139.312 l 211.531 138.73 l 211.531 138.378 211.602 138.147
 211.707 138.147 c h
211.707 138.147 m f
211.188 138.147 m 211.293 138.147 211.359 138.378 211.359 138.73 c 211.359
 139.312 l 211.016 139.312 l 211.016 138.73 l 211.016 138.378 211.086 138.147
 211.188 138.147 c h
211.188 138.147 m f
210.672 138.147 m 210.773 138.147 210.844 138.378 210.844 138.73 c 210.844
 139.312 l 210.496 139.312 l 210.496 138.73 l 210.496 138.378 210.566 138.147
 210.672 138.147 c h
210.672 138.147 m f
210.152 138.147 m 210.258 138.147 210.324 138.378 210.324 138.73 c 210.324
 139.312 l 209.98 139.312 l 209.98 138.73 l 209.98 138.378 210.051 138.147
 210.152 138.147 c h
210.152 138.147 m f
209.637 138.147 m 209.738 138.147 209.809 138.378 209.809 138.73 c 209.809
 139.312 l 209.461 139.312 l 209.461 138.73 l 209.461 138.378 209.531 138.147
 209.637 138.147 c h
209.637 138.147 m f
216.711 145.132 m 209.289 145.132 l 209.188 145.132 209.117 144.897 209.117
 144.55 c 209.117 140.476 l 209.117 140.124 209.188 139.894 209.289 139.894
 c 216.711 139.894 l 216.812 139.894 216.883 140.124 216.883 140.476 c 216.883
 144.55 l 216.883 144.897 216.812 145.132 216.711 145.132 c h
216.711 141.347 m 216.52 141.347 216.363 141.87 216.363 142.511 c 216.363
 143.151 216.52 143.675 216.711 143.675 c h
216.711 141.347 m f
Q Q
showpage
%%Trailer
end restore
%%EOF
