%!PS-Adobe-3.0 EPSF-3.0
%%Creator: cairo 1.14.2 (http://cairographics.org)
%%CreationDate: Wed Apr 29 14:16:35 2015
%%Pages: 1
%%DocumentData: Clean7Bit
%%LanguageLevel: 2
%%BoundingBox: 4 0 76 80
%%EndComments
%%BeginProlog
save
50 dict begin
/q { gsave } bind def
/Q { grestore } bind def
/cm { 6 array astore concat } bind def
/w { setlinewidth } bind def
/J { setlinecap } bind def
/j { setlinejoin } bind def
/M { setmiterlimit } bind def
/d { setdash } bind def
/m { moveto } bind def
/l { lineto } bind def
/c { curveto } bind def
/h { closepath } bind def
/re { exch dup neg 3 1 roll 5 3 roll moveto 0 rlineto
      0 exch rlineto 0 rlineto closepath } bind def
/S { stroke } bind def
/f { fill } bind def
/f* { eofill } bind def
/n { newpath } bind def
/W { clip } bind def
/W* { eoclip } bind def
/BT { } bind def
/ET { } bind def
/pdfmark where { pop globaldict /?pdfmark /exec load put }
    { globaldict begin /?pdfmark /pop load def /pdfmark
    /cleartomark load def end } ifelse
/BDC { mark 3 1 roll /BDC pdfmark } bind def
/EMC { mark /EMC pdfmark } bind def
/cairo_store_point { /cairo_point_y exch def /cairo_point_x exch def } def
/Tj { show currentpoint cairo_store_point } bind def
/TJ {
  {
    dup
    type /stringtype eq
    { show } { -0.001 mul 0 cairo_font_matrix dtransform rmoveto } ifelse
  } forall
  currentpoint cairo_store_point
} bind def
/cairo_selectfont { cairo_font_matrix aload pop pop pop 0 0 6 array astore
    cairo_font exch selectfont cairo_point_x cairo_point_y moveto } bind def
/Tf { pop /cairo_font exch def /cairo_font_matrix where
      { pop cairo_selectfont } if } bind def
/Td { matrix translate cairo_font_matrix matrix concatmatrix dup
      /cairo_font_matrix exch def dup 4 get exch 5 get cairo_store_point
      /cairo_font where { pop cairo_selectfont } if } bind def
/Tm { 2 copy 8 2 roll 6 array astore /cairo_font_matrix exch def
      cairo_store_point /cairo_font where { pop cairo_selectfont } if } bind def
/g { setgray } bind def
/rg { setrgbcolor } bind def
/d1 { setcachedevice } bind def
%%EndProlog
%%BeginSetup
%%EndSetup
%%Page: 1 1
%%BeginPageSetup
%%PageBoundingBox: 4 0 76 80
%%EndPageSetup
q 4 0 72 80 rectclip q
0 g
75.359 46.582 m 76.789 57.41 72.398 70.379 59.426 76.199 c 49.172 80.801
 31.07 80.793 21.523 72.09 c 13.199 64.5 11.32 53.723 11.32 53.723 c 11.32
 53.723 10.461 49.719 10.461 48.391 c 10.461 47.121 11.891 46.621 11.727
 45.969 c 11.566 45.316 9.961 43.449 8.738 41.406 c 7.512 39.367 4.383 34.828
 4.383 33.605 c 4.383 32.379 5.117 31.926 6.586 31.438 c 8.055 30.949 9.199
 30.539 9.441 29.969 c 9.688 29.398 8.742 27.766 8.691 26.602 c 8.648 25.609
 9.012 25.5 9.758 25.211 c 10.68 24.852 12.094 24.805 12.094 24.805 c 12.094
 24.805 8.941 24.207 9.254 22.918 c 9.578 21.578 11.477 21.305 11.648 20.254
 c 11.73 19.727 10.039 17.012 10.262 14.371 c 10.555 10.926 13.82 9.383 
18.996 10.215 c 23.93 11.004 26.246 11.742 26.883 9.02 c 27.281 7.309 27.238
 4.418 27.973 1.152 c 28.004 1.02 28.035 0.883 28.066 0.742 c 65.926 0.742
 l 64.309 3.695 62.18 8.434 62.18 14.457 c 62.18 18.594 62.59 24.734 65.555
 27.996 c 69.273 32.09 74.211 37.887 75.359 46.582 c h
59.727 38.004 m 59.727 38.004 59.23 32.59 55.254 31.895 c 51.852 31.297
 49.59 34.578 49.59 34.578 c 48.473 29.285 l 46.09 29.285 l 46.09 29.285
 43.93 37.258 42.438 38.602 c 40.945 39.941 38.637 40.316 38.637 40.316 
c 38.637 40.316 35.508 40.539 33.496 42.551 c 31.48 44.562 33.344 47.023
 33.344 47.023 c 33.344 47.023 30.812 46.871 25.668 47.988 c 20.527 49.109
 22.094 52.387 22.094 52.387 c 22.094 52.387 20.75 52.164 19.633 53.578 
c 18.84 54.586 18.262 57.047 19.707 59.914 c 21.004 62.48 23.281 63.371 
23.281 63.371 c 23.281 63.371 22.441 64.441 24.219 65.938 c 25.148 66.719
 26.789 66.695 26.789 66.695 c 26.789 66.695 27.188 68.418 29.656 69.531
 c 32.453 70.797 34.312 69.75 34.312 69.75 c 34.312 69.75 35.062 71.387 
37.223 72.133 c 39.383 72.879 41.543 71.613 41.543 71.613 c 41.543 71.613
 43.004 72.938 45.688 72.938 c 48.371 72.938 49.367 71.539 49.367 71.539
 c 49.367 71.539 50.984 72.371 52.945 71.688 c 54.797 71.043 55.336 69.25
 55.336 69.25 c 55.336 69.25 56.672 70.199 58.535 69.453 c 60.398 68.707
 61.145 66.695 61.145 66.695 c 61.145 66.695 62.43 66.883 63.707 65.75 c
 64.652 64.906 64.348 63.34 64.348 63.34 c 64.348 63.34 65.93 62.816 66.875
 60.926 c 67.754 59.164 66.508 57.676 66.508 57.676 c 66.508 57.676 69.117
 55.738 69.488 50.672 c 69.945 44.488 65.988 43.293 65.988 43.293 c 65.988
 43.293 66.77 41.332 65.391 39.195 c 63.516 36.289 59.727 38.004 59.727 
38.004 c h
59.727 38.004 m f
Q Q
showpage
%%Trailer
end restore
%%EOF
