%!PS-Adobe-3.0 EPSF-3.0
%%Creator: cairo 1.14.6 (http://cairographics.org)
%%CreationDate: Fri Mar 18 10:09:56 2016
%%Pages: 1
%%DocumentData: Clean7Bit
%%LanguageLevel: 2
%%BoundingBox: 4 14 76 86
%%EndComments
%%BeginProlog
save
50 dict begin
/q { gsave } bind def
/Q { grestore } bind def
/cm { 6 array astore concat } bind def
/w { setlinewidth } bind def
/J { setlinecap } bind def
/j { setlinejoin } bind def
/M { setmiterlimit } bind def
/d { setdash } bind def
/m { moveto } bind def
/l { lineto } bind def
/c { curveto } bind def
/h { closepath } bind def
/re { exch dup neg 3 1 roll 5 3 roll moveto 0 rlineto
      0 exch rlineto 0 rlineto closepath } bind def
/S { stroke } bind def
/f { fill } bind def
/f* { eofill } bind def
/n { newpath } bind def
/W { clip } bind def
/W* { eoclip } bind def
/BT { } bind def
/ET { } bind def
/pdfmark where { pop globaldict /?pdfmark /exec load put }
    { globaldict begin /?pdfmark /pop load def /pdfmark
    /cleartomark load def end } ifelse
/BDC { mark 3 1 roll /BDC pdfmark } bind def
/EMC { mark /EMC pdfmark } bind def
/cairo_store_point { /cairo_point_y exch def /cairo_point_x exch def } def
/Tj { show currentpoint cairo_store_point } bind def
/TJ {
  {
    dup
    type /stringtype eq
    { show } { -0.001 mul 0 cairo_font_matrix dtransform rmoveto } ifelse
  } forall
  currentpoint cairo_store_point
} bind def
/cairo_selectfont { cairo_font_matrix aload pop pop pop 0 0 6 array astore
    cairo_font exch selectfont cairo_point_x cairo_point_y moveto } bind def
/Tf { pop /cairo_font exch def /cairo_font_matrix where
      { pop cairo_selectfont } if } bind def
/Td { matrix translate cairo_font_matrix matrix concatmatrix dup
      /cairo_font_matrix exch def dup 4 get exch 5 get cairo_store_point
      /cairo_font where { pop cairo_selectfont } if } bind def
/Tm { 2 copy 8 2 roll 6 array astore /cairo_font_matrix exch def
      cairo_store_point /cairo_font where { pop cairo_selectfont } if } bind def
/g { setgray } bind def
/rg { setrgbcolor } bind def
/d1 { setcachedevice } bind def
%%EndProlog
%%BeginSetup
%%EndSetup
%%Page: 1 1
%%BeginPageSetup
%%PageBoundingBox: 4 14 76 86
%%EndPageSetup
q 4 14 72 72 rectclip q
0 0 0.670588 rg
69.48 28.922 m 67.238 28.922 65.238 27.719 64.199 25.879 c 53 32.121 l 
53.879 33.641 54.441 35.48 54.441 37.32 c 54.441 42.602 50.52 46.922 45.48
 47.559 c 46.359 57.238 l 46.52 57.238 l 49.801 57.238 52.441 59.879 52.441
 63.16 c 52.441 64.602 51.961 65.879 51.16 66.84 c 60.199 75.801 l 61.238
 74.84 62.68 74.199 64.199 74.199 c 67.398 74.199 70.039 76.84 70.039 80.039
 c 70.039 83.238 67.398 85.879 64.199 85.879 c 61 85.879 58.359 83.238 58.359
 80.039 c 58.359 78.602 58.922 77.238 59.801 76.281 c 50.84 67.32 l 49.801
 68.441 48.281 69.16 46.602 69.16 c 43.32 69.16 40.68 66.52 40.68 63.238
 c 40.68 60.199 42.922 57.719 45.879 57.32 c 45 47.719 l 44.199 47.719 l
 39.559 47.719 35.641 44.68 34.359 40.441 c 23 42.762 l 23.078 43.16 23.16
 43.641 23.16 44.039 c 23.16 47.719 20.121 50.762 16.441 50.762 c 12.762
 50.762 9.719 47.719 9.719 44.039 c 9.719 41.16 11.559 38.68 14.121 37.719
 c 10.121 23.961 l 9.801 24.039 9.559 24.039 9.238 24.039 c 6.52 24.039 
4.281 21.801 4.281 19.078 c 4.281 16.359 6.52 14.121 9.238 14.121 c 11.961
 14.121 14.199 16.359 14.199 19.078 c 14.199 21.32 12.68 23.238 10.68 23.801
 c 14.68 37.559 l 15.238 37.398 15.801 37.32 16.441 37.32 c 19.48 37.32 
22.121 39.398 22.922 42.199 c 34.199 39.879 l 33.961 39.078 33.879 38.199
 33.879 37.32 c 33.879 31.641 38.52 27 44.199 27 c 47.801 27 50.922 28.84
 52.762 31.641 c 63.961 25.398 l 63.559 24.602 63.398 23.719 63.398 22.84
 c 63.398 19.48 66.121 16.68 69.559 16.68 c 72.922 16.68 75.719 19.398 75.719
 22.84 c 75.641 26.199 72.922 28.922 69.48 28.922 c h
69.48 28.922 m f
Q Q
showpage
%%Trailer
end restore
%%EOF
