%!PS-Adobe-3.0 EPSF-3.0
%%Creator: cairo 1.14.2 (http://cairographics.org)
%%CreationDate: Wed Apr 29 14:15:41 2015
%%Pages: 1
%%DocumentData: Clean7Bit
%%LanguageLevel: 2
%%BoundingBox: 11 10 69 70
%%EndComments
%%BeginProlog
save
50 dict begin
/q { gsave } bind def
/Q { grestore } bind def
/cm { 6 array astore concat } bind def
/w { setlinewidth } bind def
/J { setlinecap } bind def
/j { setlinejoin } bind def
/M { setmiterlimit } bind def
/d { setdash } bind def
/m { moveto } bind def
/l { lineto } bind def
/c { curveto } bind def
/h { closepath } bind def
/re { exch dup neg 3 1 roll 5 3 roll moveto 0 rlineto
      0 exch rlineto 0 rlineto closepath } bind def
/S { stroke } bind def
/f { fill } bind def
/f* { eofill } bind def
/n { newpath } bind def
/W { clip } bind def
/W* { eoclip } bind def
/BT { } bind def
/ET { } bind def
/pdfmark where { pop globaldict /?pdfmark /exec load put }
    { globaldict begin /?pdfmark /pop load def /pdfmark
    /cleartomark load def end } ifelse
/BDC { mark 3 1 roll /BDC pdfmark } bind def
/EMC { mark /EMC pdfmark } bind def
/cairo_store_point { /cairo_point_y exch def /cairo_point_x exch def } def
/Tj { show currentpoint cairo_store_point } bind def
/TJ {
  {
    dup
    type /stringtype eq
    { show } { -0.001 mul 0 cairo_font_matrix dtransform rmoveto } ifelse
  } forall
  currentpoint cairo_store_point
} bind def
/cairo_selectfont { cairo_font_matrix aload pop pop pop 0 0 6 array astore
    cairo_font exch selectfont cairo_point_x cairo_point_y moveto } bind def
/Tf { pop /cairo_font exch def /cairo_font_matrix where
      { pop cairo_selectfont } if } bind def
/Td { matrix translate cairo_font_matrix matrix concatmatrix dup
      /cairo_font_matrix exch def dup 4 get exch 5 get cairo_store_point
      /cairo_font where { pop cairo_selectfont } if } bind def
/Tm { 2 copy 8 2 roll 6 array astore /cairo_font_matrix exch def
      cairo_store_point /cairo_font where { pop cairo_selectfont } if } bind def
/g { setgray } bind def
/rg { setrgbcolor } bind def
/d1 { setcachedevice } bind def
%%EndProlog
%%BeginSetup
%%EndSetup
%%Page: 1 1
%%BeginPageSetup
%%PageBoundingBox: 11 10 69 70
%%EndPageSetup
q 11 10 58 60 rectclip q
0 g
66.543 32.727 m 63.926 48.172 l 64.586 48.668 65.023 49.453 65.023 50.34
 c 65.023 51.84 63.805 53.055 62.305 53.055 c 61.941 53.055 61.59 52.98 
61.273 52.852 c 53.406 60.961 l 54.059 61.547 54.48 62.391 54.48 63.336 
c 54.48 65.098 53.059 66.523 51.293 66.523 c 50.195 66.523 49.227 65.969
 48.652 65.121 c 36.074 67.801 l 35.863 68.844 34.938 69.629 33.832 69.629
 c 32.566 69.629 31.543 68.605 31.543 67.34 c 31.543 66.941 31.656 66.57
 31.836 66.242 c 21.875 55.93 l 21.73 55.949 21.59 55.973 21.441 55.973 
c 19.859 55.973 18.578 54.688 18.578 53.105 c 18.578 52.047 19.16 51.133
 20.016 50.637 c 14.828 37.312 l 14.699 37.332 14.566 37.352 14.43 37.352
 c 12.848 37.352 11.562 36.07 11.562 34.488 c 11.562 33.293 12.297 32.273
 13.336 31.844 c 13.141 17.957 l 12.051 17.551 11.27 16.512 11.27 15.277
 c 11.27 13.695 12.551 12.414 14.133 12.414 c 15.578 12.414 16.766 13.492
 16.957 14.887 c 40.707 16.457 l 41.125 15.566 42.02 14.949 43.066 14.949
 c 43.672 14.949 44.223 15.16 44.664 15.504 c 56.457 11.527 l 56.848 10.84
 57.582 10.371 58.434 10.371 c 59.695 10.371 60.723 11.395 60.723 12.66 
c 60.723 12.816 60.707 12.969 60.676 13.117 c 66.508 27.574 l 67.766 27.766
 68.73 28.84 68.73 30.152 c 68.734 31.453 67.781 32.52 66.543 32.727 c h
41.289 46.215 m 50.578 34.242 l 50.301 33.91 50.094 33.527 49.969 33.105
 c 32.043 34.332 l 31.934 34.598 31.781 34.836 31.605 35.055 c 38.344 45.887
 l 38.695 45.77 39.074 45.699 39.465 45.699 c 40.133 45.699 40.758 45.891
 41.289 46.215 c h
42.461 47.391 m 42.656 47.711 42.793 48.062 42.879 48.438 c 59.742 49.48
 l 59.852 49.148 60.027 48.848 60.246 48.586 c 53.371 35.41 l 53.273 35.418
 53.184 35.438 53.086 35.438 c 52.664 35.438 52.266 35.352 51.895 35.207
 c h
49.465 60.734 m 49.984 60.367 50.613 60.148 51.297 60.148 c 51.516 60.148
 51.734 60.172 51.941 60.215 c 60.016 51.793 l 59.855 51.539 59.738 51.262
 59.668 50.961 c 42.891 49.918 l 42.789 50.402 42.598 50.852 42.32 51.238
 c h
35.797 66.188 m 48.133 63.562 l 48.125 63.484 48.109 63.414 48.109 63.336
 c 48.109 62.855 48.223 62.402 48.414 61.992 c 41.109 52.305 l 40.703 52.52
 40.254 52.656 39.773 52.695 c 39.613 52.723 39.453 52.734 39.285 52.734
 c 39.176 52.734 39.074 52.715 38.969 52.703 c 35.094 65.434 l 35.387 65.629
 35.621 65.887 35.797 66.188 c h
33.172 65.16 m 33.273 65.129 33.379 65.105 33.488 65.09 c 37.43 52.156 
l 36.812 51.73 36.363 51.09 36.156 50.352 c 36.137 50.301 36.121 50.25 36.105
 50.199 c 24.258 53.574 l 24.148 54.234 23.812 54.816 23.332 55.242 c h
24.059 51.949 m 36.016 48.602 l 36.148 47.836 36.527 47.16 37.07 46.648
 c 30.402 35.926 l 30.09 36.047 29.75 36.117 29.391 36.117 c 29.32 36.117
 29.25 36.105 29.18 36.098 c 23.188 50.852 l 23.562 51.145 23.863 51.516
 24.059 51.949 c h
21.453 50.246 m 21.582 50.246 21.703 50.266 21.828 50.281 c 27.781 35.621
 l 27.234 35.25 26.84 34.691 26.652 34.043 c 17.242 35.012 l 17.109 35.711
 16.727 36.309 16.191 36.73 c h
15.59 17.734 m 15.344 17.879 15.074 17.992 14.785 18.062 c 14.965 31.68
 l 15.973 31.871 16.781 32.59 17.117 33.539 c 26.625 32.559 l 26.707 32.219
 26.848 31.902 27.043 31.625 c h
40.504 18.082 m 16.711 16.508 l 16.684 16.562 16.656 16.613 16.625 16.664
 c 28.18 30.672 l 28.547 30.496 28.957 30.391 29.391 30.391 c 29.652 30.391
 29.898 30.438 30.137 30.5 c 40.867 18.969 l 40.695 18.699 40.57 18.402 
40.504 18.082 c h
44.133 19.949 m 43.809 20.094 43.449 20.18 43.07 20.18 c 42.738 20.18 42.426
 20.113 42.137 20 c 31.535 31.371 l 31.859 31.738 32.098 32.184 32.199 32.684
 c 49.895 31.473 l 49.98 31.09 50.133 30.73 50.336 30.414 c h
56.254 13.324 m 45.594 16.922 l 45.648 17.129 45.684 17.34 45.684 17.562
 c 45.684 18.031 45.551 18.461 45.336 18.84 c 51.539 29.305 l 52.004 29.055
 52.523 28.898 53.086 28.898 c 53.125 28.898 53.16 28.91 53.199 28.91 c 
57.332 14.656 l 56.82 14.371 56.43 13.898 56.254 13.324 c h
59.531 14.656 m 59.352 14.754 59.16 14.836 58.957 14.883 c 54.773 29.383
 l 55.512 29.832 56.062 30.559 56.266 31.43 c 63.711 29.125 l 63.941 28.586
 64.355 28.148 64.867 27.867 c h
63.578 30.754 m 56.215 33.062 l 56.008 33.797 55.559 34.43 54.945 34.855
 c 61.637 47.719 l 60.773 48.02 62.074 47.625 62.305 47.625 c 62.328 47.625
 62.348 47.629 62.367 47.629 c 64.926 32.469 l 64.258 32.121 63.758 31.504
 63.578 30.754 c h
63.578 30.754 m f
Q Q
showpage
%%Trailer
end restore
%%EOF
