%!PS-Adobe-3.0 EPSF-3.0
%%Creator: cairo 1.14.6 (http://cairographics.org)
%%CreationDate: Wed Mar 16 11:16:15 2016
%%Pages: 1
%%DocumentData: Clean7Bit
%%LanguageLevel: 2
%%BoundingBox: 0 -1 56 56
%%EndComments
%%BeginProlog
save
50 dict begin
/q { gsave } bind def
/Q { grestore } bind def
/cm { 6 array astore concat } bind def
/w { setlinewidth } bind def
/J { setlinecap } bind def
/j { setlinejoin } bind def
/M { setmiterlimit } bind def
/d { setdash } bind def
/m { moveto } bind def
/l { lineto } bind def
/c { curveto } bind def
/h { closepath } bind def
/re { exch dup neg 3 1 roll 5 3 roll moveto 0 rlineto
      0 exch rlineto 0 rlineto closepath } bind def
/S { stroke } bind def
/f { fill } bind def
/f* { eofill } bind def
/n { newpath } bind def
/W { clip } bind def
/W* { eoclip } bind def
/BT { } bind def
/ET { } bind def
/pdfmark where { pop globaldict /?pdfmark /exec load put }
    { globaldict begin /?pdfmark /pop load def /pdfmark
    /cleartomark load def end } ifelse
/BDC { mark 3 1 roll /BDC pdfmark } bind def
/EMC { mark /EMC pdfmark } bind def
/cairo_store_point { /cairo_point_y exch def /cairo_point_x exch def } def
/Tj { show currentpoint cairo_store_point } bind def
/TJ {
  {
    dup
    type /stringtype eq
    { show } { -0.001 mul 0 cairo_font_matrix dtransform rmoveto } ifelse
  } forall
  currentpoint cairo_store_point
} bind def
/cairo_selectfont { cairo_font_matrix aload pop pop pop 0 0 6 array astore
    cairo_font exch selectfont cairo_point_x cairo_point_y moveto } bind def
/Tf { pop /cairo_font exch def /cairo_font_matrix where
      { pop cairo_selectfont } if } bind def
/Td { matrix translate cairo_font_matrix matrix concatmatrix dup
      /cairo_font_matrix exch def dup 4 get exch 5 get cairo_store_point
      /cairo_font where { pop cairo_selectfont } if } bind def
/Tm { 2 copy 8 2 roll 6 array astore /cairo_font_matrix exch def
      cairo_store_point /cairo_font where { pop cairo_selectfont } if } bind def
/g { setgray } bind def
/rg { setrgbcolor } bind def
/d1 { setcachedevice } bind def
%%EndProlog
%%BeginSetup
%%EndSetup
%%Page: 1 1
%%BeginPageSetup
%%PageBoundingBox: 0 -1 56 56
%%EndPageSetup
q 0 -1 56 57 rectclip q
0 0.85098 0 rg
45.91 42.904 m 45.91 42.478 45.566 42.134 45.141 42.134 c 44.715 42.134
 44.367 42.478 44.367 42.904 c 44.367 43.33 44.715 43.673 45.141 43.673 
c 45.566 43.673 45.91 43.33 45.91 42.904 c h
45.91 42.904 m f
11.301 43.025 m 11.301 42.599 10.957 42.252 10.531 42.252 c 10.105 42.252
 9.762 42.599 9.762 43.025 c 9.762 43.451 10.105 43.794 10.531 43.794 c 
10.957 43.794 11.301 43.451 11.301 43.025 c h
11.301 43.025 m f
11.422 10.607 m 11.422 10.181 11.074 9.837 10.648 9.837 c 10.227 9.837 
9.879 10.181 9.879 10.607 c 9.879 11.033 10.227 11.38 10.648 11.38 c 11.074
 11.38 11.422 11.033 11.422 10.607 c h
11.422 10.607 m f
0 g
27.895 33.423 m 27.719 33.423 l 24.281 33.423 17.879 38.994 15.332 41.365
 c 14.738 41.896 14.266 42.49 14.027 43.259 c 13.73 43.97 13.316 44.447 
12.961 44.802 c 13.555 45.572 14.504 46.521 15.984 47.466 c 19.48 49.72 
21.555 52.091 22.207 53.334 c 22.918 54.58 22.859 55.173 21.613 55.232 c
 20.367 55.291 17.582 53.099 17.582 53.099 c 17.582 53.099 13.852 49.959
 11.363 45.689 c 10.648 45.81 9.645 45.81 8.812 45.099 c 7.449 43.97 7.746
 42.252 8.219 41.423 c 7.805 41.068 7.332 40.712 6.738 40.357 c 3.184 37.927
 1.168 35.556 0.457 34.373 c -0.254 33.127 -0.195 32.533 1.051 32.474 c 
2.293 32.416 5.078 34.607 5.078 34.607 c 5.078 34.607 7.57 36.744 9.879 
39.822 c 10.355 39.587 11.066 39.232 11.953 38.818 c 12.191 38.697 12.367
 38.58 12.605 38.459 c 14.441 36.919 16.695 33.365 18.355 30.459 c 19.656
 28.209 19.656 25.365 18.355 23.111 c 16.695 20.15 14.324 16.416 12.488 
14.877 c 12.309 14.697 12.074 14.58 11.895 14.521 c 11.48 14.341 11.184 
14.166 10.887 14.044 c 8.398 17.837 5.199 20.564 5.199 20.564 c 5.199 20.564
 2.414 22.755 1.168 22.697 c -0.074 22.638 -0.137 22.044 0.578 20.802 c 
1.289 19.556 3.301 17.185 6.797 14.935 c 7.805 14.283 8.578 13.63 9.168 
13.037 c 8.812 12.802 8.578 12.623 8.398 12.388 c 7.863 11.794 7.152 9.662
 8.754 8.357 c 9.879 7.408 11.184 7.646 11.895 7.884 c 12.074 7.943 12.25
 8.002 12.367 8.119 c 14.797 4.623 17.645 2.193 17.645 2.193 c 17.645 2.193
 20.43 0.002 21.672 0.06 c 22.918 0.119 22.977 0.712 22.266 1.959 c 21.555
 3.201 19.539 5.572 16.043 7.822 c 15.035 8.474 14.324 9.127 13.73 9.662
 c 13.789 9.779 13.852 9.896 13.91 10.076 c 14.207 10.845 14.68 11.498 15.273
 12.029 c 17.82 14.4 24.16 19.97 27.656 19.97 c 27.598 19.912 m 31.035 19.912
 37.73 14.341 40.34 11.97 c 40.934 11.439 41.406 10.728 41.703 10.017 c 
41.82 9.779 41.879 9.603 42 9.423 c 41.465 8.888 40.754 8.298 39.863 7.763
 c 36.367 5.513 34.293 3.142 33.645 1.896 c 32.934 0.654 32.992 0.06 34.234
 0.002 c 35.48 -0.057 38.266 2.134 38.266 2.134 c 38.266 2.134 41.109 4.564
 43.48 8.002 c 43.539 7.943 43.656 7.943 43.719 7.884 c 44.43 7.646 45.73
 7.408 46.859 8.357 c 48.457 9.662 47.746 11.794 47.215 12.388 c 47.035 
12.564 46.859 12.744 46.621 12.919 c 47.215 13.572 47.984 14.224 49.109 
14.935 c 52.605 17.185 54.68 19.556 55.332 20.802 c 56.043 22.044 55.984
 22.638 54.738 22.697 c 53.496 22.755 50.711 20.564 50.711 20.564 c 50.711
 20.564 47.449 17.779 44.961 13.927 c 44.605 14.103 44.191 14.283 43.719
 14.521 c 43.48 14.638 43.301 14.755 43.066 14.877 c 41.227 16.416 38.977
 19.97 37.316 22.877 c 36.012 25.127 36.012 27.97 37.316 30.224 c 38.977
 33.185 41.348 36.919 43.184 38.459 c 43.363 38.638 43.598 38.755 43.836
 38.818 c 44.785 39.232 45.434 39.529 45.91 39.822 c 48.219 36.681 50.711
 34.607 50.711 34.607 c 50.711 34.607 53.496 32.416 54.738 32.474 c 55.984
 32.533 56.043 33.127 55.332 34.373 c 54.621 35.615 52.605 37.986 49.109
 40.24 c 48.516 40.595 48.043 41.009 47.629 41.365 c 48.043 42.252 48.34
 43.912 47.035 45.037 c 46.207 45.748 45.258 45.748 44.547 45.63 c 41.938
 49.837 38.207 52.978 38.207 52.978 c 38.207 52.978 35.422 55.173 34.176
 55.111 c 32.934 55.052 32.871 54.459 33.582 53.216 c 34.293 51.97 36.309
 49.603 39.805 47.349 c 41.227 46.4 42.176 45.513 42.828 44.744 c 42.473
 44.447 42.059 43.912 41.762 43.259 c 41.465 42.49 40.992 41.837 40.398 
41.306 c 37.852 38.935 31.332 33.365 27.836 33.365 c 44.785 44.267 m 45.852
 44.505 46.797 43.556 46.562 42.49 c 46.441 41.959 46.027 41.541 45.496 
41.423 c 44.43 41.185 43.48 42.134 43.719 43.201 c 43.836 43.736 44.25 44.15
 44.785 44.267 c h
10.887 41.603 m 9.82 41.365 8.871 42.314 9.109 43.38 c 9.227 43.912 9.645
 44.326 10.176 44.447 c 11.242 44.681 12.191 43.736 11.953 42.669 c 11.836
 42.134 11.422 41.72 10.887 41.603 c h
11.004 9.185 m 9.938 8.951 8.992 9.896 9.227 10.962 c 9.348 11.498 9.762
 11.912 10.293 12.029 c 11.363 12.267 12.309 11.318 12.074 10.252 c 11.953
 9.72 11.539 9.306 11.004 9.185 c h
45.199 9.365 m 44.133 9.127 43.184 10.076 43.422 11.142 c 43.539 11.673
 43.953 12.091 44.488 12.209 c 45.555 12.447 46.504 11.498 46.266 10.431
 c 46.148 9.896 45.73 9.482 45.199 9.365 c h
45.199 9.365 m f
0 0.85098 0 rg
45.613 10.728 m 45.613 10.302 45.27 9.959 44.844 9.959 c 44.418 9.959 44.074
 10.302 44.074 10.728 c 44.074 11.154 44.418 11.498 44.844 11.498 c 45.27
 11.498 45.613 11.154 45.613 10.728 c h
45.613 10.728 m f
Q Q
showpage
%%Trailer
end restore
%%EOF
