%!PS-Adobe-3.0 EPSF-3.0
%%Creator: cairo 1.14.6 (http://cairographics.org)
%%CreationDate: Fri Mar 18 10:13:14 2016
%%Pages: 1
%%DocumentData: Clean7Bit
%%LanguageLevel: 2
%%BoundingBox: 1 20 71 70
%%EndComments
%%BeginProlog
save
50 dict begin
/q { gsave } bind def
/Q { grestore } bind def
/cm { 6 array astore concat } bind def
/w { setlinewidth } bind def
/J { setlinecap } bind def
/j { setlinejoin } bind def
/M { setmiterlimit } bind def
/d { setdash } bind def
/m { moveto } bind def
/l { lineto } bind def
/c { curveto } bind def
/h { closepath } bind def
/re { exch dup neg 3 1 roll 5 3 roll moveto 0 rlineto
      0 exch rlineto 0 rlineto closepath } bind def
/S { stroke } bind def
/f { fill } bind def
/f* { eofill } bind def
/n { newpath } bind def
/W { clip } bind def
/W* { eoclip } bind def
/BT { } bind def
/ET { } bind def
/pdfmark where { pop globaldict /?pdfmark /exec load put }
    { globaldict begin /?pdfmark /pop load def /pdfmark
    /cleartomark load def end } ifelse
/BDC { mark 3 1 roll /BDC pdfmark } bind def
/EMC { mark /EMC pdfmark } bind def
/cairo_store_point { /cairo_point_y exch def /cairo_point_x exch def } def
/Tj { show currentpoint cairo_store_point } bind def
/TJ {
  {
    dup
    type /stringtype eq
    { show } { -0.001 mul 0 cairo_font_matrix dtransform rmoveto } ifelse
  } forall
  currentpoint cairo_store_point
} bind def
/cairo_selectfont { cairo_font_matrix aload pop pop pop 0 0 6 array astore
    cairo_font exch selectfont cairo_point_x cairo_point_y moveto } bind def
/Tf { pop /cairo_font exch def /cairo_font_matrix where
      { pop cairo_selectfont } if } bind def
/Td { matrix translate cairo_font_matrix matrix concatmatrix dup
      /cairo_font_matrix exch def dup 4 get exch 5 get cairo_store_point
      /cairo_font where { pop cairo_selectfont } if } bind def
/Tm { 2 copy 8 2 roll 6 array astore /cairo_font_matrix exch def
      cairo_store_point /cairo_font where { pop cairo_selectfont } if } bind def
/g { setgray } bind def
/rg { setrgbcolor } bind def
/d1 { setcachedevice } bind def
%%EndProlog
%%BeginSetup
%%EndSetup
%%Page: 1 1
%%BeginPageSetup
%%PageBoundingBox: 1 20 71 70
%%EndPageSetup
q 1 20 70 50 rectclip q
0 0 0.670588 rg
57.719 48.922 m 57.719 60.762 l 57.719 61.238 57.398 61.559 56.922 61.559
 c 45.078 61.559 l 36.68 67.16 l 36.441 67.32 36.039 67.32 35.801 67.16 
c 27.16 61.48 l 26.922 61.32 26.84 61.078 26.84 60.84 c 26.84 60.602 27 
60.359 27.16 60.199 c 35.398 54.68 l 35.398 48.441 l 26.52 48.441 l 26.039
 48.441 25.719 48.121 25.719 47.641 c 25.719 40.359 l 19.078 40.359 l 18.602
 40.359 18.281 40.039 18.281 39.559 c 18.281 35.879 l 10.52 35.879 l 10.52
 46.762 l 16.359 46.762 l 16.84 46.762 17.16 47.078 17.16 47.559 c 17.16
 68.281 l 17.16 68.762 16.84 69.078 16.359 69.078 c 2.199 69.078 l 1.719
 69.078 1.398 68.762 1.398 68.281 c 1.398 47.559 l 1.398 47.078 1.719 46.762
 2.199 46.762 c 9 46.762 l 9 35 l 9 34.52 9.32 34.199 9.801 34.199 c 18.281
 34.199 l 18.281 30.602 l 18.281 30.121 18.602 29.801 19.078 29.801 c 33.32
 29.801 l 33.801 29.801 34.121 30.121 34.121 30.602 c 34.121 34.039 l 42.602
 34.039 l 43.078 26.762 49.16 20.922 56.602 20.922 c 64.281 20.922 70.602
 27.238 70.602 34.922 c 70.602 42.281 64.922 48.281 57.719 48.922 c h
3 67.48 m 15.641 67.48 l 15.641 48.359 l 3 48.359 l h
36.199 65.559 m 43.398 60.84 l 36.441 56.121 l 36.121 56.121 l 29.16 60.762
 l h
32.52 31.398 m 19.879 31.398 l 19.879 38.68 l 32.52 38.68 l h
33.32 40.281 m 27.32 40.281 l 27.32 46.762 l 36.281 46.762 l 36.762 46.762
 37.078 47.078 37.078 47.559 c 37.078 54.602 l 45.16 59.961 l 56.199 59.961
 l 56.199 48.922 l 48.922 48.68 43.078 42.84 42.68 35.641 c 34.121 35.641
 l 34.121 39.559 l 34.121 39.961 33.801 40.281 33.32 40.281 c h
56.602 22.52 m 49.801 22.52 44.199 28.121 44.199 34.922 c 44.199 41.719
 49.801 47.32 56.602 47.32 c 63.398 47.32 69 41.719 69 34.922 c 69 28.121
 63.398 22.52 56.602 22.52 c h
61.398 38.922 m 61.719 38.68 61.801 38.121 61.559 37.801 c 56.199 30.602
 l 56.199 30.52 l 56.121 30.441 56.121 30.441 56.039 30.441 c 55.961 30.359
 l 55.879 30.281 55.719 30.281 55.641 30.281 c 55.559 30.281 55.48 30.281
 55.398 30.359 c 55.398 30.359 55.32 30.359 55.32 30.441 c 55.238 30.441
 55.238 30.441 55.16 30.52 c 55.078 30.52 l 51.719 33.719 l 51.398 34.039
 51.398 34.52 51.719 34.84 c 52.039 35.16 52.52 35.16 52.84 34.84 c 55.48
 32.281 l 60.281 38.762 l 60.52 39.16 61.078 39.238 61.398 38.922 c h
61.398 38.922 m f
Q Q
showpage
%%Trailer
end restore
%%EOF
