%!PS-Adobe-3.0 EPSF-3.0
%%Creator: cairo 1.12.16 (http://cairographics.org)
%%CreationDate: Mon May 26 18:54:36 2014
%%Pages: 1
%%DocumentData: Clean7Bit
%%LanguageLevel: 2
%%BoundingBox: 0 -1 66 80
%%EndComments
%%BeginProlog
save
50 dict begin
/q { gsave } bind def
/Q { grestore } bind def
/cm { 6 array astore concat } bind def
/w { setlinewidth } bind def
/J { setlinecap } bind def
/j { setlinejoin } bind def
/M { setmiterlimit } bind def
/d { setdash } bind def
/m { moveto } bind def
/l { lineto } bind def
/c { curveto } bind def
/h { closepath } bind def
/re { exch dup neg 3 1 roll 5 3 roll moveto 0 rlineto
      0 exch rlineto 0 rlineto closepath } bind def
/S { stroke } bind def
/f { fill } bind def
/f* { eofill } bind def
/n { newpath } bind def
/W { clip } bind def
/W* { eoclip } bind def
/BT { } bind def
/ET { } bind def
/pdfmark where { pop globaldict /?pdfmark /exec load put }
    { globaldict begin /?pdfmark /pop load def /pdfmark
    /cleartomark load def end } ifelse
/BDC { mark 3 1 roll /BDC pdfmark } bind def
/EMC { mark /EMC pdfmark } bind def
/cairo_store_point { /cairo_point_y exch def /cairo_point_x exch def } def
/Tj { show currentpoint cairo_store_point } bind def
/TJ {
  {
    dup
    type /stringtype eq
    { show } { -0.001 mul 0 cairo_font_matrix dtransform rmoveto } ifelse
  } forall
  currentpoint cairo_store_point
} bind def
/cairo_selectfont { cairo_font_matrix aload pop pop pop 0 0 6 array astore
    cairo_font exch selectfont cairo_point_x cairo_point_y moveto } bind def
/Tf { pop /cairo_font exch def /cairo_font_matrix where
      { pop cairo_selectfont } if } bind def
/Td { matrix translate cairo_font_matrix matrix concatmatrix dup
      /cairo_font_matrix exch def dup 4 get exch 5 get cairo_store_point
      /cairo_font where { pop cairo_selectfont } if } bind def
/Tm { 2 copy 8 2 roll 6 array astore /cairo_font_matrix exch def
      cairo_store_point /cairo_font where { pop cairo_selectfont } if } bind def
/g { setgray } bind def
/rg { setrgbcolor } bind def
/d1 { setcachedevice } bind def
%%EndProlog
%%Page: 1 1
%%BeginPageSetup
%%PageBoundingBox: 0 -1 66 80
%%EndPageSetup
q 0 -1 66 81 rectclip q
0 g
27.777 57.777 m 14.445 57.777 6.668 50 0 40 c 0 40 5.555 42.223 8.891 42.223
 c 12.223 42.223 17.777 40 17.777 40 c 17.777 40 22.461 41.867 26.668 42.176
 c 26.668 29.84 l 27.023 29.933 27.391 30 27.777 30 c 28.164 30 28.531 29.933
 28.891 29.84 c 28.891 42.176 l 33.098 41.867 37.777 40 37.777 40 c 37.777
 40 43.332 42.223 46.668 42.223 c 50 42.223 55.559 40 55.559 40 c 48.891
 50 41.113 57.777 27.777 57.777 c h
f
11.07 78.594 m 11.234 79.183 10.887 79.797 10.297 79.961 c 9.711 80.121
 9.094 79.781 8.93 79.187 c 0.281 47.965 l 1.336 49.285 2.457 50.562 3.648
 51.785 c h
f
13.43 59.023 m 18.848 78.594 l 19.012 79.183 18.664 79.797 18.074 79.961
 c 17.488 80.121 16.871 79.781 16.707 79.187 c 10.711 57.535 l 11.578 58.074
 12.492 58.562 13.43 59.023 c h
f
26.625 78.594 m 26.789 79.183 26.441 79.797 25.852 79.961 c 25.266 80.121
 24.648 79.781 24.484 79.187 c 19.52 61.254 l 20.312 61.449 21.125 61.617
 21.965 61.754 c h
f
29.848 62.141 m 34.402 78.594 l 34.57 79.183 34.223 79.797 33.629 79.961
 c 33.047 80.121 32.43 79.781 32.262 79.187 c 27.562 62.215 l 27.637 62.215
 27.703 62.223 27.777 62.223 c 28.488 62.223 29.168 62.18 29.848 62.141 
c h
f
42.18 78.594 m 42.348 79.183 42 79.797 41.406 79.961 c 40.824 80.121 40.203
 79.781 40.039 79.187 c 35.125 61.437 l 35.863 61.281 36.578 61.098 37.281
 60.894 c h
f
49.961 78.594 m 50.125 79.183 49.777 79.797 49.184 79.961 c 48.598 80.121
 47.98 79.781 47.816 79.187 c 42.223 58.976 l 42.91 58.637 43.578 58.277
 44.23 57.894 c h
f
50.66 53.035 m 57.738 78.594 l 57.902 79.183 57.555 79.797 56.965 79.961
 c 56.379 80.121 55.762 79.781 55.598 79.187 c 48.809 54.676 l 49.441 54.144
 50.062 53.598 50.66 53.035 c h
f
64.742 79.961 m 64.156 80.121 63.539 79.781 63.375 79.187 c 54.863 48.457
 l 55.449 47.742 56.02 47.016 56.57 46.281 c 65.516 78.594 l 65.68 79.183
 65.332 79.797 64.742 79.961 c h
f
17.777 23.332 m 17.777 20.266 15.289 17.777 12.223 17.777 c 9.156 17.777
 6.668 20.266 6.668 23.332 c 6.668 26.402 9.156 28.891 12.223 28.891 c 15.289
 28.891 17.777 26.402 17.777 23.332 c h
f
28.406 27.676 m 28.383 27.683 28.359 27.695 28.332 27.699 c 28.152 27.746
 27.969 27.777 27.777 27.777 c 27.586 27.777 27.402 27.746 27.227 27.699
 c 27.199 27.691 27.176 27.683 27.148 27.676 c 26.23 27.402 25.555 26.562
 25.555 25.555 c 25.555 20.043 21.07 15.555 15.555 15.555 c 3.332 15.555
 l 1.492 15.555 0 14.062 0 12.223 c 0 -0 l 4.445 -0 l 4.445 8.887 l 6.668
 8.887 l 6.668 -0 l 17.777 -0 l 17.777 7.777 l 18.059 10.23 20.492 11.848
 21.758 12.531 c 22.008 12.648 22.254 12.762 22.492 12.894 c 22.504 12.898
 22.52 12.902 22.52 12.902 c 22.508 12.902 l 26.969 15.363 30 20.109 30 
25.555 c 30 26.562 29.324 27.402 28.406 27.676 c h
f
Q Q
showpage
%%Trailer
end restore
%%EOF
