%!PS-Adobe-3.0 EPSF-3.0
%%Creator: cairo 1.14.2 (http://cairographics.org)
%%CreationDate: Wed Apr 29 14:19:10 2015
%%Pages: 1
%%DocumentData: Clean7Bit
%%LanguageLevel: 2
%%BoundingBox: 10 9 69 70
%%EndComments
%%BeginProlog
save
50 dict begin
/q { gsave } bind def
/Q { grestore } bind def
/cm { 6 array astore concat } bind def
/w { setlinewidth } bind def
/J { setlinecap } bind def
/j { setlinejoin } bind def
/M { setmiterlimit } bind def
/d { setdash } bind def
/m { moveto } bind def
/l { lineto } bind def
/c { curveto } bind def
/h { closepath } bind def
/re { exch dup neg 3 1 roll 5 3 roll moveto 0 rlineto
      0 exch rlineto 0 rlineto closepath } bind def
/S { stroke } bind def
/f { fill } bind def
/f* { eofill } bind def
/n { newpath } bind def
/W { clip } bind def
/W* { eoclip } bind def
/BT { } bind def
/ET { } bind def
/pdfmark where { pop globaldict /?pdfmark /exec load put }
    { globaldict begin /?pdfmark /pop load def /pdfmark
    /cleartomark load def end } ifelse
/BDC { mark 3 1 roll /BDC pdfmark } bind def
/EMC { mark /EMC pdfmark } bind def
/cairo_store_point { /cairo_point_y exch def /cairo_point_x exch def } def
/Tj { show currentpoint cairo_store_point } bind def
/TJ {
  {
    dup
    type /stringtype eq
    { show } { -0.001 mul 0 cairo_font_matrix dtransform rmoveto } ifelse
  } forall
  currentpoint cairo_store_point
} bind def
/cairo_selectfont { cairo_font_matrix aload pop pop pop 0 0 6 array astore
    cairo_font exch selectfont cairo_point_x cairo_point_y moveto } bind def
/Tf { pop /cairo_font exch def /cairo_font_matrix where
      { pop cairo_selectfont } if } bind def
/Td { matrix translate cairo_font_matrix matrix concatmatrix dup
      /cairo_font_matrix exch def dup 4 get exch 5 get cairo_store_point
      /cairo_font where { pop cairo_selectfont } if } bind def
/Tm { 2 copy 8 2 roll 6 array astore /cairo_font_matrix exch def
      cairo_store_point /cairo_font where { pop cairo_selectfont } if } bind def
/g { setgray } bind def
/rg { setrgbcolor } bind def
/d1 { setcachedevice } bind def
%%EndProlog
%%BeginSetup
%%EndSetup
%%Page: 1 1
%%BeginPageSetup
%%PageBoundingBox: 10 9 69 70
%%EndPageSetup
q 10 9 59 61 rectclip q
0 g
68.176 57.613 m 66.988 58.418 l 66.586 58.692 66.043 58.586 65.77 58.184
 c 59.691 49.231 l 59.418 48.828 59.523 48.285 59.922 48.012 c 61.113 47.207
 l 61.512 46.934 62.059 47.039 62.328 47.438 c 68.41 56.391 l 68.68 56.793
 68.578 57.34 68.176 57.613 c h
68.176 57.613 m f
13.254 51.555 m 13.082 52.008 12.578 52.238 12.121 52.067 c 10.777 51.563
 l 10.324 51.391 10.098 50.887 10.266 50.43 c 14.078 40.301 l 14.25 39.848
 14.758 39.617 15.211 39.789 c 16.555 40.293 l 17.008 40.465 17.238 40.973
 17.066 41.426 c h
13.254 51.555 m f
54.004 68.817 m 53.773 69.422 53.102 69.727 52.496 69.5 c 50.703 68.824
 l 50.098 68.598 49.793 67.922 50.02 67.32 c 52.137 61.695 l 39.371 56.891
 l 38.645 57.617 37.641 58.07 36.527 58.07 c 34.395 58.07 32.66 56.41 32.527
 54.317 c 27.629 52.473 l 27.461 52.68 l 26.551 53.774 24.93 53.918 23.836
 53.008 c 23.137 52.422 22.828 51.547 22.934 50.707 c 20.07 49.629 l 17.953
 55.25 l 17.727 55.856 17.051 56.164 16.445 55.934 c 14.656 55.262 l 14.051
 55.031 13.742 54.359 13.973 53.754 c 19.055 40.246 l 19.281 39.641 19.957
 39.336 20.562 39.563 c 22.352 40.238 l 22.957 40.465 23.262 41.141 23.035
 41.746 c 20.918 47.367 l 24.164 48.59 l 27.074 45.109 l 31 44.145 l 31 
35.555 l 31 35.317 29.926 13.176 29.926 13.176 c 29.82 11.727 30.918 10.469
 32.363 10.367 c 33.812 10.27 35.066 11.356 35.164 12.805 c 36.059 30.051
 l 36.219 30.039 36.91 30.035 37.098 30.059 c 38.281 12.809 l 38.375 11.356
 39.637 10.27 41.086 10.367 c 42.527 10.469 43.625 11.727 43.523 13.176 
c 43.523 13.176 42.055 35.363 42.055 35.559 c 42.055 44.578 l 47.234 50.781
 l 49.047 52.945 l 49.957 54.035 49.812 55.664 48.719 56.574 c 48.207 57
 47.578 57.195 46.961 57.168 c 52.988 59.434 l 55.105 53.813 l 55.332 53.207
 56.004 52.902 56.609 53.129 c 58.402 53.805 l 59.008 54.031 59.312 54.707
 59.086 55.313 c h
45.09 56.25 m 45.09 56.25 39.703 49.856 39.691 49.863 c 38.797 49.074 37.621
 48.59 36.332 48.59 c 35.129 48.59 34.023 49.008 33.156 49.711 c 29.914 
49.672 l 29.238 50.5 l 33.105 51.953 l 33.812 50.805 35.078 50.035 36.527
 50.035 c 38.75 50.035 40.543 51.832 40.543 54.051 c 40.543 54.281 40.52
 54.508 40.48 54.731 c 45.445 56.598 l 45.32 56.496 45.199 56.379 45.09 
56.25 c h
45.09 56.25 m f
Q Q
showpage
%%Trailer
end restore
%%EOF
