%!PS-Adobe-3.0 EPSF-3.0
%%Creator: cairo 1.12.16 (http://cairographics.org)
%%CreationDate: Mon May 26 18:49:47 2014
%%Pages: 1
%%DocumentData: Clean7Bit
%%LanguageLevel: 2
%%BoundingBox: 0 -1 80 80
%%EndComments
%%BeginProlog
save
50 dict begin
/q { gsave } bind def
/Q { grestore } bind def
/cm { 6 array astore concat } bind def
/w { setlinewidth } bind def
/J { setlinecap } bind def
/j { setlinejoin } bind def
/M { setmiterlimit } bind def
/d { setdash } bind def
/m { moveto } bind def
/l { lineto } bind def
/c { curveto } bind def
/h { closepath } bind def
/re { exch dup neg 3 1 roll 5 3 roll moveto 0 rlineto
      0 exch rlineto 0 rlineto closepath } bind def
/S { stroke } bind def
/f { fill } bind def
/f* { eofill } bind def
/n { newpath } bind def
/W { clip } bind def
/W* { eoclip } bind def
/BT { } bind def
/ET { } bind def
/pdfmark where { pop globaldict /?pdfmark /exec load put }
    { globaldict begin /?pdfmark /pop load def /pdfmark
    /cleartomark load def end } ifelse
/BDC { mark 3 1 roll /BDC pdfmark } bind def
/EMC { mark /EMC pdfmark } bind def
/cairo_store_point { /cairo_point_y exch def /cairo_point_x exch def } def
/Tj { show currentpoint cairo_store_point } bind def
/TJ {
  {
    dup
    type /stringtype eq
    { show } { -0.001 mul 0 cairo_font_matrix dtransform rmoveto } ifelse
  } forall
  currentpoint cairo_store_point
} bind def
/cairo_selectfont { cairo_font_matrix aload pop pop pop 0 0 6 array astore
    cairo_font exch selectfont cairo_point_x cairo_point_y moveto } bind def
/Tf { pop /cairo_font exch def /cairo_font_matrix where
      { pop cairo_selectfont } if } bind def
/Td { matrix translate cairo_font_matrix matrix concatmatrix dup
      /cairo_font_matrix exch def dup 4 get exch 5 get cairo_store_point
      /cairo_font where { pop cairo_selectfont } if } bind def
/Tm { 2 copy 8 2 roll 6 array astore /cairo_font_matrix exch def
      cairo_store_point /cairo_font where { pop cairo_selectfont } if } bind def
/g { setgray } bind def
/rg { setrgbcolor } bind def
/d1 { setcachedevice } bind def
%%EndProlog
%%Page: 1 1
%%BeginPageSetup
%%PageBoundingBox: 0 -1 80 80
%%EndPageSetup
q 0 -1 80 81 rectclip q
0 g
28.531 63.75 m 31.562 64.855 33.93 66.375 34.598 67.535 c 35.344 65.617
 35.742 63.597 35.793 61.566 c 36 66.289 34.324 71.078 30.754 74.714 c 23.922
 81.671 12.742 81.773 5.785 74.941 c 2.148 71.371 0.383 66.613 0.504 61.89
 c 0.691 66.203 2.449 70.457 5.773 73.718 c 12.73 80.55 23.91 80.445 30.742
 73.488 c 32.078 72.125 33.148 70.605 33.957 68.984 c 32.645 69.375 29.938
 69.007 27.008 67.937 c 23.152 66.535 20.371 64.457 20.793 63.304 c 21.211
 62.148 24.676 62.347 28.531 63.75 c h
f
10.297 25.726 m 7.594 27.484 4.957 28.464 3.625 28.3 c 4.711 30.05 6.086
 31.582 7.676 32.843 c 3.781 30.171 0.961 25.953 0.199 20.914 c -1.254 11.269
 5.383 2.273 15.027 0.82 c 20.066 0.062 24.93 1.511 28.629 4.445 c 25.07
 2.003 20.617 0.855 16.012 1.546 c 6.371 3.003 -0.27 12 1.184 21.64 c 1.469
 23.527 2.043 25.3 2.852 26.918 c 3.328 25.632 5.25 23.691 7.867 21.992 
c 11.305 19.753 14.637 18.777 15.309 19.808 c 15.98 20.843 13.734 23.492
 10.297 25.726 c h
f
77.25 26.062 m 79.039 22.132 79.398 17.546 77.914 13.132 c 74.805 3.886
 64.793 -1.086 55.547 2.023 c 53.738 2.628 52.098 3.503 50.645 4.582 c 51.992
 4.828 54.234 6.382 56.367 8.664 c 59.164 11.66 60.707 14.773 59.805 15.613
 c 58.906 16.453 55.91 14.703 53.109 11.707 c 50.906 9.347 49.484 6.921 
49.414 5.585 c 47.879 6.957 46.609 8.578 45.645 10.359 c 47.598 6.062 51.262
 2.55 56.094 0.925 c 65.336 -2.184 75.348 2.793 78.457 12.035 c 80.082 16.867
 79.5 21.906 77.25 26.062 c h
f
63.77 15.746 m 64.781 16.832 64.77 18.5 63.773 19.57 c 64.836 19.039 67.656
 20.753 70.305 23.589 c 70.684 23.996 71.043 24.406 71.371 24.812 c 71.391
 24.789 71.406 24.765 71.422 24.746 c 71.406 24.769 71.391 24.793 71.375
 24.816 c 73.477 27.394 74.52 29.812 73.742 30.539 c 73 31.234 70.809 30.148
 68.488 28.05 c 67.105 29.125 65.461 29.914 63.633 30.304 c 59.789 31.121
 55.633 30 52.883 27.601 c 47.48 32.781 l 47.48 46.839 l 50.148 49.093 l
 50.586 48.687 51.223 48.296 51.707 47.925 c 55.762 44.839 60.809 43.773
 65.469 44.566 c 61.172 44.136 56.758 45.269 53.055 48.089 c 52.371 48.609
 51.758 49.171 51.172 49.769 c 61.195 59.531 l 61.949 59.105 62.891 59.035
 63.723 59.41 c 62.891 58.566 63.609 55.347 65.441 51.941 c 65.707 51.449
 65.98 50.98 66.258 50.535 c 66.23 50.527 66.207 50.519 66.18 50.511 c 66.207
 50.515 66.234 50.523 66.266 50.527 c 68.027 47.71 69.984 45.949 70.918 
46.449 c 71.82 46.933 71.496 49.355 70.254 52.226 c 71.715 53.191 72.988
 54.492 73.945 56.101 c 77.332 61.8 75.461 69.164 69.766 72.55 c 66.785 
74.324 63.355 74.656 60.273 73.757 c 63.137 74.382 66.238 73.964 68.957 
72.347 c 74.652 68.957 76.527 61.593 73.137 55.898 c 72.332 54.546 71.305
 53.41 70.129 52.507 c 69.902 53.011 69.648 53.527 69.371 54.046 c 67.539
 57.457 65.254 59.835 64.09 59.605 c 65.32 60.386 65.758 61.996 65.059 63.3
 c 64.324 64.664 62.625 65.175 61.258 64.445 c 59.949 63.742 59.426 62.144
 60.035 60.808 c 50.043 51.066 l 45.062 57.246 44.73 66.242 49.758 72.839
 c 50.914 74.355 52.27 75.632 53.758 76.664 c 53.555 75.308 54.309 72.683
 55.785 69.933 c 57.727 66.32 60.176 63.863 61.262 64.445 c 62.344 65.027
 61.652 68.425 59.711 72.043 c 58.184 74.882 56.344 77.007 55.098 77.503
 c 56.891 78.519 58.836 79.199 60.836 79.543 c 56.133 79.07 51.633 76.726
 48.543 72.675 c 43.363 65.875 43.871 56.253 49.297 50.07 c 47.18 47.734
 l 33.082 47.734 l 27.676 53.55 l 29.797 56.226 30.594 59.671 30.152 62.816
 c 30.359 59.89 29.504 56.949 27.512 54.488 c 27.43 54.382 27.344 54.316
 27.258 54.214 c 20.637 61.019 l 20.992 61.695 21.07 62.519 20.789 63.293
 c 20.262 64.75 18.648 65.503 17.195 64.972 c 15.805 64.468 15.059 62.976
 15.457 61.578 c 14.742 62.523 11.453 62.269 7.816 60.945 c 7.293 60.753
 6.789 60.55 6.312 60.339 c 6.309 60.367 6.301 60.394 6.297 60.425 c 6.301
 60.394 6.301 60.367 6.305 60.339 c 3.266 58.992 1.238 57.312 1.602 56.312
 c 1.953 55.355 4.395 55.328 7.414 56.148 c 8.16 54.562 9.27 53.117 10.723
 51.941 c 15.453 48.117 22.48 48.476 26.781 52.539 c 32.281 47.183 l 32.281
 33.207 l 26.672 28.007 l 24.66 29.789 21.898 30.906 19.004 31.007 c 15.543
 31.128 12.305 29.773 10.031 27.503 c 12.246 29.429 15.129 30.55 18.293 
30.441 c 21.195 30.339 23.801 29.214 25.816 27.425 c 18.977 20.761 l 17.707
 21.433 16.109 21.035 15.312 19.812 c 14.469 18.511 14.832 16.773 16.133
 15.929 c 17.371 15.121 19.012 15.421 19.895 16.582 c 19.566 15.445 21.742
 12.968 24.988 10.859 c 25.457 10.554 25.922 10.273 26.379 10.019 c 26.359
 10 26.34 9.976 26.32 9.957 c 26.34 9.976 26.363 9.996 26.383 10.015 c 29.285
 8.394 31.848 7.789 32.43 8.679 c 32.984 9.535 31.535 11.5 29.066 13.421
 c 29.883 14.972 30.375 16.726 30.441 18.593 c 30.547 21.699 29.469 24.195
 27.605 26.39 c 32.652 30.933 l 46.832 30.933 l 52.02 25.996 l 50.754 24.519
 49.828 22.906 49.398 20.875 c 48.676 17.488 49.465 14.222 51.301 11.589
 c 49.793 14.105 49.191 17.222 49.852 20.316 c 50.297 22.406 51.262 24.277
 52.578 25.773 c 59.242 18.953 l 58.668 17.863 58.863 16.488 59.809 15.609
 c 60.938 14.55 62.715 14.617 63.77 15.746 c h
64.09 29.605 m 65.625 29.277 67.031 28.668 68.266 27.843 c 67.859 27.468
 67.453 27.062 67.047 26.628 c 64.402 23.796 62.883 20.863 63.484 19.843
 c 62.617 20.543 61.441 20.648 60.48 20.175 c 53.816 27.011 l 56.555 29.332
 60.301 30.41 64.09 29.605 c h
10.633 52.769 m 9.41 53.757 8.434 54.937 7.711 56.23 c 8.238 56.382 8.785
 56.558 9.344 56.761 c 12.977 58.085 15.66 60.007 15.598 61.191 c 16.195
 59.863 17.727 59.199 19.113 59.707 c 19.211 59.742 19.305 59.785 19.398
 59.828 c 26.031 53.023 l 21.723 49.285 15.227 49.058 10.633 52.769 c h
29.832 18.027 m 29.777 16.453 29.422 14.964 28.824 13.609 c 28.383 13.941
 27.914 14.273 27.418 14.593 c 24.172 16.703 21.027 17.691 20.117 16.929
 c 20.574 17.753 20.57 18.722 20.176 19.523 c 27.012 26.187 l 28.863 23.988
 29.941 21.125 29.832 18.027 c h
f
Q Q
showpage
%%Trailer
end restore
%%EOF
