%!PS-Adobe-3.0 EPSF-3.0
%%Title: move_00.fig
%%Creator: fig2dev Version 3.2 Patchlevel 5d
%%CreationDate: Fri Dec  9 19:12:46 2011
%%For: milan@latitude (Milan)
%%BoundingBox: 0 0 228 208
%Magnification: 1.0000
%%EndComments
%%BeginProlog
/$F2psDict 200 dict def
$F2psDict begin
$F2psDict /mtrx matrix put
/col-1 {0 setgray} bind def
/col0 {0.000 0.000 0.000 srgb} bind def
/col1 {0.000 0.000 1.000 srgb} bind def
/col2 {0.000 1.000 0.000 srgb} bind def
/col3 {0.000 1.000 1.000 srgb} bind def
/col4 {1.000 0.000 0.000 srgb} bind def
/col5 {1.000 0.000 1.000 srgb} bind def
/col6 {1.000 1.000 0.000 srgb} bind def
/col7 {1.000 1.000 1.000 srgb} bind def
/col8 {0.000 0.000 0.560 srgb} bind def
/col9 {0.000 0.000 0.690 srgb} bind def
/col10 {0.000 0.000 0.820 srgb} bind def
/col11 {0.530 0.810 1.000 srgb} bind def
/col12 {0.000 0.560 0.000 srgb} bind def
/col13 {0.000 0.690 0.000 srgb} bind def
/col14 {0.000 0.820 0.000 srgb} bind def
/col15 {0.000 0.560 0.560 srgb} bind def
/col16 {0.000 0.690 0.690 srgb} bind def
/col17 {0.000 0.820 0.820 srgb} bind def
/col18 {0.560 0.000 0.000 srgb} bind def
/col19 {0.690 0.000 0.000 srgb} bind def
/col20 {0.820 0.000 0.000 srgb} bind def
/col21 {0.560 0.000 0.560 srgb} bind def
/col22 {0.690 0.000 0.690 srgb} bind def
/col23 {0.820 0.000 0.820 srgb} bind def
/col24 {0.500 0.190 0.000 srgb} bind def
/col25 {0.630 0.250 0.000 srgb} bind def
/col26 {0.750 0.380 0.000 srgb} bind def
/col27 {1.000 0.500 0.500 srgb} bind def
/col28 {1.000 0.630 0.630 srgb} bind def
/col29 {1.000 0.750 0.750 srgb} bind def
/col30 {1.000 0.880 0.880 srgb} bind def
/col31 {1.000 0.840 0.000 srgb} bind def

end

/cp {closepath} bind def
/ef {eofill} bind def
/gr {grestore} bind def
/gs {gsave} bind def
/sa {save} bind def
/rs {restore} bind def
/l {lineto} bind def
/m {moveto} bind def
/rm {rmoveto} bind def
/n {newpath} bind def
/s {stroke} bind def
/sh {show} bind def
/slc {setlinecap} bind def
/slj {setlinejoin} bind def
/slw {setlinewidth} bind def
/srgb {setrgbcolor} bind def
/rot {rotate} bind def
/sc {scale} bind def
/sd {setdash} bind def
/ff {findfont} bind def
/sf {setfont} bind def
/scf {scalefont} bind def
/sw {stringwidth} bind def
/tr {translate} bind def
/tnt {dup dup currentrgbcolor
  4 -2 roll dup 1 exch sub 3 -1 roll mul add
  4 -2 roll dup 1 exch sub 3 -1 roll mul add
  4 -2 roll dup 1 exch sub 3 -1 roll mul add srgb}
  bind def
/shd {dup dup currentrgbcolor 4 -2 roll mul 4 -2 roll mul
  4 -2 roll mul srgb} bind def
 /DrawEllipse {
	/endangle exch def
	/startangle exch def
	/yrad exch def
	/xrad exch def
	/y exch def
	/x exch def
	/savematrix mtrx currentmatrix def
	x y tr xrad yrad sc 0 0 1 startangle endangle arc
	closepath
	savematrix setmatrix
	} def

/$F2psBegin {$F2psDict begin /$F2psEnteredState save def} def
/$F2psEnd {$F2psEnteredState restore end} def

/pageheader {
save
newpath 0 208 moveto 0 0 lineto 228 0 lineto 228 208 lineto closepath clip newpath
-111.6 500.4 translate
1 -1 scale
$F2psBegin
10 setmiterlimit
0 slj 0 slc
 0.06000 0.06000 sc
} bind def
/pagefooter {
$F2psEnd
restore
} bind def
%%EndProlog
pageheader
%
% Fig objects follow
%
% 
% here starts figure with depth 50
% Polyline
0 slj
0 slc
7.500 slw
gs  clippath
4405 7455 m 4590 7455 l 4590 7395 l 4405 7395 l 4405 7395 l 4555 7425 l 4405 7455 l cp
eoclip
n 4200 7425 m
 4575 7425 l gs 0.00 setgray ef gr gs col0 s gr gr

% arrowhead
n 4405 7455 m 4555 7425 l 4405 7395 l 4435 7425 l 4405 7455 l 
 cp gs 0.00 setgray ef gr  col0 s
/Times-Bold ff 300.00 scf sf
4200 7725 m
gs 1 -1 sc (d) col0 sh gr
/Times-Bold ff 300.00 scf sf
4350 7800 m
gs 1 -1 sc (p) col0 sh gr
% Ellipse
n 3999 6300 84 84 0 360 DrawEllipse gs 0.55 setgray ef gr gs col0 s gr

% Ellipse
 [15 30] 30 sd
1 slc
n 3300 6300 903 903 0 360 DrawEllipse gs col0 s gr
 [] 0 sd
% Ellipse
n 3314 6293 84 84 0 360 DrawEllipse gs 0.00 setgray ef gr gs col0 s gr

% Ellipse
 [15 30] 30 sd
n 3000 6075 903 903 0 360 DrawEllipse gs col0 s gr
 [] 0 sd
% Ellipse
n 3014 6068 84 84 0 360 DrawEllipse gs 0.00 setgray ef gr gs col0 s gr

% Ellipse
 [15 30] 30 sd
n 4575 6450 903 903 0 360 DrawEllipse gs col0 s gr
 [] 0 sd
% Ellipse
n 4589 6443 84 84 0 360 DrawEllipse gs 0.00 setgray ef gr gs col0 s gr

% Ellipse
 [15 30] 30 sd
n 3825 6000 903 903 0 360 DrawEllipse gs col0 s gr
 [] 0 sd
% Ellipse
n 3839 5993 84 84 0 360 DrawEllipse gs 0.00 setgray ef gr gs col0 s gr

% Polyline
0 slc
n 4905 8100 m 4800 8100 4800 8220 105 arcto 4 {pop} repeat
  4800 8325 4995 8325 105 arcto 4 {pop} repeat
  5100 8325 5100 8205 105 arcto 4 {pop} repeat
  5100 8100 4905 8100 105 arcto 4 {pop} repeat
 cp gs col2 1.00 shd ef gr gs col13 s gr 
% Polyline
n 3300 6300 m
 2475 6600 l gs 0.00 setgray ef gr gs col0 s gr 
% Polyline
15.000 slw
n 3300 6300 m
 3825 6000 l gs 0.00 setgray ef gr gs col0 s gr 
% Polyline
7.500 slw
n 2430 5475 m 2325 5475 2325 5595 105 arcto 4 {pop} repeat
  2325 5700 2520 5700 105 arcto 4 {pop} repeat
  2625 5700 2625 5580 105 arcto 4 {pop} repeat
  2625 5475 2430 5475 105 arcto 4 {pop} repeat
 cp gs col20 1.00 shd ef gr gs col18 s gr 
% Polyline
 [15 75] 75 sd
n 2475 5625 m
 4950 8175 l gs col0 s gr  [] 0 sd
% Polyline
15.000 slw
n 3000 6075 m
 3300 6300 l gs col0 s gr 
% Polyline
 [68] 0 sd
gs  clippath
4843 7963 m 4930 8127 l 4983 8099 l 4896 7935 l 4896 7935 l 4941 8082 l 4843 7963 l cp
eoclip
n 3825 6000 m
 4950 8100 l gs 0.00 setgray ef gr gs col10 s gr gr
 [] 0 sd
% arrowhead
7.500 slw
n 4843 7963 m 4941 8082 l 4896 7935 l 4884 7976 l 4843 7963 l 
 cp gs col10 1.00 shd ef gr  col10 s
% Polyline
15.000 slw
n 3825 6000 m
 4575 6450 l gs 0.00 setgray ef gr gs col0 s gr 
/Times-Bold ff 300.00 scf sf
3675 5925 m
gs 1 -1 sc (v) col0 sh gr
/Times-Bold ff 300.00 scf sf
4725 6525 m
gs 1 -1 sc (w) col0 sh gr
/Times-Bold ff 200.00 scf sf
2775 6450 m
gs 1 -1 sc (R) col0 sh gr
/Times-Bold ff 300.00 scf sf
3375 6600 m
gs 1 -1 sc (u) col0 sh gr
/Times-Bold ff 300.00 scf sf
1875 5100 m
gs 1 -1 sc (Base Station) col0 sh gr
/Times-Bold ff 300.00 scf sf
5175 8325 m
gs 1 -1 sc (PoI) col0 sh gr
/Times-Bold ff 300.00 scf sf
3000 5925 m
gs 1 -1 sc (x) col0 sh gr
% here ends figure;
pagefooter
showpage
%%Trailer
%EOF
