%!PS-Adobe-3.0 EPSF-3.0
%%Creator: cairo 1.14.2 (http://cairographics.org)
%%CreationDate: Thu Apr 30 14:34:43 2015
%%Pages: 1
%%DocumentData: Clean7Bit
%%LanguageLevel: 2
%%BoundingBox: 2 20 78 60
%%EndComments
%%BeginProlog
save
50 dict begin
/q { gsave } bind def
/Q { grestore } bind def
/cm { 6 array astore concat } bind def
/w { setlinewidth } bind def
/J { setlinecap } bind def
/j { setlinejoin } bind def
/M { setmiterlimit } bind def
/d { setdash } bind def
/m { moveto } bind def
/l { lineto } bind def
/c { curveto } bind def
/h { closepath } bind def
/re { exch dup neg 3 1 roll 5 3 roll moveto 0 rlineto
      0 exch rlineto 0 rlineto closepath } bind def
/S { stroke } bind def
/f { fill } bind def
/f* { eofill } bind def
/n { newpath } bind def
/W { clip } bind def
/W* { eoclip } bind def
/BT { } bind def
/ET { } bind def
/pdfmark where { pop globaldict /?pdfmark /exec load put }
    { globaldict begin /?pdfmark /pop load def /pdfmark
    /cleartomark load def end } ifelse
/BDC { mark 3 1 roll /BDC pdfmark } bind def
/EMC { mark /EMC pdfmark } bind def
/cairo_store_point { /cairo_point_y exch def /cairo_point_x exch def } def
/Tj { show currentpoint cairo_store_point } bind def
/TJ {
  {
    dup
    type /stringtype eq
    { show } { -0.001 mul 0 cairo_font_matrix dtransform rmoveto } ifelse
  } forall
  currentpoint cairo_store_point
} bind def
/cairo_selectfont { cairo_font_matrix aload pop pop pop 0 0 6 array astore
    cairo_font exch selectfont cairo_point_x cairo_point_y moveto } bind def
/Tf { pop /cairo_font exch def /cairo_font_matrix where
      { pop cairo_selectfont } if } bind def
/Td { matrix translate cairo_font_matrix matrix concatmatrix dup
      /cairo_font_matrix exch def dup 4 get exch 5 get cairo_store_point
      /cairo_font where { pop cairo_selectfont } if } bind def
/Tm { 2 copy 8 2 roll 6 array astore /cairo_font_matrix exch def
      cairo_store_point /cairo_font where { pop cairo_selectfont } if } bind def
/g { setgray } bind def
/rg { setrgbcolor } bind def
/d1 { setcachedevice } bind def
%%EndProlog
%%BeginSetup
%%EndSetup
%%Page: 1 1
%%BeginPageSetup
%%PageBoundingBox: 2 20 78 60
%%EndPageSetup
q 2 20 76 40 rectclip q
0.980392 0.411765 0 rg
32.297 33.969 m 32.043 33.719 l 30.621 32.297 29.785 30.285 29.785 28.191
 c 29.785 23.836 33.383 20.238 37.738 20.238 c 39.918 20.238 41.844 21.074
 43.266 22.496 c 43.516 22.832 l 69.309 59.762 l h
37.656 24.34 m 35.395 24.34 33.551 26.184 33.551 28.445 c 33.551 30.703
 35.395 32.547 37.656 32.547 c 39.918 32.547 41.758 30.703 41.758 28.445
 c 41.758 26.184 39.918 24.34 37.656 24.34 c h
37.656 24.34 m f
0 g
64.535 50.383 m 59.094 42.598 l 64.703 37.402 68.223 30.035 68.223 21.91
 c 77.602 21.91 l 77.602 33.301 72.492 43.434 64.535 50.383 c h
64.535 50.383 m f
40 59.512 m 19.23 59.512 2.398 42.68 2.398 21.91 c 11.777 21.91 l 11.777
 37.402 24.426 50.051 40 50.051 c 43.684 50.051 47.117 49.379 50.383 48.039
 c 59.176 54.234 l 53.566 57.586 47.035 59.512 40 59.512 c h
40 59.512 m f
Q Q
showpage
%%Trailer
end restore
%%EOF
