%!PS-Adobe-3.0 EPSF-3.0
%%Creator: cairo 1.12.16 (http://cairographics.org)
%%CreationDate: Mon May 26 18:41:06 2014
%%Pages: 1
%%DocumentData: Clean7Bit
%%LanguageLevel: 2
%%BoundingBox: 0 -1 70 57
%%EndComments
%%BeginProlog
save
50 dict begin
/q { gsave } bind def
/Q { grestore } bind def
/cm { 6 array astore concat } bind def
/w { setlinewidth } bind def
/J { setlinecap } bind def
/j { setlinejoin } bind def
/M { setmiterlimit } bind def
/d { setdash } bind def
/m { moveto } bind def
/l { lineto } bind def
/c { curveto } bind def
/h { closepath } bind def
/re { exch dup neg 3 1 roll 5 3 roll moveto 0 rlineto
      0 exch rlineto 0 rlineto closepath } bind def
/S { stroke } bind def
/f { fill } bind def
/f* { eofill } bind def
/n { newpath } bind def
/W { clip } bind def
/W* { eoclip } bind def
/BT { } bind def
/ET { } bind def
/pdfmark where { pop globaldict /?pdfmark /exec load put }
    { globaldict begin /?pdfmark /pop load def /pdfmark
    /cleartomark load def end } ifelse
/BDC { mark 3 1 roll /BDC pdfmark } bind def
/EMC { mark /EMC pdfmark } bind def
/cairo_store_point { /cairo_point_y exch def /cairo_point_x exch def } def
/Tj { show currentpoint cairo_store_point } bind def
/TJ {
  {
    dup
    type /stringtype eq
    { show } { -0.001 mul 0 cairo_font_matrix dtransform rmoveto } ifelse
  } forall
  currentpoint cairo_store_point
} bind def
/cairo_selectfont { cairo_font_matrix aload pop pop pop 0 0 6 array astore
    cairo_font exch selectfont cairo_point_x cairo_point_y moveto } bind def
/Tf { pop /cairo_font exch def /cairo_font_matrix where
      { pop cairo_selectfont } if } bind def
/Td { matrix translate cairo_font_matrix matrix concatmatrix dup
      /cairo_font_matrix exch def dup 4 get exch 5 get cairo_store_point
      /cairo_font where { pop cairo_selectfont } if } bind def
/Tm { 2 copy 8 2 roll 6 array astore /cairo_font_matrix exch def
      cairo_store_point /cairo_font where { pop cairo_selectfont } if } bind def
/g { setgray } bind def
/rg { setrgbcolor } bind def
/d1 { setcachedevice } bind def
%%EndProlog
%%Page: 1 1
%%BeginPageSetup
%%PageBoundingBox: 0 -1 70 57
%%EndPageSetup
q 0 -1 70 58 rectclip q
0 g
68.059 30.478 m 68.055 30.478 l 67.98 30.771 67.734 30.99 67.445 30.99 
c 61.367 30.99 l 61.367 31.501 l 62.875 31.501 l 63.227 31.501 63.484 31.791
 63.484 32.142 c 63.484 37.861 l 63.688 37.861 l 64.043 37.861 64.363 38.13
 64.363 38.482 c 64.363 43.017 l 64.363 43.029 64.355 43.037 64.355 43.048
 c 65.188 43.048 l 65.539 43.048 65.824 43.334 65.824 43.685 c 65.824 51.255
 l 65.824 51.607 65.539 51.892 65.188 51.892 c 60.672 51.892 l 60.961 55.525
 l 60.961 55.876 60.676 56.13 60.324 56.13 c 56.461 56.13 l 56.109 56.13
 55.824 55.876 55.824 55.525 c 56.117 51.892 l 51.551 51.892 l 51.199 51.892
 50.914 51.607 50.914 51.255 c 50.914 43.685 l 50.914 43.334 51.199 43.048
 51.551 43.048 c 52.527 43.048 l 52.527 43.037 52.523 43.029 52.523 43.017
 c 52.523 38.482 l 52.523 38.13 52.781 37.861 53.133 37.861 c 53.328 37.861
 l 53.328 32.142 l 53.328 31.794 53.598 31.501 53.949 31.501 c 55.445 31.501
 l 55.445 30.99 l 49.344 30.99 l 48.992 30.99 48.707 30.697 48.707 30.345
 c 48.707 30.345 44.41 16.001 49.906 10.509 c 50.477 1.084 l 50.477 0.732
 50.762 0.443 51.113 0.443 c 65.672 0.443 l 66.023 0.443 66.309 0.728 66.309
 1.08 c 66.891 10.705 l 72.332 16.224 68.059 30.478 68.059 30.478 c h
55.293 40.607 m 54.512 40.607 53.879 41.005 53.879 41.494 c 53.879 41.982
 54.512 42.38 55.293 42.38 c 56.078 42.38 56.711 41.982 56.711 41.494 c 
56.711 41.005 56.078 40.607 55.293 40.607 c h
57.242 36.763 m 57.953 43.048 l 59.438 43.048 l 60.148 36.763 l h
60.254 41.494 m 60.254 41.982 60.887 42.38 61.672 42.38 c 62.453 42.38 
63.086 41.982 63.086 41.494 c 63.086 41.005 62.453 40.607 61.672 40.607 
c 60.887 40.607 60.254 41.005 60.254 41.494 c h
f*
56.039 41.494 m 56.039 41.084 55.707 40.751 55.293 40.751 c 54.883 40.751
 54.551 41.084 54.551 41.494 c 54.551 41.904 54.883 42.236 55.293 42.236
 c 55.707 42.236 56.039 41.904 56.039 41.494 c h
f*
62.414 41.494 m 62.414 41.084 62.082 40.751 61.672 40.751 c 61.262 40.751
 60.926 41.084 60.926 41.494 c 60.926 41.904 61.262 42.236 61.672 42.236
 c 62.082 42.236 62.414 41.904 62.414 41.494 c h
f*
29.672 37.353 m 29.672 36.986 29.375 36.689 29.008 36.689 c 28.641 36.689
 28.34 36.986 28.34 37.353 c 28.34 37.72 28.641 38.021 29.008 38.021 c 29.375
 38.021 29.672 37.72 29.672 37.353 c h
f*
40.43 27.494 m 40.359 27.755 40.141 27.955 39.879 27.955 c 34.441 27.955
 l 34.441 28.412 l 35.789 28.412 l 36.105 28.412 36.34 28.669 36.34 28.986
 c 36.34 34.099 l 36.52 34.099 l 36.836 34.099 37.125 34.345 37.125 34.658
 c 37.125 38.716 l 37.125 39.033 36.836 39.267 36.52 39.267 c 36.34 39.267
 l 36.34 40.904 l 36.34 41.22 36.105 41.494 35.789 41.494 c 27.801 41.494
 l 27.484 41.494 27.246 41.22 27.246 40.904 c 27.246 39.267 l 27.074 39.267
 l 26.758 39.267 26.527 39.033 26.527 38.716 c 26.527 34.658 l 26.527 34.341
 26.758 34.099 27.074 34.099 c 27.246 34.099 l 27.246 28.986 l 27.246 28.669
 27.488 28.412 27.801 28.412 c 29.145 28.412 l 29.145 27.955 l 23.68 27.955
 l 23.367 27.955 23.109 27.689 23.109 27.373 c 23.109 27.373 19.266 14.537
 24.184 9.619 c 24.695 1.181 l 24.695 0.865 24.949 0.607 25.266 0.607 c 
38.297 0.607 l 38.613 0.607 38.867 0.865 38.867 1.181 c 39.391 9.794 l 44.254
 14.736 40.43 27.494 40.43 27.494 c h
29.008 36.564 m 28.305 36.564 27.738 36.916 27.738 37.353 c 27.738 37.794
 28.305 38.146 29.008 38.146 c 29.707 38.146 30.273 37.794 30.273 37.353
 c 30.273 36.916 29.707 36.564 29.008 36.564 c h
30.75 33.119 m 31.383 38.748 l 32.715 38.748 l 33.352 33.119 l h
33.445 37.353 m 33.445 37.794 34.012 38.146 34.711 38.146 c 35.414 38.146
 35.98 37.794 35.98 37.353 c 35.98 36.916 35.414 36.564 34.711 36.564 c 
34.012 36.564 33.445 36.916 33.445 37.353 c h
f*
35.379 37.353 m 35.379 36.986 35.078 36.689 34.711 36.689 c 34.344 36.689
 34.047 36.986 34.047 37.353 c 34.047 37.72 34.344 38.021 34.711 38.021 
c 35.078 38.021 35.379 37.72 35.379 37.353 c h
f*
15.48 22.197 m 15.422 22.412 15.242 22.576 15.023 22.576 c 10.535 22.576
 l 10.535 22.955 l 11.648 22.955 l 11.91 22.955 12.102 23.169 12.102 23.427
 c 12.102 27.65 l 12.25 27.65 l 12.512 27.65 12.75 27.853 12.75 28.111 c
 12.75 31.462 l 12.75 31.47 12.742 31.478 12.742 31.486 c 13.355 31.486 
l 13.617 31.486 13.828 31.697 13.828 31.955 c 13.828 37.548 l 13.828 37.81
 13.617 38.021 13.355 38.021 c 3.285 38.021 l 3.023 38.021 2.812 37.81 2.812
 37.548 c 2.812 31.955 l 2.812 31.697 3.023 31.486 3.285 31.486 c 4.004 
31.486 l 4.004 31.478 4 31.47 4 31.462 c 4 28.111 l 4 27.853 4.191 27.65
 4.453 27.65 c 4.594 27.65 l 4.594 23.427 l 4.594 23.169 4.793 22.955 5.055
 22.955 c 6.16 22.955 l 6.16 22.576 l 1.652 22.576 l 1.391 22.576 1.18 22.357
 1.18 22.099 c 1.18 22.099 -1.992 11.501 2.066 7.439 c 2.488 0.474 l 2.488
 0.212 2.699 0.001 2.961 0.001 c 13.719 0.001 l 13.977 0.001 14.188 0.212
 14.188 0.47 c 14.621 7.584 l 18.637 11.662 15.48 22.197 15.48 22.197 c 
h
6.047 29.681 m 5.469 29.681 5 29.974 5 30.337 c 5 30.697 5.469 30.99 6.047
 30.99 c 6.625 30.99 7.094 30.697 7.094 30.337 c 7.094 29.974 6.625 29.681
 6.047 29.681 c h
7.488 26.841 m 8.012 31.486 l 9.109 31.486 l 9.633 26.841 l h
9.711 30.337 m 9.711 30.697 10.18 30.99 10.758 30.99 c 11.34 30.99 11.809
 30.697 11.809 30.337 c 11.809 29.974 11.34 29.681 10.758 29.681 c 10.18
 29.681 9.711 29.974 9.711 30.337 c h
f*
6.598 30.337 m 6.598 30.033 6.352 29.787 6.047 29.787 c 5.742 29.787 5.5
 30.033 5.5 30.337 c 5.5 30.638 5.742 30.884 6.047 30.884 c 6.352 30.884
 6.598 30.638 6.598 30.337 c h
f*
11.309 30.337 m 11.309 30.033 11.062 29.787 10.758 29.787 c 10.457 29.787
 10.211 30.033 10.211 30.337 c 10.211 30.642 10.457 30.888 10.758 30.888
 c 11.062 30.888 11.309 30.642 11.309 30.337 c h
f*
Q Q
showpage
%%Trailer
end restore
%%EOF
