<?xml version="1.0" encoding="UTF-8" standalone="no"?>
<svg
   xmlns:dc="http://purl.org/dc/elements/1.1/"
   xmlns:cc="http://creativecommons.org/ns#"
   xmlns:rdf="http://www.w3.org/1999/02/22-rdf-syntax-ns#"
   xmlns:svg="http://www.w3.org/2000/svg"
   xmlns="http://www.w3.org/2000/svg"
   xmlns:sodipodi="http://sodipodi.sourceforge.net/DTD/sodipodi-0.dtd"
   xmlns:inkscape="http://www.inkscape.org/namespaces/inkscape"
   version="1.1"
   id="svg3434"
   viewBox="0 0 744.09448819 1052.3622047"
   height="297mm"
   width="210mm"
   inkscape:version="0.91 r13725"
   sodipodi:docname="d006.svg">
  <sodipodi:namedview
     pagecolor="#ffffff"
     bordercolor="#666666"
     borderopacity="1"
     objecttolerance="10"
     gridtolerance="10"
     guidetolerance="10"
     inkscape:pageopacity="0"
     inkscape:pageshadow="2"
     inkscape:window-width="1330"
     inkscape:window-height="1037"
     id="namedview3691"
     showgrid="false"
     inkscape:zoom="1.2202751"
     inkscape:cx="372.04724"
     inkscape:cy="690.07857"
     inkscape:window-x="2194"
     inkscape:window-y="31"
     inkscape:window-maximized="0"
     inkscape:current-layer="svg3434" />
  <defs
     id="defs3436" />
  <metadata
     id="metadata3439">
    <rdf:RDF>
      <cc:Work
         rdf:about="">
        <dc:format>image/svg+xml</dc:format>
        <dc:type
           rdf:resource="http://purl.org/dc/dcmitype/StillImage" />
        <dc:title></dc:title>
      </cc:Work>
    </rdf:RDF>
  </metadata>
  <rect
     style="opacity:1;fill:none;fill-opacity:1;stroke:#000000;stroke-width:1;stroke-linecap:round;stroke-linejoin:bevel;stroke-miterlimit:4;stroke-dasharray:none;stroke-dashoffset:0;stroke-opacity:1"
     id="rect3517"
     width="458.82993"
     height="287.29489"
     x="184.68701"
     y="89.555511" />
  <g
     id="g4926"
     transform="translate(-2,-35.899185)">
    <g
       id="g3474"
       transform="matrix(0.37488016,0,0,0.37488016,504.65456,178.664)">
      <path
         id="path3476"
         d="m 96,176 c 8.822,0 16,7.178 16,16 0,8.822 -7.178,16 -16,16 -8.822,0 -16,-7.178 -16,-16 0,-8.822 7.178,-16 16,-16 m 0,-16 c -17.673,0 -32,14.327 -32,32 0,17.673 14.327,32 32,32 17.673,0 32,-14.327 32,-32 0,-17.673 -14.327,-32 -32,-32 l 0,0 z"
         inkscape:connector-curvature="0" />
    </g>
    <g
       id="g3478"
       transform="matrix(0.37488016,0,0,0.37488016,457.51485,213.06324)">
      <path
         id="path3480"
         d="m 416,176 c 8.822,0 16,7.178 16,16 0,8.822 -7.178,16 -16,16 -8.822,0 -16,-7.178 -16,-16 0,-8.822 7.178,-16 16,-16 m 0,-16 c -17.673,0 -32,14.327 -32,32 0,17.673 14.327,32 32,32 17.673,0 32,-14.327 32,-32 0,-17.673 -14.327,-32 -32,-32 l 0,0 z"
         inkscape:connector-curvature="0" />
    </g>
    <g
       id="g3482"
       transform="matrix(0.37488016,0,0,0.37488016,446.04842,172.29375)">
      <path
         id="path3484"
         d="m 256,336 c 8.822,0 16,7.178 16,16 0,8.822 -7.178,16 -16,16 -8.822,0 -16,-7.178 -16,-16 0,-8.822 7.178,-16 16,-16 m 0,-16 c -17.673,0 -32,14.327 -32,32 0,17.673 14.327,32 32,32 17.673,0 32,-14.327 32,-32 0,-17.673 -14.327,-32 -32,-32 l 0,0 z"
         inkscape:connector-curvature="0" />
    </g>
    <g
       id="g3474-9"
       transform="matrix(0.37488016,0,0,0.37488016,529.68804,77.975727)">
      <path
         id="path3476-7"
         d="m 96,176 c 8.822,0 16,7.178 16,16 0,8.822 -7.178,16 -16,16 -8.822,0 -16,-7.178 -16,-16 0,-8.822 7.178,-16 16,-16 m 0,-16 c -17.673,0 -32,14.327 -32,32 0,17.673 14.327,32 32,32 17.673,0 32,-14.327 32,-32 0,-17.673 -14.327,-32 -32,-32 l 0,0 z"
         inkscape:connector-curvature="0" />
    </g>
    <g
       id="g3474-0"
       transform="matrix(0.37488016,0,0,0.37488016,590.11631,122.01924)">
      <path
         id="path3476-0"
         d="m 96,176 c 8.822,0 16,7.178 16,16 0,8.822 -7.178,16 -16,16 -8.822,0 -16,-7.178 -16,-16 0,-8.822 7.178,-16 16,-16 m 0,-16 c -17.673,0 -32,14.327 -32,32 0,17.673 14.327,32 32,32 17.673,0 32,-14.327 32,-32 0,-17.673 -14.327,-32 -32,-32 l 0,0 z"
         inkscape:connector-curvature="0" />
    </g>
    <path
       inkscape:connector-curvature="0"
       id="path3793"
       d="m 581.51319,160.87104 31.85116,20.38474"
       style="fill:none;fill-rule:evenodd;stroke:#000000;stroke-width:1px;stroke-linecap:butt;stroke-linejoin:miter;stroke-opacity:1" />
    <path
       inkscape:connector-curvature="0"
       id="path3795"
       d="m 613.36434,201.64052 -58.60613,38.22139"
       style="fill:none;fill-rule:evenodd;stroke:#000000;stroke-width:1px;stroke-linecap:butt;stroke-linejoin:miter;stroke-opacity:1" />
    <path
       inkscape:connector-curvature="0"
       id="path3797"
       d="m 550.93607,261.5207 45.86566,20.38474"
       style="fill:none;fill-rule:evenodd;stroke:#000000;stroke-width:1px;stroke-linecap:butt;stroke-linejoin:miter;stroke-opacity:1" />
    <path
       inkscape:connector-curvature="0"
       id="path3799"
       d="m 539.46966,269.16497 0,19.1107"
       style="fill:none;fill-rule:evenodd;stroke:#000000;stroke-width:1px;stroke-linecap:butt;stroke-linejoin:miter;stroke-opacity:1" />
    <path
       inkscape:connector-curvature="0"
       id="path3801"
       d="m 563.67654,303.56422 38.22139,-6.37023"
       style="fill:none;fill-rule:evenodd;stroke:#000000;stroke-width:1px;stroke-linecap:butt;stroke-linejoin:miter;stroke-opacity:1" />
    <path
       inkscape:connector-curvature="0"
       id="path3803"
       d="m 623.55671,210.55885 -10.19237,59.88017"
       style="fill:none;fill-rule:evenodd;stroke:#000000;stroke-width:1px;stroke-linecap:butt;stroke-linejoin:miter;stroke-opacity:1" />
  </g>
  <g
     id="g5293"
     transform="translate(-6,-42)">
    <g
       transform="matrix(0,1,-1,0,487.64119,-34.028225)"
       id="g4921">
      <rect
         style="opacity:1;fill:#ffffff;fill-opacity:1;stroke:#69d2e7;stroke-width:5;stroke-linecap:round;stroke-linejoin:round;stroke-miterlimit:6;stroke-dasharray:none;stroke-dashoffset:0;stroke-opacity:1"
         id="rect3805-3"
         width="67.020821"
         height="95.049843"
         x="246.14272"
         y="184.3515" />
      <rect
         style="opacity:1;fill:#ffffff;fill-opacity:1;stroke:#69d2e7;stroke-width:5;stroke-linecap:round;stroke-linejoin:round;stroke-miterlimit:6;stroke-dasharray:none;stroke-dashoffset:0;stroke-opacity:1"
         id="rect3805-3-8"
         width="67.020821"
         height="95.049843"
         x="234.03931"
         y="174.15912" />
      <rect
         style="opacity:1;fill:#ffffff;fill-opacity:1;stroke:#69d2e7;stroke-width:5;stroke-linecap:round;stroke-linejoin:round;stroke-miterlimit:6;stroke-dasharray:none;stroke-dashoffset:0;stroke-opacity:1"
         id="rect3805-3-3"
         width="67.020821"
         height="95.049843"
         x="221.29883"
         y="161.41867" />
    </g>
    <text
       sodipodi:linespacing="125%"
       id="text5110"
       y="212.76572"
       x="245.89091"
       style="font-style:normal;font-variant:normal;font-weight:normal;font-stretch:normal;font-size:20px;line-height:125%;font-family:'Nimbus Roman No9 L';-inkscape-font-specification:'Nimbus Roman No9 L';text-align:start;letter-spacing:0px;word-spacing:0px;writing-mode:lr-tb;text-anchor:start;fill:#000000;fill-opacity:1;stroke:none;stroke-width:1px;stroke-linecap:butt;stroke-linejoin:miter;stroke-opacity:1"
       xml:space="preserve"><tspan
         y="212.76572"
         x="245.89091"
         id="tspan5112"
         sodipodi:role="line">PROTO</tspan><tspan
         id="tspan5114"
         y="237.76572"
         x="245.89091"
         sodipodi:role="line">COLES</tspan></text>
  </g>
  <g
     transform="matrix(0.74074072,0,0,0.74074072,391.58684,168.87126)"
     id="Your_Icon"
     style="fill:#fa6900;fill-opacity:1;stroke:#fa6900;stroke-opacity:1">
    <path
       style="fill:#fa6900;fill-opacity:1;stroke:#fa6900;stroke-opacity:1"
       inkscape:connector-curvature="0"
       d="M 0,0 47.888,56.88 62.167,49.213 75.052,60.209 80.639,36.236 100,23.246 0,0 Z m 69.351,43.663 1.571,8.103 -6.431,-5.487 4.86,-2.616 z m 7.663,-8.346 -3.636,15.6 -1.896,-9.76 -49.17,-29.112 54.702,23.272 z M 68.038,41.792 48.794,52.146 12.222,8.705 68.038,41.792 Z M 90.759,24.941 78.214,33.36 19.467,8.369 90.759,24.941 Z"
       id="path4891" />
  </g>
  <g
     id="g5289"
     transform="translate(-6,-35.221555)">
    <path
       style="fill:#e0e4cc;fill-opacity:1;stroke:#000000;stroke-opacity:1"
       id="path5075-3"
       d="m 525.81397,236.00864 -31.36444,0 8.38593,-8.38592 c 1.15703,-1.15704 1.15703,-3.03333 0,-4.19037 -1.15704,-1.15704 -3.03334,-1.15704 -4.19038,0 l -13.4437,13.4437 c 0,0 0,0 0,0 -0.13778,0.13778 -0.26074,0.29037 -0.36963,0.45259 -0.0444,0.0659 -0.0741,0.13852 -0.11259,0.20667 -0.0556,0.1 -0.11556,0.19704 -0.16,0.3037 -0.0356,0.0867 -0.0548,0.1763 -0.0822,0.26519 -0.0296,0.0956 -0.0659,0.18889 -0.0859,0.28889 -0.0296,0.15111 -0.04,0.30444 -0.0459,0.45778 -0.001,0.0407 -0.0119,0.0785 -0.0119,0.12 0,0.0459 0.0119,0.0889 0.0133,0.13407 0.007,0.14815 0.0156,0.2963 0.0452,0.44296 0.0207,0.10593 0.0585,0.20371 0.0904,0.30519 0.0259,0.083 0.0437,0.16741 0.077,0.24815 0.0474,0.11481 0.11111,0.22148 0.17259,0.32814 0.0341,0.06 0.06,0.12371 0.0985,0.18223 0.10963,0.16518 0.23482,0.31852 0.37482,0.45777 l 13.43999,13.44 c 0.57852,0.57852 1.33704,0.86815 2.09556,0.86815 0.75852,0 1.5163,-0.28963 2.09556,-0.86815 1.15703,-1.15703 1.15703,-3.03333 0,-4.18963 l -8.38593,-8.38518 31.3637,0 c 1.6363,0 2.96297,-1.32667 2.96297,-2.96296 0,-1.6363 -1.32667,-2.96297 -2.96297,-2.96297 z"
       inkscape:connector-curvature="0" />
    <path
       style="fill:#e0e4cc;fill-opacity:1;stroke:#000000;stroke-opacity:1"
       id="path5075-2"
       d="m 486.03667,210.91245 31.36444,0 -8.38593,-8.38592 c -1.15703,-1.15704 -1.15703,-3.03333 0,-4.19037 1.15704,-1.15704 3.03334,-1.15704 4.19038,0 l 13.4437,13.4437 c 0,0 0,0 0,0 0.13778,0.13778 0.26074,0.29037 0.36963,0.45259 0.0444,0.0659 0.0741,0.13852 0.11259,0.20667 0.0556,0.1 0.11556,0.19704 0.16,0.3037 0.0356,0.0867 0.0548,0.1763 0.0822,0.26519 0.0296,0.0956 0.0659,0.18889 0.0859,0.28889 0.0296,0.15111 0.04,0.30444 0.0459,0.45778 10e-4,0.0407 0.0119,0.0785 0.0119,0.12 0,0.0459 -0.0119,0.0889 -0.0133,0.13407 -0.007,0.14815 -0.0156,0.2963 -0.0452,0.44296 -0.0207,0.10593 -0.0585,0.20371 -0.0904,0.30519 -0.0259,0.083 -0.0437,0.16741 -0.077,0.24815 -0.0474,0.11481 -0.11111,0.22148 -0.17259,0.32814 -0.0341,0.06 -0.06,0.12371 -0.0985,0.18223 -0.10963,0.16518 -0.23482,0.31852 -0.37482,0.45777 l -13.43999,13.44 c -0.57852,0.57852 -1.33704,0.86815 -2.09556,0.86815 -0.75852,0 -1.5163,-0.28963 -2.09556,-0.86815 -1.15703,-1.15703 -1.15703,-3.03333 0,-4.18963 l 8.38593,-8.38518 -31.3637,0 c -1.6363,0 -2.96297,-1.32667 -2.96297,-2.96296 0,-1.6363 1.32667,-2.96297 2.96297,-2.96297 z"
       inkscape:connector-curvature="0" />
  </g>
  <g
     id="g5285"
     transform="translate(-6,-32.062685)">
    <path
       style="fill:#e0e4cc;fill-opacity:1;stroke:#000000;stroke-opacity:1"
       id="path5075"
       d="m 344.27258,232.23899 31.36444,0 -8.38593,-8.38592 c -1.15703,-1.15704 -1.15703,-3.03333 0,-4.19037 1.15704,-1.15704 3.03334,-1.15704 4.19038,0 l 13.4437,13.4437 c 0,0 0,0 0,0 0.13778,0.13778 0.26074,0.29037 0.36963,0.45259 0.0444,0.0659 0.0741,0.13852 0.11259,0.20667 0.0556,0.1 0.11556,0.19704 0.16,0.3037 0.0356,0.0867 0.0548,0.1763 0.0822,0.26519 0.0296,0.0956 0.0659,0.18889 0.0859,0.28889 0.0296,0.15111 0.04,0.30444 0.0459,0.45778 10e-4,0.0407 0.0119,0.0785 0.0119,0.12 0,0.0459 -0.0119,0.0889 -0.0133,0.13407 -0.007,0.14815 -0.0156,0.2963 -0.0452,0.44296 -0.0207,0.10593 -0.0585,0.20371 -0.0904,0.30519 -0.0259,0.083 -0.0437,0.16741 -0.077,0.24815 -0.0474,0.11481 -0.11111,0.22148 -0.17259,0.32814 -0.0341,0.06 -0.06,0.12371 -0.0985,0.18223 -0.10963,0.16518 -0.23482,0.31852 -0.37482,0.45777 l -13.43999,13.44 c -0.57852,0.57852 -1.33704,0.86815 -2.09556,0.86815 -0.75852,0 -1.5163,-0.28963 -2.09556,-0.86815 -1.15703,-1.15703 -1.15703,-3.03333 0,-4.18963 l 8.38593,-8.38518 -31.3637,0 c -1.6363,0 -2.96297,-1.32667 -2.96297,-2.96296 0,-1.6363 1.32667,-2.96297 2.96297,-2.96297 z"
       inkscape:connector-curvature="0" />
    <path
       style="fill:#e0e4cc;fill-opacity:1;stroke:#000000;stroke-opacity:1"
       id="path5075-3-9"
       d="m 383.94455,208.36436 -31.36444,0 8.38593,-8.38592 c 1.15703,-1.15704 1.15703,-3.03333 0,-4.19037 -1.15704,-1.15704 -3.03334,-1.15704 -4.19038,0 l -13.4437,13.4437 c 0,0 0,0 0,0 -0.13778,0.13778 -0.26074,0.29037 -0.36963,0.45259 -0.0444,0.0659 -0.0741,0.13852 -0.11259,0.20667 -0.0556,0.1 -0.11556,0.19704 -0.16,0.3037 -0.0356,0.0867 -0.0548,0.1763 -0.0822,0.26519 -0.0296,0.0956 -0.0659,0.18889 -0.0859,0.28889 -0.0296,0.15111 -0.04,0.30444 -0.0459,0.45778 -10e-4,0.0407 -0.0119,0.0785 -0.0119,0.12 0,0.0459 0.0119,0.0889 0.0133,0.13407 0.007,0.14815 0.0156,0.2963 0.0452,0.44296 0.0207,0.10593 0.0585,0.20371 0.0904,0.30519 0.0259,0.083 0.0437,0.16741 0.077,0.24815 0.0474,0.11481 0.11111,0.22148 0.17259,0.32814 0.0341,0.06 0.06,0.12371 0.0985,0.18223 0.10963,0.16518 0.23482,0.31852 0.37482,0.45777 l 13.43999,13.44 c 0.57852,0.57852 1.33704,0.86815 2.09556,0.86815 0.75852,0 1.5163,-0.28963 2.09556,-0.86815 1.15703,-1.15703 1.15703,-3.03333 0,-4.18963 l -8.38593,-8.38518 31.3637,0 c 1.6363,0 2.96297,-1.32667 2.96297,-2.96296 0,-1.6363 -1.32667,-2.96297 -2.96297,-2.96297 z"
       inkscape:connector-curvature="0" />
  </g>
  <text
     xml:space="preserve"
     style="font-style:normal;font-variant:normal;font-weight:normal;font-stretch:normal;font-size:20px;line-height:125%;font-family:'Nimbus Roman No9 L';-inkscape-font-specification:'Nimbus Roman No9 L';text-align:center;letter-spacing:0px;word-spacing:0px;writing-mode:lr-tb;text-anchor:middle;fill:#000000;fill-opacity:1;stroke:none;stroke-width:1px;stroke-linecap:butt;stroke-linejoin:miter;stroke-opacity:1"
     x="420.16125"
     y="340.65512"
     id="text5340"
     sodipodi:linespacing="125%"><tspan
       sodipodi:role="line"
       id="tspan5342"
       x="420.16125"
       y="340.65512">mobilité</tspan><tspan
       sodipodi:role="line"
       x="420.16125"
       y="365.65512"
       id="tspan5344">contrôlée</tspan></text>
  <g
     id="g5285-3"
     transform="translate(-27.505422,123.7354)">
    <path
       style="fill:#e0e4cc;fill-opacity:1;stroke:#000000;stroke-opacity:1"
       id="path5075-4"
       d="m 344.27258,232.23899 31.36444,0 -8.38593,-8.38592 c -1.15703,-1.15704 -1.15703,-3.03333 0,-4.19037 1.15704,-1.15704 3.03334,-1.15704 4.19038,0 l 13.4437,13.4437 c 0,0 0,0 0,0 0.13778,0.13778 0.26074,0.29037 0.36963,0.45259 0.0444,0.0659 0.0741,0.13852 0.11259,0.20667 0.0556,0.1 0.11556,0.19704 0.16,0.3037 0.0356,0.0867 0.0548,0.1763 0.0822,0.26519 0.0296,0.0956 0.0659,0.18889 0.0859,0.28889 0.0296,0.15111 0.04,0.30444 0.0459,0.45778 10e-4,0.0407 0.0119,0.0785 0.0119,0.12 0,0.0459 -0.0119,0.0889 -0.0133,0.13407 -0.007,0.14815 -0.0156,0.2963 -0.0452,0.44296 -0.0207,0.10593 -0.0585,0.20371 -0.0904,0.30519 -0.0259,0.083 -0.0437,0.16741 -0.077,0.24815 -0.0474,0.11481 -0.11111,0.22148 -0.17259,0.32814 -0.0341,0.06 -0.06,0.12371 -0.0985,0.18223 -0.10963,0.16518 -0.23482,0.31852 -0.37482,0.45777 l -13.43999,13.44 c -0.57852,0.57852 -1.33704,0.86815 -2.09556,0.86815 -0.75852,0 -1.5163,-0.28963 -2.09556,-0.86815 -1.15703,-1.15703 -1.15703,-3.03333 0,-4.18963 l 8.38593,-8.38518 -31.3637,0 c -1.6363,0 -2.96297,-1.32667 -2.96297,-2.96296 0,-1.6363 1.32667,-2.96297 2.96297,-2.96297 z"
       inkscape:connector-curvature="0" />
    <path
       style="fill:#e0e4cc;fill-opacity:1;stroke:#000000;stroke-opacity:1"
       id="path5075-3-9-6"
       d="m 383.94455,208.36436 -31.36444,0 8.38593,-8.38592 c 1.15703,-1.15704 1.15703,-3.03333 0,-4.19037 -1.15704,-1.15704 -3.03334,-1.15704 -4.19038,0 l -13.4437,13.4437 c 0,0 0,0 0,0 -0.13778,0.13778 -0.26074,0.29037 -0.36963,0.45259 -0.0444,0.0659 -0.0741,0.13852 -0.11259,0.20667 -0.0556,0.1 -0.11556,0.19704 -0.16,0.3037 -0.0356,0.0867 -0.0548,0.1763 -0.0822,0.26519 -0.0296,0.0956 -0.0659,0.18889 -0.0859,0.28889 -0.0296,0.15111 -0.04,0.30444 -0.0459,0.45778 -10e-4,0.0407 -0.0119,0.0785 -0.0119,0.12 0,0.0459 0.0119,0.0889 0.0133,0.13407 0.007,0.14815 0.0156,0.2963 0.0452,0.44296 0.0207,0.10593 0.0585,0.20371 0.0904,0.30519 0.0259,0.083 0.0437,0.16741 0.077,0.24815 0.0474,0.11481 0.11111,0.22148 0.17259,0.32814 0.0341,0.06 0.06,0.12371 0.0985,0.18223 0.10963,0.16518 0.23482,0.31852 0.37482,0.45777 l 13.43999,13.44 c 0.57852,0.57852 1.33704,0.86815 2.09556,0.86815 0.75852,0 1.5163,-0.28963 2.09556,-0.86815 1.15703,-1.15703 1.15703,-3.03333 0,-4.18963 l -8.38593,-8.38518 31.3637,0 c 1.6363,0 2.96297,-1.32667 2.96297,-2.96296 0,-1.6363 -1.32667,-2.96297 -2.96297,-2.96297 z"
       inkscape:connector-curvature="0" />
  </g>
  <g
     id="g5289-4"
     transform="translate(-1.482155,118.38166)">
    <path
       style="fill:#e0e4cc;fill-opacity:1;stroke:#000000;stroke-opacity:1"
       id="path5075-3-1"
       d="m 525.81397,236.00864 -31.36444,0 8.38593,-8.38592 c 1.15703,-1.15704 1.15703,-3.03333 0,-4.19037 -1.15704,-1.15704 -3.03334,-1.15704 -4.19038,0 l -13.4437,13.4437 c 0,0 0,0 0,0 -0.13778,0.13778 -0.26074,0.29037 -0.36963,0.45259 -0.0444,0.0659 -0.0741,0.13852 -0.11259,0.20667 -0.0556,0.1 -0.11556,0.19704 -0.16,0.3037 -0.0356,0.0867 -0.0548,0.1763 -0.0822,0.26519 -0.0296,0.0956 -0.0659,0.18889 -0.0859,0.28889 -0.0296,0.15111 -0.04,0.30444 -0.0459,0.45778 -0.001,0.0407 -0.0119,0.0785 -0.0119,0.12 0,0.0459 0.0119,0.0889 0.0133,0.13407 0.007,0.14815 0.0156,0.2963 0.0452,0.44296 0.0207,0.10593 0.0585,0.20371 0.0904,0.30519 0.0259,0.083 0.0437,0.16741 0.077,0.24815 0.0474,0.11481 0.11111,0.22148 0.17259,0.32814 0.0341,0.06 0.06,0.12371 0.0985,0.18223 0.10963,0.16518 0.23482,0.31852 0.37482,0.45777 l 13.43999,13.44 c 0.57852,0.57852 1.33704,0.86815 2.09556,0.86815 0.75852,0 1.5163,-0.28963 2.09556,-0.86815 1.15703,-1.15703 1.15703,-3.03333 0,-4.18963 l -8.38593,-8.38518 31.3637,0 c 1.6363,0 2.96297,-1.32667 2.96297,-2.96296 0,-1.6363 -1.32667,-2.96297 -2.96297,-2.96297 z"
       inkscape:connector-curvature="0" />
    <path
       style="fill:#e0e4cc;fill-opacity:1;stroke:#000000;stroke-opacity:1"
       id="path5075-2-6"
       d="m 486.03667,210.91245 31.36444,0 -8.38593,-8.38592 c -1.15703,-1.15704 -1.15703,-3.03333 0,-4.19037 1.15704,-1.15704 3.03334,-1.15704 4.19038,0 l 13.4437,13.4437 c 0,0 0,0 0,0 0.13778,0.13778 0.26074,0.29037 0.36963,0.45259 0.0444,0.0659 0.0741,0.13852 0.11259,0.20667 0.0556,0.1 0.11556,0.19704 0.16,0.3037 0.0356,0.0867 0.0548,0.1763 0.0822,0.26519 0.0296,0.0956 0.0659,0.18889 0.0859,0.28889 0.0296,0.15111 0.04,0.30444 0.0459,0.45778 10e-4,0.0407 0.0119,0.0785 0.0119,0.12 0,0.0459 -0.0119,0.0889 -0.0133,0.13407 -0.007,0.14815 -0.0156,0.2963 -0.0452,0.44296 -0.0207,0.10593 -0.0585,0.20371 -0.0904,0.30519 -0.0259,0.083 -0.0437,0.16741 -0.077,0.24815 -0.0474,0.11481 -0.11111,0.22148 -0.17259,0.32814 -0.0341,0.06 -0.06,0.12371 -0.0985,0.18223 -0.10963,0.16518 -0.23482,0.31852 -0.37482,0.45777 l -13.43999,13.44 c -0.57852,0.57852 -1.33704,0.86815 -2.09556,0.86815 -0.75852,0 -1.5163,-0.28963 -2.09556,-0.86815 -1.15703,-1.15703 -1.15703,-3.03333 0,-4.18963 l 8.38593,-8.38518 -31.3637,0 c -1.6363,0 -2.96297,-1.32667 -2.96297,-2.96296 0,-1.6363 1.32667,-2.96297 2.96297,-2.96297 z"
       inkscape:connector-curvature="0" />
  </g>
  <text
     xml:space="preserve"
     style="font-style:normal;font-variant:normal;font-weight:normal;font-stretch:normal;font-size:20px;line-height:125%;font-family:'Nimbus Roman No9 L';-inkscape-font-specification:'Nimbus Roman No9 L';text-align:center;letter-spacing:0px;word-spacing:0px;writing-mode:lr-tb;text-anchor:middle;fill:#000000;fill-opacity:1;stroke:none;stroke-width:1px;stroke-linecap:butt;stroke-linejoin:miter;stroke-opacity:1"
     x="249.72452"
     y="336.32516"
     id="text5388"
     sodipodi:linespacing="125%"><tspan
       sodipodi:role="line"
       id="tspan5390"
       x="252.22452"
       y="336.32516">objectifs </tspan><tspan
       sodipodi:role="line"
       x="249.72452"
       y="361.32516"
       id="tspan5394">globaux</tspan></text>
  <text
     xml:space="preserve"
     style="font-style:normal;font-variant:normal;font-weight:normal;font-stretch:normal;font-size:20px;line-height:125%;font-family:'Nimbus Roman No9 L';-inkscape-font-specification:'Nimbus Roman No9 L';text-align:center;letter-spacing:0px;word-spacing:0px;writing-mode:lr-tb;text-anchor:middle;fill:#000000;fill-opacity:1;stroke:none;stroke-width:1px;stroke-linecap:butt;stroke-linejoin:miter;stroke-opacity:1"
     x="586.73309"
     y="336.70795"
     id="text5388-5"
     sodipodi:linespacing="125%"><tspan
       sodipodi:role="line"
       id="tspan5390-1"
       x="589.23309"
       y="336.70795">objectifs </tspan><tspan
       sodipodi:role="line"
       x="586.73309"
       y="361.70795"
       id="tspan5394-1">locaux</tspan></text>
</svg>
