%!PS-Adobe-3.0 EPSF-3.0
%%Creator: cairo 1.14.2 (http://cairographics.org)
%%CreationDate: Thu Apr 30 14:36:17 2015
%%Pages: 1
%%DocumentData: Clean7Bit
%%LanguageLevel: 2
%%BoundingBox: 2 7 78 73
%%EndComments
%%BeginProlog
save
50 dict begin
/q { gsave } bind def
/Q { grestore } bind def
/cm { 6 array astore concat } bind def
/w { setlinewidth } bind def
/J { setlinecap } bind def
/j { setlinejoin } bind def
/M { setmiterlimit } bind def
/d { setdash } bind def
/m { moveto } bind def
/l { lineto } bind def
/c { curveto } bind def
/h { closepath } bind def
/re { exch dup neg 3 1 roll 5 3 roll moveto 0 rlineto
      0 exch rlineto 0 rlineto closepath } bind def
/S { stroke } bind def
/f { fill } bind def
/f* { eofill } bind def
/n { newpath } bind def
/W { clip } bind def
/W* { eoclip } bind def
/BT { } bind def
/ET { } bind def
/pdfmark where { pop globaldict /?pdfmark /exec load put }
    { globaldict begin /?pdfmark /pop load def /pdfmark
    /cleartomark load def end } ifelse
/BDC { mark 3 1 roll /BDC pdfmark } bind def
/EMC { mark /EMC pdfmark } bind def
/cairo_store_point { /cairo_point_y exch def /cairo_point_x exch def } def
/Tj { show currentpoint cairo_store_point } bind def
/TJ {
  {
    dup
    type /stringtype eq
    { show } { -0.001 mul 0 cairo_font_matrix dtransform rmoveto } ifelse
  } forall
  currentpoint cairo_store_point
} bind def
/cairo_selectfont { cairo_font_matrix aload pop pop pop 0 0 6 array astore
    cairo_font exch selectfont cairo_point_x cairo_point_y moveto } bind def
/Tf { pop /cairo_font exch def /cairo_font_matrix where
      { pop cairo_selectfont } if } bind def
/Td { matrix translate cairo_font_matrix matrix concatmatrix dup
      /cairo_font_matrix exch def dup 4 get exch 5 get cairo_store_point
      /cairo_font where { pop cairo_selectfont } if } bind def
/Tm { 2 copy 8 2 roll 6 array astore /cairo_font_matrix exch def
      cairo_store_point /cairo_font where { pop cairo_selectfont } if } bind def
/g { setgray } bind def
/rg { setrgbcolor } bind def
/d1 { setcachedevice } bind def
%%EndProlog
%%BeginSetup
%%EndSetup
%%Page: 1 1
%%BeginPageSetup
%%PageBoundingBox: 2 7 78 73
%%EndPageSetup
q 2 7 76 66 rectclip q
0 g
63.238 17.562 m 63.238 16.137 62.082 14.98 60.656 14.98 c 59.23 14.98 58.078
 16.137 58.078 17.562 c 58.078 18.988 59.23 20.145 60.656 20.145 c 62.082
 20.145 63.238 18.988 63.238 17.562 c h
63.238 17.562 m f
76.328 45.336 m 69.812 48.125 l 70.348 50.688 l 71.152 54.68 70.176 58.848
 67.508 59.453 c 65.492 59.91 62.977 58.93 62.016 54.723 c 59.188 42.438
 l 58.613 39.859 60.512 33.57 60.512 33.57 c 58.312 26.625 l 54.008 25.57
 50.801 21.688 50.801 17.059 c 50.801 11.625 55.219 7.199 60.656 7.199 c
 66.094 7.199 70.516 11.625 70.516 17.059 c 70.516 18.234 70.293 19.352 
69.914 20.391 c 70.453 21.785 70.465 23.27 69.922 24.684 c 69.543 25.664
 68.895 26.629 68.473 27.191 c 73.191 41.934 l 74.598 41.309 l 74.855 41.199
 75.121 41.141 75.387 41.129 c 76.262 41.102 77.109 41.598 77.48 42.457 
c 77.953 43.57 77.441 44.859 76.328 45.336 c h
60.656 10.84 m 57.227 10.84 54.438 13.633 54.438 17.059 c 54.438 20.488
 57.227 23.277 60.656 23.277 c 64.086 23.277 66.875 20.488 66.875 17.059
 c 66.875 13.633 64.086 10.84 60.656 10.84 c h
66.117 27.312 m 65.996 26.941 66.078 26.531 66.328 26.234 c 66.34 26.219
 67.355 25.004 67.797 23.863 c 67.801 23.844 67.801 23.828 67.809 23.809
 c 66.734 24.941 65.406 25.832 63.898 26.359 c 68.613 42.523 l 64.359 44.316
 l 64.105 44.422 63.945 44.672 63.957 44.945 c 64.246 52.832 l 64.262 53.195
 64.574 53.504 64.926 53.465 c 65.293 53.449 65.574 53.145 65.559 52.781
 c 65.285 45.352 l 71.094 42.863 l h
66.117 27.312 m f
0.980392 0.411765 0 rg
67.863 68.004 m 67.98 68.035 68.047 68.152 68.016 68.27 c 67.984 68.383
 67.867 68.453 67.754 68.422 c 67.637 68.391 67.57 68.273 67.602 68.156 
c 67.629 68.043 67.75 67.973 67.863 68.004 c h
67.863 68.004 m f
69.137 68.004 m 69.25 67.973 69.371 68.043 69.402 68.156 c 69.434 68.273
 69.363 68.391 69.246 68.422 c 69.133 68.453 69.016 68.387 68.984 68.27 
c 68.953 68.152 69.02 68.035 69.137 68.004 c h
69.137 68.004 m f
70.238 67.676 m 70.152 67.59 70.152 67.453 70.238 67.367 c 70.324 67.285
 70.457 67.285 70.543 67.367 c 70.625 67.453 70.625 67.59 70.543 67.676 
c 70.457 67.758 70.324 67.758 70.238 67.676 c h
70.238 67.676 m f
71.137 66.113 m 71.254 66.145 71.32 66.266 71.289 66.379 c 71.262 66.492
 71.141 66.562 71.027 66.531 c 70.91 66.5 70.844 66.383 70.875 66.266 c 
70.906 66.152 71.023 66.086 71.137 66.113 c h
71.137 66.113 m f
71.137 65.148 m 71.023 65.18 70.906 65.109 70.875 64.996 c 70.844 64.879
 70.91 64.762 71.027 64.73 c 71.141 64.699 71.262 64.77 71.289 64.883 c 
71.32 65 71.254 65.117 71.137 65.148 c h
71.137 65.148 m f
70.238 63.895 m 70.152 63.809 70.152 63.672 70.238 63.59 c 70.324 63.504
 70.457 63.504 70.543 63.59 c 70.625 63.672 70.625 63.809 70.543 63.895 
c 70.457 63.977 70.324 63.977 70.238 63.895 c h
70.238 63.895 m f
69.137 63.258 m 69.02 63.227 68.953 63.109 68.984 62.992 c 69.016 62.879
 69.133 62.809 69.246 62.84 c 69.363 62.871 69.434 62.988 69.402 63.105 
c 69.371 63.219 69.25 63.289 69.137 63.258 c h
69.137 63.258 m f
67.863 63.258 m 67.75 63.289 67.629 63.219 67.602 63.105 c 67.57 62.988
 67.637 62.871 67.754 62.84 c 67.867 62.809 67.984 62.879 68.016 62.992 
c 68.047 63.109 67.98 63.227 67.863 63.258 c h
67.863 63.258 m f
66.457 63.895 m 66.371 63.809 66.371 63.672 66.457 63.59 c 66.543 63.504
 66.68 63.504 66.762 63.59 c 66.848 63.672 66.848 63.809 66.762 63.895 c
 66.68 63.977 66.543 63.977 66.457 63.895 c h
66.457 63.895 m f
65.863 65.148 m 65.746 65.117 65.68 65 65.711 64.883 c 65.742 64.77 65.859
 64.699 65.973 64.73 c 66.09 64.762 66.156 64.879 66.125 64.996 c 66.094
 65.109 65.977 65.18 65.863 65.148 c h
65.863 65.148 m f
65.863 66.113 m 65.977 66.086 66.094 66.152 66.125 66.266 c 66.156 66.383
 66.09 66.5 65.973 66.531 c 65.859 66.562 65.742 66.492 65.711 66.379 c 
65.68 66.266 65.746 66.145 65.863 66.113 c h
65.863 66.113 m f
68.914 66.043 m 68.887 66.07 68.859 66.09 68.832 66.109 c 68.832 66.113
 l 66.762 67.676 l 66.68 67.758 66.543 67.758 66.457 67.676 c 66.371 67.59
 66.371 67.453 66.457 67.367 c 68.02 65.297 l 68.02 65.301 l 68.039 65.273
 68.062 65.246 68.09 65.219 c 68.316 64.992 68.684 64.992 68.914 65.219 
c 69.141 65.445 69.141 65.816 68.914 66.043 c h
68.914 66.043 m f
71.879 68.465 m 72.098 68.684 l 72.172 68.609 l 72.234 68.547 72.34 68.547
 72.402 68.609 c 72.688 68.895 l 72.75 68.957 72.75 69.059 72.688 69.121
 c 72.684 69.125 l 72.004 69.801 l 71.941 69.867 71.84 69.867 71.777 69.801
 c 71.492 69.52 l 71.43 69.453 71.43 69.352 71.492 69.289 c 71.566 69.215
 l 71.352 69 l 70.84 69.43 70.23 69.75 69.559 69.914 c 69.938 70.223 70.18
 70.691 70.18 71.219 c 70.18 72.148 69.43 72.898 68.5 72.898 c 67.57 72.898
 66.82 72.148 66.82 71.219 c 66.82 70.691 67.062 70.223 67.441 69.914 c 
66.77 69.75 66.16 69.43 65.652 69 c 65.434 69.215 l 65.508 69.289 l 65.57
 69.352 65.57 69.453 65.508 69.516 c 65.223 69.801 l 65.16 69.867 65.059
 69.867 64.996 69.801 c 64.316 69.125 l 64.316 69.121 l 64.25 69.059 64.25
 68.957 64.316 68.895 c 64.598 68.609 l 64.664 68.547 64.766 68.547 64.828
 68.609 c 64.902 68.684 l 65.121 68.469 l 64.477 67.699 64.09 66.711 64.09
 65.633 c 64.09 63.195 66.062 61.219 68.5 61.219 c 70.938 61.219 72.91 63.195
 72.91 65.633 c 72.91 66.711 72.523 67.699 71.879 68.465 c h
67.371 71.219 m 67.371 71.844 67.875 72.348 68.5 72.348 c 69.125 72.348
 69.629 71.844 69.629 71.219 c 69.629 70.73 69.32 70.312 68.887 70.156 c
 68.887 70.879 l 68.992 70.879 l 69.082 70.879 69.152 70.949 69.152 71.039
 c 69.152 71.441 l 69.152 71.531 69.082 71.602 68.992 71.602 c 68.031 71.602
 l 67.941 71.602 67.867 71.531 67.867 71.441 c 67.867 71.039 l 67.867 70.949
 67.941 70.879 68.031 70.879 c 68.133 70.879 l 68.133 70.148 l 67.691 70.301
 67.371 70.723 67.371 71.219 c h
68.5 62.297 m 66.664 62.297 65.176 63.785 65.176 65.621 c 65.176 67.457
 66.664 68.945 68.5 68.945 c 70.336 68.945 71.824 67.457 71.824 65.621 c
 71.824 63.785 70.336 62.297 68.5 62.297 c h
68.5 62.297 m f
0 g
54.672 45.336 m 48.156 48.125 l 48.688 50.688 l 49.492 54.68 48.52 58.848
 45.852 59.453 c 43.836 59.91 41.316 58.93 40.355 54.723 c 37.531 42.438
 l 36.957 39.859 38.852 33.57 38.852 33.57 c 36.656 26.625 l 32.348 25.57
 29.141 21.688 29.141 17.059 c 29.141 11.625 33.562 7.199 39 7.199 c 44.434
 7.199 48.855 11.625 48.855 17.059 c 48.855 18.234 48.637 19.352 48.258 
20.391 c 48.797 21.785 48.809 23.27 48.266 24.684 c 47.887 25.664 47.234
 26.629 46.816 27.191 c 51.535 41.934 l 52.941 41.309 l 53.195 41.199 53.465
 41.141 53.727 41.129 c 54.605 41.102 55.453 41.598 55.82 42.457 c 56.297
 43.57 55.785 44.859 54.672 45.336 c h
39 10.84 m 35.57 10.84 32.781 13.633 32.781 17.059 c 32.781 20.488 35.57
 23.277 39 23.277 c 42.43 23.277 45.215 20.488 45.215 17.059 c 45.215 13.633
 42.43 10.84 39 10.84 c h
44.457 27.312 m 44.34 26.941 44.418 26.531 44.672 26.234 c 44.68 26.219
 45.695 25.004 46.137 23.863 c 46.145 23.844 46.145 23.828 46.148 23.809
 c 45.078 24.941 43.746 25.832 42.238 26.359 c 46.957 42.523 l 42.699 44.316
 l 42.449 44.422 42.289 44.672 42.297 44.945 c 42.59 52.832 l 42.605 53.195
 42.914 53.504 43.27 53.465 c 43.633 53.449 43.918 53.145 43.902 52.781 
c 43.629 45.352 l 49.438 42.863 l h
44.457 27.312 m f
41.578 17.562 m 41.578 16.137 40.426 14.98 39 14.98 c 37.574 14.98 36.418
 16.137 36.418 17.562 c 36.418 18.988 37.574 20.145 39 20.145 c 40.426 20.145
 41.578 18.988 41.578 17.562 c h
41.578 17.562 m f
0.980392 0.411765 0 rg
47.824 71.102 m 50.492 71.102 52.652 68.941 52.652 66.277 c 52.652 63.613
 50.492 61.453 47.824 61.453 c 45.16 61.453 43 63.613 43 66.277 c 43 68.941
 45.16 71.102 47.824 71.102 c 47.824 71.336 m 47.145 71.336 46.48 71.203
 45.855 70.938 c 45.254 70.684 44.715 70.32 44.25 69.855 c 43.785 69.391
 43.422 68.848 43.164 68.246 c 42.902 67.621 42.77 66.961 42.77 66.277 c
 42.77 65.594 42.902 64.934 43.164 64.309 c 43.422 63.707 43.785 63.164 
44.25 62.699 c 44.715 62.238 45.254 61.871 45.855 61.617 c 46.48 61.352 
47.145 61.219 47.824 61.219 c 48.508 61.219 49.172 61.352 49.793 61.617 
c 50.398 61.871 50.938 62.238 51.402 62.699 c 51.867 63.164 52.23 63.707
 52.484 64.309 c 52.75 64.934 52.883 65.594 52.883 66.277 c 52.883 66.961
 52.75 67.621 52.484 68.246 c 52.23 68.848 51.867 69.391 51.402 69.855 c
 50.938 70.32 50.398 70.684 49.793 70.938 c 49.172 71.203 48.508 71.336 
47.824 71.336 c h
47.824 71.336 m f
47.48 68.594 m 47.484 68.574 47.496 68.562 47.508 68.562 c 47.512 68.562
 47.52 68.566 47.523 68.574 c 47.523 68.555 47.527 68.543 47.527 68.527 
c 47.539 68.434 47.551 68.387 47.602 68.332 c 47.688 68.242 47.75 68.211
 47.828 68.211 c 47.902 68.211 47.965 68.242 48.047 68.332 c 48.102 68.387
 48.113 68.434 48.125 68.527 c 48.125 68.543 48.129 68.555 48.129 68.574
 c 48.133 68.566 48.141 68.562 48.145 68.562 c 48.156 68.562 48.164 68.574
 48.172 68.594 c 48.18 68.629 48.18 68.648 48.203 68.719 c 48.223 68.789
 48.211 68.809 48.199 68.816 c 48.195 68.82 48.188 68.824 48.184 68.824 
c 48.172 68.824 48.156 68.816 48.145 68.809 c 48.148 68.875 48.148 68.945
 48.148 69.023 c 48.148 69.254 47.887 69.289 47.824 69.289 c 47.766 69.289
 47.504 69.254 47.504 69.023 c 47.504 68.945 47.504 68.875 47.508 68.809
 c 47.496 68.816 47.48 68.824 47.469 68.824 c 47.465 68.824 47.457 68.82
 47.453 68.816 c 47.441 68.809 47.43 68.789 47.449 68.719 c 47.473 68.648
 47.473 68.629 47.48 68.594 c h
48.578 61.762 m 48.492 61.816 48.453 61.855 48.41 61.895 c 48.367 61.938
 48.402 62.02 48.391 62.109 c 48.375 62.199 48.375 62.227 48.438 62.508 
c 48.5 62.793 48.535 63.012 48.531 63.25 c 48.527 63.492 48.453 63.59 48.449
 63.688 c 48.449 63.781 48.453 63.891 48.449 64.039 c 48.441 64.188 48.449
 64.258 48.477 64.43 c 48.504 64.605 48.535 64.848 48.551 65.168 c 48.57
 65.488 48.562 65.707 48.523 65.875 c 48.488 66.043 48.43 66.148 48.48 66.324
 c 48.535 66.504 48.477 66.641 48.473 66.785 c 48.465 66.926 48.477 66.918
 48.539 67.012 c 48.605 67.102 48.691 67.535 48.742 67.707 c 48.789 67.879
 48.805 67.879 48.805 67.879 c 49.203 67.926 49.332 68.023 49.414 68.074
 c 49.496 68.129 49.488 68.121 49.629 68.141 c 49.773 68.16 49.918 68.195
 50.172 68.336 c 50.426 68.477 50.746 68.719 50.746 68.719 c 50.762 68.719
 50.773 68.719 50.789 68.719 c 50.922 68.719 51.035 68.738 51.086 68.793
 c 51.145 68.855 51.176 68.855 51.207 68.855 c 51.324 68.855 l 51.383 68.855
 51.426 68.891 51.406 68.938 c 51.391 68.969 51.258 68.977 51.184 68.977
 c 51.16 68.977 51.141 68.973 51.141 68.973 c 51.141 68.973 51.199 69.016
 51.273 69.082 c 51.352 69.148 51.367 69.117 51.477 69.18 c 51.586 69.242
 51.555 69.285 51.555 69.285 c 51.418 69.242 51.301 69.211 51.145 69.18 
c 50.988 69.152 50.902 69.062 50.672 68.969 c 50.441 68.875 50.207 68.855
 49.816 68.742 c 49.43 68.629 49.16 68.434 49.16 68.434 c 49.082 68.445 
49.008 68.453 48.945 68.453 c 48.523 68.453 48.367 68.234 48.32 68.234 c
 48.281 68.234 48.191 68.301 48.133 68.352 c 48.121 68.332 48.105 68.312
 48.086 68.293 c 47.992 68.195 47.918 68.156 47.828 68.156 c 47.734 68.156
 47.66 68.195 47.566 68.293 c 47.547 68.312 47.531 68.332 47.52 68.352 c
 47.465 68.301 47.371 68.234 47.332 68.234 c 47.281 68.234 47.129 68.453
 46.707 68.453 c 46.641 68.453 46.57 68.445 46.492 68.434 c 46.492 68.434
 46.223 68.629 45.836 68.742 c 45.445 68.855 45.211 68.875 44.98 68.969 
c 44.746 69.062 44.664 69.152 44.508 69.18 c 44.352 69.211 44.234 69.242
 44.098 69.285 c 44.098 69.285 44.066 69.242 44.176 69.18 c 44.281 69.117
 44.301 69.148 44.375 69.082 c 44.453 69.016 44.512 68.973 44.512 68.973
 c 44.512 68.973 44.492 68.977 44.465 68.977 c 44.395 68.977 44.262 68.969
 44.246 68.938 c 44.223 68.891 44.27 68.855 44.328 68.855 c 44.445 68.855
 l 44.477 68.855 44.508 68.855 44.566 68.793 c 44.617 68.738 44.73 68.719
 44.863 68.719 c 44.875 68.719 44.891 68.719 44.906 68.719 c 44.906 68.719
 45.227 68.477 45.48 68.336 c 45.734 68.195 45.879 68.16 46.02 68.141 c 
46.164 68.121 46.156 68.129 46.238 68.074 c 46.316 68.023 46.449 67.926 
46.848 67.879 c 46.848 67.879 46.863 67.879 46.91 67.707 c 46.961 67.535
 47.047 67.102 47.109 67.012 c 47.176 66.918 47.188 66.926 47.18 66.785 
c 47.172 66.641 47.117 66.504 47.168 66.324 c 47.223 66.148 47.164 66.043
 47.125 65.875 c 47.09 65.707 47.082 65.488 47.102 65.168 c 47.117 64.848
 47.148 64.605 47.176 64.43 c 47.203 64.258 47.211 64.188 47.203 64.039 
c 47.199 63.891 47.203 63.781 47.199 63.688 c 47.199 63.59 47.125 63.492
 47.121 63.25 c 47.117 63.012 47.148 62.793 47.215 62.508 c 47.277 62.227
 47.273 62.199 47.262 62.109 c 47.246 62.02 47.285 61.938 47.242 61.895 
c 47.199 61.855 47.16 61.816 47.074 61.762 c 46.984 61.703 46.938 61.688
 46.953 61.652 c 46.965 61.617 47.039 61.59 47.133 61.562 c 47.16 61.555
 47.188 61.551 47.219 61.551 c 47.281 61.551 47.344 61.57 47.387 61.594 
c 47.441 61.625 47.469 61.633 47.535 61.633 c 47.602 61.633 47.625 61.656
 47.629 61.707 c 47.629 61.758 47.598 61.805 47.562 61.855 c 47.527 61.91
 47.523 61.941 47.539 61.988 c 47.555 62.035 47.547 62.047 47.543 62.117
 c 47.539 62.188 47.543 62.488 47.547 62.629 c 47.551 62.77 47.598 62.871
 47.629 63 c 47.66 63.125 47.664 63.273 47.648 63.395 c 47.637 63.516 47.645
 63.52 47.656 63.637 c 47.672 63.758 47.703 63.926 47.738 64.121 c 47.77
 64.312 47.785 64.43 47.785 64.629 c 47.781 64.828 47.805 65.066 47.828 
65.066 c 47.855 65.066 47.867 64.828 47.867 64.629 c 47.863 64.43 47.879
 64.312 47.914 64.121 c 47.949 63.926 47.98 63.758 47.996 63.637 c 48.008
 63.52 48.016 63.516 48 63.395 c 47.988 63.273 47.992 63.125 48.023 63 c
 48.055 62.871 48.102 62.77 48.105 62.629 c 48.105 62.488 48.113 62.188 
48.109 62.117 c 48.105 62.047 48.098 62.035 48.113 61.988 c 48.129 61.941
 48.121 61.91 48.09 61.855 c 48.055 61.805 48.023 61.758 48.023 61.707 c
 48.027 61.656 48.047 61.633 48.117 61.633 c 48.184 61.633 48.207 61.625
 48.266 61.594 c 48.309 61.57 48.367 61.551 48.434 61.551 c 48.461 61.551
 48.492 61.555 48.52 61.562 c 48.613 61.59 48.688 61.617 48.699 61.652 c
 48.715 61.688 48.668 61.703 48.578 61.762 c h
46.012 67.617 m 46.152 67.648 46.141 67.652 46.238 67.629 c 46.312 67.613
 46.434 67.57 46.68 67.621 c 46.766 67.637 46.82 67.664 46.875 67.629 c 
46.871 67.652 46.863 67.676 46.859 67.691 c 46.836 67.77 46.82 67.809 46.812
 67.828 c 46.438 67.875 46.301 67.969 46.215 68.023 c 46.207 68.031 l 46.148
 68.07 46.148 68.07 46.07 68.078 c 46.055 68.082 46.035 68.086 46.016 68.086
 c 45.961 68.094 45.906 68.105 45.84 68.121 c 45.773 68.125 45.703 68.121
 45.629 68.117 c 45.223 68.086 44.996 68.023 44.746 68.031 c 44.496 68.039
 44.387 68.09 44.23 68.066 c 44.074 68.039 43.953 68.027 43.809 68.02 c 
43.809 68.02 43.797 67.969 43.918 67.949 c 44.043 67.926 44.047 67.961 44.145
 67.926 c 44.238 67.891 44.309 67.871 44.309 67.871 c 44.309 67.871 44.074
 67.797 44.07 67.746 c 44.066 67.691 44.121 67.68 44.176 67.699 c 44.23 
67.719 44.258 67.73 44.285 67.742 c 44.312 67.75 44.344 67.758 44.418 67.723
 c 44.496 67.688 44.625 67.715 44.762 67.77 c 44.762 67.77 45.148 67.656
 45.438 67.613 c 45.723 67.566 45.871 67.586 46.012 67.617 c h
51.844 68.02 m 51.699 68.027 51.578 68.039 51.422 68.066 c 51.266 68.09
 51.156 68.039 50.906 68.031 c 50.656 68.023 50.426 68.086 50.023 68.117
 c 49.949 68.121 49.879 68.125 49.812 68.121 c 49.746 68.105 49.691 68.094
 49.637 68.086 c 49.617 68.086 49.598 68.082 49.582 68.078 c 49.504 68.07
 49.504 68.07 49.445 68.031 c 49.438 68.023 l 49.352 67.969 49.215 67.875
 48.836 67.828 c 48.828 67.809 48.816 67.77 48.793 67.691 c 48.789 67.676
 48.781 67.652 48.777 67.629 c 48.832 67.664 48.887 67.637 48.973 67.621
 c 49.219 67.57 49.34 67.613 49.414 67.629 c 49.508 67.652 49.496 67.648
 49.641 67.617 c 49.781 67.586 49.926 67.566 50.215 67.613 c 50.504 67.656
 50.887 67.77 50.887 67.77 c 51.023 67.715 51.156 67.688 51.23 67.723 c 
51.309 67.758 51.336 67.75 51.367 67.742 c 51.395 67.73 51.422 67.719 51.477
 67.699 c 51.531 67.68 51.586 67.691 51.578 67.746 c 51.574 67.797 51.344
 67.871 51.344 67.871 c 51.344 67.871 51.414 67.891 51.508 67.926 c 51.602
 67.961 51.609 67.926 51.734 67.949 c 51.855 67.969 51.844 68.02 51.844 
68.02 c h
47.047 65.164 m 47.031 65.43 47.035 65.621 47.055 65.777 c 47.035 65.738
 47.012 65.688 46.977 65.625 c 46.871 65.434 46.746 65.203 46.66 64.906 
c 46.578 64.609 46.535 64.504 46.438 64.332 c 46.34 64.16 46.34 64.16 46.23
 64.055 c 46.117 63.945 45.934 63.66 45.832 63.258 c 45.73 62.855 45.723
 62.824 45.672 62.742 c 45.621 62.66 45.605 62.621 45.547 62.605 c 45.484
 62.594 45.426 62.582 45.316 62.582 c 45.211 62.586 45.176 62.586 45.117
 62.605 c 45.062 62.629 45.027 62.637 45.012 62.617 c 45 62.594 44.992 62.523
 45.051 62.496 c 45.109 62.473 45.105 62.477 45.129 62.438 c 45.152 62.398
 45.188 62.363 45.262 62.316 c 45.336 62.273 45.367 62.266 45.418 62.262
 c 45.469 62.258 45.461 62.258 45.484 62.215 c 45.508 62.176 45.527 62.141
 45.594 62.094 c 45.664 62.047 45.707 62.043 45.742 62.074 c 45.777 62.109
 45.805 62.164 45.809 62.258 c 45.812 62.352 45.812 62.398 45.848 62.445
 c 45.879 62.492 45.949 62.656 46.023 62.812 c 46.094 62.969 46.137 63.055
 46.254 63.184 c 46.367 63.312 46.48 63.383 46.551 63.574 c 46.621 63.762
 46.621 63.801 46.684 63.875 c 46.746 63.953 46.762 63.984 46.789 64.039
 c 46.812 64.094 46.836 64.109 46.922 64.203 c 46.977 64.266 47.055 64.359
 47.117 64.449 c 47.082 64.684 47.059 64.918 47.047 65.164 c h
50.535 62.605 m 50.477 62.586 50.441 62.586 50.336 62.582 c 50.227 62.582
 50.168 62.594 50.105 62.605 c 50.043 62.621 50.031 62.66 49.98 62.742 c
 49.93 62.824 49.922 62.855 49.82 63.258 c 49.719 63.66 49.531 63.945 49.422
 64.055 c 49.309 64.16 49.312 64.16 49.215 64.332 c 49.117 64.504 49.074
 64.609 48.988 64.906 c 48.906 65.203 48.781 65.434 48.676 65.625 c 48.641
 65.688 48.613 65.738 48.598 65.777 c 48.617 65.621 48.621 65.43 48.605 
65.164 c 48.59 64.918 48.566 64.684 48.531 64.449 c 48.598 64.359 48.672
 64.266 48.73 64.203 c 48.816 64.109 48.836 64.094 48.863 64.039 c 48.891
 63.984 48.906 63.953 48.969 63.875 c 49.031 63.801 49.031 63.762 49.102
 63.574 c 49.172 63.383 49.285 63.312 49.398 63.184 c 49.516 63.055 49.555
 62.969 49.629 62.812 c 49.699 62.656 49.773 62.492 49.805 62.445 c 49.836
 62.398 49.84 62.352 49.844 62.258 c 49.848 62.164 49.871 62.109 49.91 62.074
 c 49.945 62.043 49.988 62.047 50.055 62.094 c 50.125 62.141 50.141 62.176
 50.168 62.215 c 50.191 62.258 50.184 62.258 50.234 62.262 c 50.285 62.266
 50.316 62.273 50.391 62.316 c 50.465 62.363 50.5 62.398 50.523 62.438 c
 50.547 62.477 50.543 62.473 50.602 62.496 c 50.66 62.523 50.652 62.594 
50.641 62.617 c 50.625 62.637 50.59 62.629 50.535 62.605 c h
50.535 62.605 m f
51.699 69.297 m 51.699 61.547 l 43.953 61.547 l 43.953 69.297 l 51.699 
69.297 l 51.934 69.527 m 43.719 69.527 l 43.719 61.316 l 51.934 61.316 l
 h
51.934 69.527 m f
0 g
19.832 17.059 m 19.832 15.633 18.676 14.48 17.25 14.48 c 15.824 14.48 14.672
 15.633 14.672 17.059 c 14.672 18.484 15.824 19.641 17.25 19.641 c 18.676
 19.641 19.832 18.484 19.832 17.059 c h
19.832 17.059 m f
32.922 45.336 m 26.406 48.125 l 26.941 50.688 l 27.746 54.68 26.77 58.848
 24.102 59.453 c 22.09 59.91 19.57 58.93 18.609 54.723 c 15.781 42.438 l
 15.207 39.859 17.105 33.57 17.105 33.57 c 14.91 26.625 l 10.602 25.57 7.395
 21.688 7.395 17.059 c 7.395 11.625 11.812 7.199 17.25 7.199 c 22.688 7.199
 27.109 11.625 27.109 17.059 c 27.109 18.234 26.887 19.352 26.508 20.391
 c 27.047 21.785 27.062 23.27 26.516 24.684 c 26.137 25.664 25.488 26.629
 25.066 27.191 c 29.789 41.934 l 31.191 41.309 l 31.449 41.199 31.715 41.141
 31.98 41.129 c 32.855 41.102 33.707 41.598 34.074 42.457 c 34.551 43.57
 34.039 44.859 32.922 45.336 c h
17.25 10.84 m 13.82 10.84 11.035 13.633 11.035 17.059 c 11.035 20.488 13.82
 23.277 17.25 23.277 c 20.68 23.277 23.469 20.488 23.469 17.059 c 23.469
 13.633 20.68 10.84 17.25 10.84 c h
22.711 27.312 m 22.594 26.941 22.672 26.531 22.922 26.234 c 22.934 26.219
 23.949 25.004 24.391 23.863 c 24.398 23.844 24.395 23.828 24.402 23.809
 c 23.328 24.941 22 25.832 20.492 26.359 c 25.207 42.523 l 20.953 44.316
 l 20.699 44.422 20.539 44.672 20.551 44.945 c 20.84 52.832 l 20.855 53.195
 21.168 53.504 21.52 53.465 c 21.887 53.449 22.168 53.145 22.152 52.781 
c 21.879 45.352 l 27.688 42.863 l h
22.711 27.312 m f
2.457 49.137 12.309 -1.316 re f
7.715 52.824 8.184 -1.312 re f
5.578 45.391 8.184 -1.312 re f
0.980392 0.411765 0 rg
22.074 71.52 m 27.875 71.52 l 27.895 71.191 28.082 70.91 28.352 70.762 
c 22.672 70.762 l 22.641 70.762 22.617 70.738 22.617 70.711 c 22.617 70.684
 22.641 70.66 22.672 70.66 c 28.66 70.66 l 28.703 70.652 28.75 70.648 28.797
 70.648 c 29.305 70.648 29.719 71.062 29.719 71.574 c 29.719 72.086 29.305
 72.5 28.797 72.5 c 28.73 72.5 28.668 72.492 28.605 72.48 c 22.645 72.48
 l 22.617 72.48 22.594 72.457 22.594 72.43 c 22.594 72.398 22.617 72.379
 22.645 72.379 c 28.336 72.379 l 28.07 72.227 27.891 71.945 27.875 71.621
 c 22.074 71.621 l 22.047 71.621 22.023 71.598 22.023 71.57 c 22.023 71.543
 22.047 71.52 22.074 71.52 c h
22.074 71.52 m f
29.52 64.492 m 28.77 64.492 l 28.77 64.488 l 28.77 62.723 27.352 61.285
 25.586 61.262 c 25.582 61.238 25.566 61.219 25.539 61.219 c 19.762 61.219
 l 19.734 61.219 19.711 61.242 19.711 61.27 c 19.711 61.301 19.734 61.32
 19.762 61.32 c 24.902 61.32 l 24.328 61.438 23.812 61.703 23.395 62.078
 c 17.551 62.078 l 17.52 62.078 17.5 62.102 17.5 62.129 c 17.5 62.156 17.52
 62.18 17.551 62.18 c 23.281 62.18 l 23.055 62.402 22.859 62.656 22.707 
62.938 c 16.883 62.938 l 16.855 62.938 16.832 62.961 16.832 62.988 c 16.832
 63.016 16.855 63.039 16.883 63.039 c 22.656 63.039 l 22.535 63.277 22.445
 63.527 22.387 63.793 c 16.574 63.793 l 16.547 63.793 16.523 63.816 16.523
 63.848 c 16.523 63.875 16.547 63.898 16.574 63.898 c 22.367 63.898 l 22.328
 64.09 22.309 64.285 22.309 64.488 c 22.309 64.543 22.312 64.598 22.316 
64.652 c 16.523 64.652 l 16.496 64.652 16.473 64.676 16.473 64.703 c 16.473
 64.734 16.496 64.754 16.523 64.754 c 22.32 64.754 l 22.344 65.02 22.398
 65.27 22.477 65.512 c 16.684 65.512 l 16.656 65.512 16.633 65.535 16.633
 65.562 c 16.633 65.59 16.656 65.613 16.684 65.613 c 22.512 65.613 l 22.613
 65.887 22.75 66.137 22.914 66.371 c 17.172 66.371 l 17.141 66.371 17.121
 66.391 17.121 66.422 c 17.121 66.449 17.141 66.473 17.172 66.473 c 22.992
 66.473 l 23.227 66.77 23.508 67.027 23.832 67.227 c 18.133 67.227 l 18.105
 67.227 18.082 67.25 18.082 67.277 c 18.082 67.309 18.105 67.332 18.133 
67.332 c 24.008 67.332 l 24.352 67.52 24.738 67.645 25.145 67.695 c 24.887
 68.086 l 19.352 68.086 l 19.324 68.086 19.301 68.109 19.301 68.137 c 19.301
 68.164 19.324 68.188 19.352 68.188 c 24.82 68.188 l 24.324 68.945 l 18.582
 68.945 l 18.555 68.945 18.531 68.969 18.531 68.996 c 18.531 69.023 18.555
 69.047 18.582 69.047 c 24.258 69.047 l 26.707 69.805 l 20.57 69.805 l 20.543
 69.805 20.52 69.824 20.52 69.855 c 20.52 69.883 20.543 69.906 20.57 69.906
 c 27.039 69.906 l 27.051 69.906 28.137 70.242 28.137 70.242 c 28.137 67.184
 l 30.484 65.84 l 31.562 61.246 l h
25.539 61.883 m 26.98 61.883 28.148 63.051 28.148 64.488 c 28.148 65.93
 26.98 67.098 25.539 67.098 c 24.102 67.098 22.934 65.93 22.934 64.488 c
 22.934 63.051 24.102 61.883 25.539 61.883 c h
25.539 61.883 m f
Q Q
showpage
%%Trailer
end restore
%%EOF
