%!PS-Adobe-3.0 EPSF-3.0
%%Creator: cairo 1.14.2 (http://cairographics.org)
%%CreationDate: Mon Apr 27 17:56:53 2015
%%Pages: 1
%%DocumentData: Clean7Bit
%%LanguageLevel: 2
%%BoundingBox: 147 539 516 771
%%EndComments
%%BeginProlog
save
50 dict begin
/q { gsave } bind def
/Q { grestore } bind def
/cm { 6 array astore concat } bind def
/w { setlinewidth } bind def
/J { setlinecap } bind def
/j { setlinejoin } bind def
/M { setmiterlimit } bind def
/d { setdash } bind def
/m { moveto } bind def
/l { lineto } bind def
/c { curveto } bind def
/h { closepath } bind def
/re { exch dup neg 3 1 roll 5 3 roll moveto 0 rlineto
      0 exch rlineto 0 rlineto closepath } bind def
/S { stroke } bind def
/f { fill } bind def
/f* { eofill } bind def
/n { newpath } bind def
/W { clip } bind def
/W* { eoclip } bind def
/BT { } bind def
/ET { } bind def
/pdfmark where { pop globaldict /?pdfmark /exec load put }
    { globaldict begin /?pdfmark /pop load def /pdfmark
    /cleartomark load def end } ifelse
/BDC { mark 3 1 roll /BDC pdfmark } bind def
/EMC { mark /EMC pdfmark } bind def
/cairo_store_point { /cairo_point_y exch def /cairo_point_x exch def } def
/Tj { show currentpoint cairo_store_point } bind def
/TJ {
  {
    dup
    type /stringtype eq
    { show } { -0.001 mul 0 cairo_font_matrix dtransform rmoveto } ifelse
  } forall
  currentpoint cairo_store_point
} bind def
/cairo_selectfont { cairo_font_matrix aload pop pop pop 0 0 6 array astore
    cairo_font exch selectfont cairo_point_x cairo_point_y moveto } bind def
/Tf { pop /cairo_font exch def /cairo_font_matrix where
      { pop cairo_selectfont } if } bind def
/Td { matrix translate cairo_font_matrix matrix concatmatrix dup
      /cairo_font_matrix exch def dup 4 get exch 5 get cairo_store_point
      /cairo_font where { pop cairo_selectfont } if } bind def
/Tm { 2 copy 8 2 roll 6 array astore /cairo_font_matrix exch def
      cairo_store_point /cairo_font where { pop cairo_selectfont } if } bind def
/g { setgray } bind def
/rg { setrgbcolor } bind def
/d1 { setcachedevice } bind def
%%EndProlog
%%BeginSetup
%%EndSetup
%%Page: 1 1
%%BeginPageSetup
%%PageBoundingBox: 147 539 516 771
%%EndPageSetup
q 147 539 369 232 rectclip q
0 g
0.8 w
1 J
2 j
[] 0.0 d
4 M q 1 0 0 -1 0 841.889771 cm
147.75 71.645 367.062 229.836 re S Q
1.975309 w
1 j
10 M q 1 0 0 -1 0 841.889771 cm
245.773 170.219 m 245.773 167.391 243.469 165.02 240.57 165.02 c S Q
q 1 0 0 -1 0 841.889771 cm
250.117 170.219 m 250.117 164.953 245.836 160.672 240.57 160.672 c S Q
q 1 0 0 -1 0 841.889771 cm
363.418 238.574 m 363.418 235.746 361.113 233.375 358.215 233.375 c S Q
q 1 0 0 -1 0 841.889771 cm
367.762 238.574 m 367.762 233.309 363.484 229.027 358.215 229.027 c S Q
q 1 0 0 -1 0 841.889771 cm
444.637 109.719 m 444.637 106.887 442.332 104.516 439.434 104.516 c S Q
q 1 0 0 -1 0 841.889771 cm
448.984 109.719 m 448.984 104.449 444.703 100.172 439.434 100.172 c S Q
0.8 w
0 J
0 j
4 M q 1 0 0 -1 0 841.889771 cm
267.723 182.691 m 395.688 138.07 l S Q
q 1 0 0 -1 0 841.889771 cm
267.723 217.207 m 311.5 243.305 l S Q
q 1 0 0 -1 0 841.889771 cm
378.008 222.258 m 420.102 159.961 l S Q
232.445 652.933 m 232.445 652.46 232.09 652.105 231.617 652.105 c 231.145
 652.105 230.789 652.46 230.789 652.933 c 230.789 653.409 231.145 653.765
 231.617 653.765 c 232.09 653.765 232.445 653.409 232.445 652.933 c h
232.445 652.933 m f
233.93 653.765 m 233.93 653.585 233.809 653.468 233.633 653.468 c 233.453
 653.468 233.336 653.585 233.336 653.765 c 233.336 653.941 233.453 654.058
 233.633 654.058 c 233.809 654.058 233.93 653.941 233.93 653.765 c h
233.93 653.765 m f
0.980392 0.411765 0 rg
260.062 664.253 m 255.617 664.015 l 254.609 664.015 l 254.609 664.253 l
 253.781 664.253 l 253.781 663.956 l 252.773 663.956 l 248.328 664.253 l
 247.973 664.253 247.676 663.956 247.676 663.601 c 247.676 663.245 247.973
 662.948 248.328 662.948 c 252.891 663.187 l 253.781 663.187 l 253.781 660.991
 l 253.129 660.991 l 253.129 659.511 l 242.344 659.511 l 242.344 659.569
 l 242.344 659.628 242.344 659.691 242.285 659.749 c 242.223 659.866 242.164
 659.925 242.105 660.046 c 242.047 660.105 242.047 660.163 241.988 660.222
 c 241.809 660.401 l 241.75 660.46 241.633 660.519 241.574 660.577 c 241.512
 660.636 241.453 660.636 241.395 660.636 c 241.277 660.698 241.156 660.757
 241.039 660.757 c 240.863 660.816 240.684 660.816 240.445 660.816 c 236.715
 660.816 l 236.18 661.288 234.402 661.644 232.27 661.644 c 230.137 661.644
 228.359 661.288 227.824 660.816 c 224.09 660.816 l 223.914 660.816 223.676
 660.816 223.5 660.757 c 223.379 660.757 223.32 660.698 223.262 660.636 
c 223.145 660.577 223.082 660.577 222.965 660.519 c 222.906 660.46 222.848
 660.401 222.727 660.343 c 222.668 660.28 222.551 660.222 222.492 660.163
 c 222.434 660.105 222.434 660.046 222.371 659.984 c 222.312 659.925 222.254
 659.808 222.195 659.691 c 222.137 659.628 222.137 659.569 222.137 659.452
 c 211.648 659.452 l 211.648 660.933 l 210.934 660.933 l 210.934 663.128
 l 211.824 663.128 l 216.387 662.89 l 216.742 662.89 217.039 663.187 217.039
 663.542 c 217.039 663.898 216.742 664.194 216.387 664.194 c 211.941 663.956
 l 210.934 663.956 l 210.934 664.253 l 210.105 664.253 l 210.105 663.956
 l 209.098 663.956 l 204.715 664.253 l 204.359 664.253 204.062 663.956 204.062
 663.601 c 204.062 663.245 204.359 662.948 204.715 662.948 c 209.277 663.187
 l 210.164 663.187 l 210.164 660.991 l 209.453 660.991 l 209.453 657.437
 l 211.648 657.437 l 211.648 658.327 l 222.016 658.327 l 222.016 658.269
 222.016 658.148 222.078 658.03 c 222.078 657.972 222.137 657.851 222.195
 657.792 c 222.254 657.675 222.254 657.616 222.312 657.558 c 222.848 656.843
 l 220.238 654.058 219.941 653.644 219.941 650.206 c 219.941 647.898 220.594
 645.702 221.723 644.343 c 221.84 644.163 222.078 644.105 222.254 644.105
 c 222.434 644.105 222.551 644.163 222.727 644.28 c 223.023 644.519 223.082
 644.991 222.848 645.288 c 221.957 646.355 221.426 648.253 221.426 650.269
 c 221.426 653.054 221.484 653.23 223.734 655.659 c 224.445 654.651 l 224.863
 654.12 225.453 653.765 226.164 653.765 c 227.055 653.765 l 227.172 654.12
 227.352 654.413 227.648 654.71 c 228.418 655.601 229.84 656.194 231.5 656.312
 c 231.5 655.601 l 230.016 655.304 228.891 654.237 228.891 652.991 c 228.891
 651.511 230.371 650.327 232.211 650.327 c 234.047 650.327 235.527 651.511
 235.527 652.991 c 235.527 654.296 234.402 655.362 232.98 655.601 c 232.98
 656.312 l 234.641 656.194 236.062 655.542 236.832 654.71 c 237.07 654.413
 237.305 654.12 237.363 653.765 c 238.312 653.765 l 238.965 653.765 239.617
 654.058 240.031 654.651 c 240.684 655.542 l 242.934 653.112 242.934 652.933
 242.934 650.206 c 242.934 648.194 242.402 646.355 241.512 645.23 c 241.277
 644.933 241.336 644.46 241.633 644.222 c 241.75 644.105 241.93 644.046 
242.105 644.046 c 242.285 644.046 242.52 644.105 242.641 644.28 c 243.707
 645.644 244.359 647.839 244.359 650.148 c 244.359 653.526 244.004 653.941
 241.512 656.667 c 242.105 657.495 l 242.164 657.616 242.223 657.675 242.223
 657.792 c 242.285 657.851 242.285 657.913 242.344 658.03 c 242.402 658.148
 242.402 658.206 242.402 658.327 c 253.07 658.327 l 253.07 657.437 l 255.32
 657.437 l 255.32 660.991 l 254.551 660.991 l 254.551 663.187 l 255.438 
663.187 l 260.004 662.948 l 260.359 662.948 260.652 663.245 260.652 663.601
 c 260.715 663.956 260.418 664.253 260.062 664.253 c h
233.633 654.237 m 233.867 654.237 234.105 653.999 234.105 653.765 c 234.105
 653.526 233.93 653.288 233.633 653.288 c 233.395 653.288 233.156 653.468
 233.156 653.765 c 233.156 654.058 233.395 654.237 233.633 654.237 c h
231.676 651.691 m 230.965 651.691 230.434 652.28 230.434 652.933 c 230.434
 653.644 231.023 654.179 231.676 654.179 c 232.387 654.179 232.922 653.585
 232.922 652.933 c 232.922 652.28 232.328 651.691 231.676 651.691 c h
231.676 651.691 m f
0 g
349.469 588.109 m 349.469 587.636 349.113 587.276 348.641 587.276 c 348.164
 587.276 347.809 587.636 347.809 588.109 c 347.809 588.581 348.164 588.937
 348.641 588.937 c 349.113 588.937 349.469 588.581 349.469 588.109 c h
349.469 588.109 m f
350.949 588.937 m 350.949 588.761 350.832 588.64 350.656 588.64 c 350.477
 588.64 350.359 588.761 350.359 588.937 c 350.359 589.116 350.477 589.234
 350.656 589.234 c 350.832 589.234 350.949 589.116 350.949 588.937 c h
350.949 588.937 m f
0.980392 0.411765 0 rg
377.086 599.425 m 372.641 599.191 l 371.633 599.191 l 371.633 599.425 l
 370.801 599.425 l 370.801 599.132 l 369.797 599.132 l 365.352 599.425 l
 364.996 599.425 364.699 599.132 364.699 598.776 c 364.699 598.421 364.996
 598.124 365.352 598.124 c 369.914 598.359 l 370.801 598.359 l 370.801 596.167
 l 370.152 596.167 l 370.152 594.687 l 359.367 594.687 l 359.367 594.745
 l 359.367 594.804 359.367 594.862 359.305 594.921 c 359.246 595.042 359.188
 595.101 359.129 595.218 c 359.07 595.276 359.07 595.339 359.012 595.398
 c 358.832 595.573 l 358.773 595.636 358.656 595.694 358.594 595.753 c 358.535
 595.812 358.477 595.812 358.418 595.812 c 358.301 595.87 358.18 595.929
 358.062 595.929 c 357.883 595.991 357.707 595.991 357.469 595.991 c 353.734
 595.991 l 353.203 596.464 351.426 596.819 349.293 596.819 c 347.16 596.819
 345.379 596.464 344.848 595.991 c 341.113 595.991 l 340.938 595.991 340.699
 595.991 340.52 595.929 c 340.402 595.929 340.344 595.87 340.285 595.812
 c 340.164 595.753 340.105 595.753 339.988 595.694 c 339.93 595.636 339.871
 595.573 339.75 595.515 c 339.691 595.456 339.574 595.398 339.516 595.339
 c 339.453 595.276 339.453 595.218 339.395 595.159 c 339.336 595.101 339.277
 594.984 339.219 594.862 c 339.16 594.804 339.16 594.745 339.16 594.628 
c 328.668 594.628 l 328.668 596.109 l 327.957 596.109 l 327.957 598.3 l 
328.848 598.3 l 333.41 598.062 l 333.766 598.062 334.062 598.359 334.062
 598.714 c 334.062 599.069 333.766 599.366 333.41 599.366 c 328.965 599.132
 l 327.957 599.132 l 327.957 599.425 l 327.129 599.425 l 327.129 599.132
 l 326.121 599.132 l 321.734 599.425 l 321.379 599.425 321.086 599.132 321.086
 598.776 c 321.086 598.421 321.379 598.124 321.734 598.124 c 326.301 598.359
 l 327.188 598.359 l 327.188 596.167 l 326.477 596.167 l 326.477 592.612
 l 328.668 592.612 l 328.668 593.499 l 339.039 593.499 l 339.039 593.441
 339.039 593.323 339.098 593.206 c 339.098 593.144 339.16 593.026 339.219
 592.968 c 339.277 592.851 339.277 592.788 339.336 592.73 c 339.871 592.019
 l 337.262 589.234 336.965 588.819 336.965 585.382 c 336.965 583.069 337.617
 580.878 338.742 579.515 c 338.863 579.339 339.098 579.276 339.277 579.276
 c 339.453 579.276 339.574 579.339 339.75 579.456 c 340.047 579.694 340.105
 580.167 339.871 580.464 c 338.98 581.53 338.445 583.425 338.445 585.441
 c 338.445 588.226 338.508 588.405 340.758 590.835 c 341.469 589.827 l 341.883
 589.292 342.477 588.937 343.188 588.937 c 344.078 588.937 l 344.195 589.292
 344.375 589.589 344.668 589.886 c 345.441 590.776 346.863 591.366 348.52
 591.487 c 348.52 590.776 l 347.039 590.48 345.914 589.413 345.914 588.167
 c 345.914 586.687 347.395 585.499 349.23 585.499 c 351.07 585.499 352.551
 586.687 352.551 588.167 c 352.551 589.472 351.426 590.538 350.004 590.776
 c 350.004 591.487 l 351.66 591.366 353.086 590.714 353.855 589.886 c 354.09
 589.589 354.328 589.292 354.387 588.937 c 355.336 588.937 l 355.988 588.937
 356.641 589.234 357.055 589.827 c 357.707 590.714 l 359.957 588.284 359.957
 588.109 359.957 585.382 c 359.957 583.366 359.426 581.53 358.535 580.405
 c 358.301 580.109 358.359 579.636 358.656 579.398 c 358.773 579.276 358.949
 579.218 359.129 579.218 c 359.305 579.218 359.543 579.276 359.66 579.456
 c 360.73 580.819 361.379 583.011 361.379 585.323 c 361.379 588.702 361.023
 589.116 358.535 591.843 c 359.129 592.671 l 359.188 592.788 359.246 592.851
 359.246 592.968 c 359.305 593.026 359.305 593.085 359.367 593.206 c 359.426
 593.323 359.426 593.382 359.426 593.499 c 370.09 593.499 l 370.09 592.612
 l 372.344 592.612 l 372.344 596.167 l 371.574 596.167 l 371.574 598.359
 l 372.461 598.359 l 377.023 598.124 l 377.379 598.124 377.676 598.421 377.676
 598.776 c 377.734 599.132 377.441 599.425 377.086 599.425 c h
350.656 589.413 m 350.891 589.413 351.129 589.175 351.129 588.937 c 351.129
 588.702 350.949 588.464 350.656 588.464 c 350.418 588.464 350.18 588.64
 350.18 588.937 c 350.18 589.234 350.418 589.413 350.656 589.413 c h
348.699 586.862 m 347.988 586.862 347.453 587.456 347.453 588.109 c 347.453
 588.819 348.047 589.351 348.699 589.351 c 349.41 589.351 349.945 588.761
 349.945 588.109 c 349.945 587.456 349.352 586.862 348.699 586.862 c h
348.699 586.862 m f
0 g
429.281 714.476 m 429.281 714.003 428.926 713.644 428.453 713.644 c 427.977
 713.644 427.621 714.003 427.621 714.476 c 427.621 714.948 427.977 715.304
 428.453 715.304 c 428.926 715.304 429.281 714.948 429.281 714.476 c h
429.281 714.476 m f
430.762 715.304 m 430.762 715.128 430.645 715.007 430.465 715.007 c 430.289
 715.007 430.172 715.128 430.172 715.304 c 430.172 715.484 430.289 715.601
 430.465 715.601 c 430.645 715.601 430.762 715.484 430.762 715.304 c h
430.762 715.304 m f
0.980392 0.411765 0 rg
456.895 725.792 m 452.453 725.558 l 451.445 725.558 l 451.445 725.792 l
 450.613 725.792 l 450.613 725.499 l 449.605 725.499 l 445.164 725.792 l
 444.809 725.792 444.512 725.499 444.512 725.144 c 444.512 724.788 444.809
 724.491 445.164 724.491 c 449.727 724.726 l 450.613 724.726 l 450.613 722.534
 l 449.961 722.534 l 449.961 721.054 l 439.176 721.054 l 439.176 721.112
 l 439.176 721.171 439.176 721.23 439.117 721.288 c 439.059 721.409 439 
721.468 438.941 721.585 c 438.883 721.648 438.883 721.706 438.82 721.765
 c 438.645 721.941 l 438.586 722.003 438.465 722.062 438.406 722.12 c 438.348
 722.179 438.289 722.179 438.23 722.179 c 438.109 722.237 437.992 722.296
 437.875 722.296 c 437.695 722.359 437.52 722.359 437.281 722.359 c 433.547
 722.359 l 433.016 722.831 431.238 723.187 429.105 723.187 c 426.969 723.187
 425.191 722.831 424.66 722.359 c 420.926 722.359 l 420.746 722.359 420.512
 722.359 420.332 722.296 c 420.215 722.296 420.156 722.237 420.098 722.179
 c 419.977 722.12 419.918 722.12 419.801 722.062 c 419.742 722.003 419.68
 721.941 419.562 721.882 c 419.504 721.823 419.387 721.765 419.324 721.706
 c 419.266 721.644 419.266 721.585 419.207 721.526 c 419.148 721.468 419.09
 721.351 419.031 721.23 c 418.969 721.171 418.969 721.112 418.969 720.995
 c 408.48 720.995 l 408.48 722.476 l 407.77 722.476 l 407.77 724.667 l 408.66
 724.667 l 413.223 724.433 l 413.578 724.433 413.875 724.726 413.875 725.081
 c 413.875 725.437 413.578 725.734 413.223 725.734 c 408.777 725.499 l 407.77
 725.499 l 407.77 725.792 l 406.941 725.792 l 406.941 725.499 l 405.934 
725.499 l 401.547 725.792 l 401.191 725.792 400.895 725.499 400.895 725.144
 c 400.895 724.788 401.191 724.491 401.547 724.491 c 406.109 724.726 l 407
 724.726 l 407 722.534 l 406.289 722.534 l 406.289 718.98 l 408.48 718.98
 l 408.48 719.866 l 418.852 719.866 l 418.852 719.808 418.852 719.691 418.91
 719.573 c 418.91 719.511 418.969 719.394 419.031 719.335 c 419.09 719.218
 419.09 719.155 419.148 719.097 c 419.68 718.386 l 417.074 715.601 416.777
 715.187 416.777 711.749 c 416.777 709.437 417.43 707.245 418.555 705.882
 c 418.676 705.706 418.91 705.648 419.09 705.648 c 419.266 705.648 419.387
 705.706 419.562 705.823 c 419.859 706.062 419.918 706.534 419.68 706.831
 c 418.793 707.898 418.258 709.792 418.258 711.808 c 418.258 714.593 418.32
 714.773 420.57 717.202 c 421.281 716.194 l 421.695 715.659 422.289 715.304
 423 715.304 c 423.891 715.304 l 424.008 715.659 424.184 715.956 424.48 
716.253 c 425.25 717.144 426.676 717.734 428.332 717.855 c 428.332 717.144
 l 426.852 716.847 425.727 715.78 425.727 714.534 c 425.727 713.054 427.207
 711.866 429.043 711.866 c 430.883 711.866 432.363 713.054 432.363 714.534
 c 432.363 715.839 431.238 716.905 429.816 717.144 c 429.816 717.855 l 431.473
 717.734 432.895 717.081 433.668 716.253 c 433.902 715.956 434.141 715.659
 434.199 715.304 c 435.148 715.304 l 435.801 715.304 436.453 715.601 436.867
 716.194 c 437.52 717.081 l 439.77 714.651 439.77 714.476 439.77 711.749
 c 439.77 709.734 439.238 707.898 438.348 706.773 c 438.109 706.476 438.172
 706.003 438.465 705.765 c 438.586 705.648 438.762 705.585 438.941 705.585
 c 439.117 705.585 439.355 705.648 439.473 705.823 c 440.539 707.187 441.191
 709.378 441.191 711.691 c 441.191 715.069 440.836 715.484 438.348 718.21
 c 438.941 719.038 l 439 719.155 439.059 719.218 439.059 719.335 c 439.117
 719.394 439.117 719.452 439.176 719.573 c 439.238 719.691 439.238 719.749
 439.238 719.866 c 449.902 719.866 l 449.902 718.98 l 452.156 718.98 l 452.156
 722.534 l 451.387 722.534 l 451.387 724.726 l 452.273 724.726 l 456.836
 724.491 l 457.191 724.491 457.488 724.788 457.488 725.144 c 457.547 725.499
 457.25 725.792 456.895 725.792 c h
430.465 715.78 m 430.703 715.78 430.941 715.542 430.941 715.304 c 430.941
 715.069 430.762 714.831 430.465 714.831 c 430.23 714.831 429.992 715.007
 429.992 715.304 c 429.992 715.601 430.23 715.78 430.465 715.78 c h
428.512 713.23 m 427.801 713.23 427.266 713.823 427.266 714.476 c 427.266
 715.187 427.859 715.718 428.512 715.718 c 429.223 715.718 429.754 715.128
 429.754 714.476 c 429.754 713.823 429.164 713.23 428.512 713.23 c h
428.512 713.23 m f
Q Q
showpage
%%Trailer
end restore
%%EOF
