%!PS-Adobe-3.0 EPSF-3.0
%%Creator: cairo 1.14.6 (http://cairographics.org)
%%CreationDate: Fri Mar 18 10:04:27 2016
%%Pages: 1
%%DocumentData: Clean7Bit
%%LanguageLevel: 2
%%BoundingBox: 1 12 79 88
%%EndComments
%%BeginProlog
save
50 dict begin
/q { gsave } bind def
/Q { grestore } bind def
/cm { 6 array astore concat } bind def
/w { setlinewidth } bind def
/J { setlinecap } bind def
/j { setlinejoin } bind def
/M { setmiterlimit } bind def
/d { setdash } bind def
/m { moveto } bind def
/l { lineto } bind def
/c { curveto } bind def
/h { closepath } bind def
/re { exch dup neg 3 1 roll 5 3 roll moveto 0 rlineto
      0 exch rlineto 0 rlineto closepath } bind def
/S { stroke } bind def
/f { fill } bind def
/f* { eofill } bind def
/n { newpath } bind def
/W { clip } bind def
/W* { eoclip } bind def
/BT { } bind def
/ET { } bind def
/pdfmark where { pop globaldict /?pdfmark /exec load put }
    { globaldict begin /?pdfmark /pop load def /pdfmark
    /cleartomark load def end } ifelse
/BDC { mark 3 1 roll /BDC pdfmark } bind def
/EMC { mark /EMC pdfmark } bind def
/cairo_store_point { /cairo_point_y exch def /cairo_point_x exch def } def
/Tj { show currentpoint cairo_store_point } bind def
/TJ {
  {
    dup
    type /stringtype eq
    { show } { -0.001 mul 0 cairo_font_matrix dtransform rmoveto } ifelse
  } forall
  currentpoint cairo_store_point
} bind def
/cairo_selectfont { cairo_font_matrix aload pop pop pop 0 0 6 array astore
    cairo_font exch selectfont cairo_point_x cairo_point_y moveto } bind def
/Tf { pop /cairo_font exch def /cairo_font_matrix where
      { pop cairo_selectfont } if } bind def
/Td { matrix translate cairo_font_matrix matrix concatmatrix dup
      /cairo_font_matrix exch def dup 4 get exch 5 get cairo_store_point
      /cairo_font where { pop cairo_selectfont } if } bind def
/Tm { 2 copy 8 2 roll 6 array astore /cairo_font_matrix exch def
      cairo_store_point /cairo_font where { pop cairo_selectfont } if } bind def
/g { setgray } bind def
/rg { setrgbcolor } bind def
/d1 { setcachedevice } bind def
%%EndProlog
%%BeginSetup
%%EndSetup
%%Page: 1 1
%%BeginPageSetup
%%PageBoundingBox: 1 12 79 88
%%EndPageSetup
q 1 12 78 76 rectclip q
0 g
71.199 60.504 m 71.199 62.75 l 71.199 72.07 63.617 79.652 54.297 79.652
 c 51.199 79.652 l 51.199 85.598 l 51.199 86.273 50.805 86.906 50.211 87.258
 c 49.891 87.449 49.508 87.547 49.145 87.547 c 48.836 87.547 48.52 87.477
 48.234 87.34 c 37.84 77.293 l 37.223 76.715 36.734 76.285 36.734 75.547
 c 36.734 74.812 37.145 74.41 37.836 73.805 c 48.227 63.758 l 48.844 63.445
 49.617 63.484 50.211 63.84 c 50.805 64.191 51.199 64.824 51.199 65.5 c 
51.199 71.652 l 54.297 71.652 l 59.207 71.652 63.199 67.656 63.199 62.75
 c 63.199 60.504 l 58.992 58.891 56 54.824 56 50.051 c 56 45.277 58.992 
41.211 63.199 39.602 c 63.199 37.355 l 63.199 32.445 59.207 28.453 54.297
 28.453 c 52.086 28.453 50.297 26.66 50.297 24.453 c 50.297 22.242 52.086
 20.453 54.297 20.453 c 63.617 20.453 71.199 28.035 71.199 37.355 c 71.199
 39.602 l 75.406 41.211 78.398 45.277 78.398 50.051 c 78.398 54.824 75.406
 58.891 71.199 60.504 c h
73.602 48.453 m 68.801 48.453 l 68.801 43.652 l 65.602 43.652 l 65.602 
48.453 l 60.801 48.453 l 60.801 51.652 l 65.602 51.652 l 65.602 56.453 l
 68.801 56.453 l 68.801 51.652 l 73.602 51.652 l h
73.602 48.453 m f
0 0 0.670588 rg
42.898 26.191 m 32.508 36.242 l 31.891 36.555 31.148 36.512 30.559 36.16
 c 29.961 35.809 29.602 35.176 29.602 34.5 c 29.602 28.453 l 25.602 28.453
 l 20.664 28.453 16.801 32.316 16.801 37.25 c 16.801 39.602 l 21.008 41.211
 24 45.277 24 50.051 c 24 54.824 21.008 58.891 16.801 60.504 c 16.801 62.75
 l 16.801 67.656 20.793 71.652 25.703 71.652 c 27.91 71.652 29.703 73.441
 29.703 75.652 c 29.703 77.859 27.91 79.652 25.703 79.652 c 16.383 79.652
 8.801 72.07 8.801 62.75 c 8.801 60.504 l 4.594 58.891 1.602 54.824 1.602
 50.051 c 1.602 45.277 4.594 41.211 8.801 39.602 c 8.801 37.25 l 8.801 27.988
 16.336 20.453 25.602 20.453 c 29.602 20.453 l 29.602 14.402 l 29.602 13.727
 29.961 13.094 30.559 12.742 c 30.875 12.551 31.242 12.453 31.605 12.453
 c 31.914 12.453 32.223 12.523 32.508 12.66 c 42.898 22.707 l 43.516 23.285
 44 23.715 44 24.453 c 44 25.188 43.586 25.59 42.898 26.191 c h
11.215 48.453 m 6.398 48.453 l 6.398 51.652 l 19.199 51.652 l 19.199 48.453
 l h
11.215 48.453 m f
Q Q
showpage
%%Trailer
end restore
%%EOF
