<?xml version="1.0" encoding="UTF-8" standalone="no"?>
<svg
   xmlns:dc="http://purl.org/dc/elements/1.1/"
   xmlns:cc="http://creativecommons.org/ns#"
   xmlns:rdf="http://www.w3.org/1999/02/22-rdf-syntax-ns#"
   xmlns:svg="http://www.w3.org/2000/svg"
   xmlns="http://www.w3.org/2000/svg"
   version="1.1"
   id="svg6978"
   viewBox="0 0 100 100"
   height="100"
   width="100">
  <defs
     id="defs6980" />
  <metadata
     id="metadata6983">
    <rdf:RDF>
      <cc:Work
         rdf:about="">
        <dc:format>image/svg+xml</dc:format>
        <dc:type
           rdf:resource="http://purl.org/dc/dcmitype/StillImage" />
        <dc:title></dc:title>
      </cc:Work>
    </rdf:RDF>
  </metadata>
  <g
     transform="translate(0,-952.36216)"
     id="layer1">
    <g
       transform="matrix(1.1463415,0,0,1.1463415,-372.22827,434.02953)"
       id="g5629">
      <path
         d="m 383.16878,530.81451 0,4.474 c 0,0.825 -0.686,1.491 -1.535,1.491 l -26.613,0 c -0.85,0 -1.535,-0.666 -1.535,-1.491 l 0,-4.474 c 0,-5.259 3.511,-9.727 8.378,-11.308 1.863,1.158 4.074,1.824 6.443,1.824 2.375,0 4.591,-0.671 6.459,-1.834 4.882,1.576 8.403,6.049 8.403,11.318 z"
         id="path4939"
         style="fill:#fa6900;fill-opacity:1" />
      <g
         id="g4941"
         transform="translate(318.32678,445.77951)">
        <path
           d="m 38.684,42.684 0,4.474 c 0,0.825 -0.686,1.491 -1.535,1.491 l -26.614,0 C 9.686,48.649 9,47.983 9,47.158 l 0,-4.474 c 0,-5.259 3.511,-9.727 8.378,-11.308 1.863,1.158 4.074,1.824 6.443,1.824 2.375,0 4.591,-0.671 6.459,-1.834 4.882,1.576 8.404,6.049 8.404,11.318 z"
           id="path4943" />
      </g>
      <g
         id="g4945"
         transform="translate(318.32678,445.77951)">
        <path
           d="m 33.289,18.404 0,2.714 c 0,5.19 -4.248,9.404 -9.468,9.404 -5.22,0 -9.468,-4.214 -9.468,-9.404 l 0,-2.714 C 14.353,13.219 18.601,9 23.821,9 c 5.22,0 9.468,4.219 9.468,9.404 z"
           id="path4947" />
      </g>
      <g
         id="g4949"
         transform="translate(318.32678,445.77951)">
        <path
           d="m 91,42.684 0,4.474 c 0,0.825 -0.686,1.491 -1.535,1.491 l -26.613,0 c -0.85,0 -1.535,-0.666 -1.535,-1.491 l 0,-4.474 c 0,-5.259 3.511,-9.727 8.378,-11.308 1.863,1.158 4.074,1.824 6.443,1.824 2.375,0 4.591,-0.671 6.459,-1.834 C 87.479,32.942 91,37.415 91,42.684 Z"
           id="path4951" />
      </g>
      <g
         id="g4953"
         transform="translate(318.32678,445.77951)">
        <path
           d="m 85.606,18.404 0,2.714 c 0,5.19 -4.248,9.404 -9.468,9.404 -5.22,0 -9.468,-4.214 -9.468,-9.404 l 0,-2.714 C 66.67,13.219 70.918,9 76.138,9 c 5.22,0 9.468,4.219 9.468,9.404 z"
           id="path4955" />
      </g>
      <g
         id="g4957"
         transform="translate(318.32678,445.77951)"
         style="fill:#fa6900;fill-opacity:1">
        <path
           d="m 59.448,60.755 0,2.714 c 0,5.19 -4.248,9.404 -9.468,9.404 -5.22,0 -9.468,-4.214 -9.468,-9.404 l 0,-2.714 c 0,-5.185 4.248,-9.404 9.468,-9.404 5.22,0 9.468,4.219 9.468,9.404 z"
           id="path4959"
           style="fill:#fa6900;fill-opacity:1" />
      </g>
      <g
         id="g4961"
         transform="translate(318.32678,445.77951)">
        <path
           d="m 20.674,51.65 -5.036,0 c 0.526,12.113 7.415,22.611 17.437,28.26 0.59,-1.577 1.442,-3.039 2.522,-4.327 C 27.076,70.801 21.195,61.918 20.674,51.65 Z"
           id="path4963" />
      </g>
      <g
         id="g4965"
         transform="translate(318.32678,445.77951)">
        <path
           d="m 79.327,51.65 c -0.522,10.267 -6.402,19.15 -14.923,23.933 1.08,1.288 1.932,2.75 2.522,4.327 10.022,-5.649 16.911,-16.146 17.437,-28.259 l -5.036,0 z"
           id="path4967" />
      </g>
      <g
         id="g4969"
         transform="translate(318.32678,445.77951)">
        <path
           d="m 63.648,21.118 0,-2.317 C 59.461,16.995 54.849,15.985 50,15.985 c -4.863,0 -9.491,1.013 -13.689,2.828 l 0,2.305 c 0,1.223 -0.186,2.403 -0.52,3.52 4.214,-2.323 9.057,-3.651 14.209,-3.651 5.132,0 9.959,1.317 14.161,3.625 -0.329,-1.109 -0.513,-2.28 -0.513,-3.494 z"
           id="path4971" />
      </g>
    </g>
  </g>
</svg>
