%!PS-Adobe-3.0 EPSF-3.0
%%Creator: cairo 1.14.2 (http://cairographics.org)
%%CreationDate: Wed Apr 29 19:53:01 2015
%%Pages: 1
%%DocumentData: Clean7Bit
%%LanguageLevel: 2
%%BoundingBox: 14 98 561 420
%%EndComments
%%BeginProlog
save
50 dict begin
/q { gsave } bind def
/Q { grestore } bind def
/cm { 6 array astore concat } bind def
/w { setlinewidth } bind def
/J { setlinecap } bind def
/j { setlinejoin } bind def
/M { setmiterlimit } bind def
/d { setdash } bind def
/m { moveto } bind def
/l { lineto } bind def
/c { curveto } bind def
/h { closepath } bind def
/re { exch dup neg 3 1 roll 5 3 roll moveto 0 rlineto
      0 exch rlineto 0 rlineto closepath } bind def
/S { stroke } bind def
/f { fill } bind def
/f* { eofill } bind def
/n { newpath } bind def
/W { clip } bind def
/W* { eoclip } bind def
/BT { } bind def
/ET { } bind def
/pdfmark where { pop globaldict /?pdfmark /exec load put }
    { globaldict begin /?pdfmark /pop load def /pdfmark
    /cleartomark load def end } ifelse
/BDC { mark 3 1 roll /BDC pdfmark } bind def
/EMC { mark /EMC pdfmark } bind def
/cairo_store_point { /cairo_point_y exch def /cairo_point_x exch def } def
/Tj { show currentpoint cairo_store_point } bind def
/TJ {
  {
    dup
    type /stringtype eq
    { show } { -0.001 mul 0 cairo_font_matrix dtransform rmoveto } ifelse
  } forall
  currentpoint cairo_store_point
} bind def
/cairo_selectfont { cairo_font_matrix aload pop pop pop 0 0 6 array astore
    cairo_font exch selectfont cairo_point_x cairo_point_y moveto } bind def
/Tf { pop /cairo_font exch def /cairo_font_matrix where
      { pop cairo_selectfont } if } bind def
/Td { matrix translate cairo_font_matrix matrix concatmatrix dup
      /cairo_font_matrix exch def dup 4 get exch 5 get cairo_store_point
      /cairo_font where { pop cairo_selectfont } if } bind def
/Tm { 2 copy 8 2 roll 6 array astore /cairo_font_matrix exch def
      cairo_store_point /cairo_font where { pop cairo_selectfont } if } bind def
/g { setgray } bind def
/rg { setrgbcolor } bind def
/d1 { setcachedevice } bind def
%%EndProlog
%%BeginSetup
%%EndSetup
%%Page: 1 1
%%BeginPageSetup
%%PageBoundingBox: 14 98 561 420
%%EndPageSetup
q 14 98 547 322 rectclip q
0.784314 g
289.973 376.307 m 185.285 376.307 l 185.285 371.143 l 185.285 347.029 185.176
 322.912 185.375 298.799 c 185.395 294.514 184.113 293.037 179.844 293.307
 c 174.676 293.639 169.492 293.479 164.32 293.369 c 161.477 293.307 160.469
 294.404 160.48 297.291 c 160.52 312.869 160.473 328.447 160.473 344.026
 c 141.738 344.026 l 141.738 274.897 l 204.055 274.897 l 204.055 280.342
 l 204.055 304.463 204.129 328.588 203.965 352.709 c 203.934 356.592 205.016
 357.756 208.945 357.717 c 227.891 357.526 246.828 357.635 265.773 357.619
 c 267.332 357.612 268.879 357.408 270.977 357.264 c 270.977 185.287 l 289.863
 185.287 l 289.863 228.725 l 312.207 228.725 l 312.207 248.924 l 289.973
 248.924 l h
289.973 376.307 m f
480.082 333.026 m 455.078 333.194 430.066 333.115 405.062 333.115 c 399.867
 333.115 l 399.867 314.436 l 503.777 314.436 l 503.777 418.901 l 56.293 
418.901 l 56.293 304.768 l 95.25 304.768 l 95.25 190.686 l 112.996 190.686
 l 112.996 367.881 l 94.875 367.881 l 94.875 323.272 l 89.055 323.272 83.879
 323.463 78.734 323.197 c 75.215 323.018 74.195 324.174 74.219 327.694 c
 74.367 350.186 74.379 372.678 74.219 395.174 c 74.195 398.877 75.316 399.963
 78.984 399.936 c 97.77 399.776 116.562 399.865 135.359 399.858 c 141.707
 399.858 141.727 399.854 141.727 393.639 c 141.727 371.549 l 160.457 371.549
 l 160.445 379.635 160.48 387.721 160.457 395.811 c 160.457 398.901 161.48
 399.908 164.555 399.901 c 212.488 399.826 260.418 399.854 308.355 399.826
 c 309.348 399.826 310.332 399.565 311.797 399.362 c 311.797 274.057 l 330.82
 274.057 l 330.82 357.244 l 354.977 357.244 l 354.977 248.912 l 336.07 248.912
 l 336.07 228.713 l 374.586 228.713 l 374.586 272.143 l 387.355 272.143 
l 403.633 272.139 419.91 272.194 436.191 272.049 c 437.555 272.041 440.086
 270.811 440.105 270.072 c 440.41 262.756 440.289 255.416 440.289 247.67
 c 415.793 247.67 l 415.793 228.084 l 458.82 228.084 l 458.82 291.518 l 
374.703 291.518 l 374.703 357.647 l 443 357.647 l 443 376.615 l 435.66 376.615
 l 396.887 376.615 374.648 376.643 335.871 376.569 c 332.609 376.561 330.5
 376.826 330.824 381.002 c 331.176 385.565 331.176 390.197 330.824 394.756
 c 330.488 398.947 332.055 399.947 336.062 399.936 c 384.156 399.815 432.242
 399.815 480.344 399.936 c 484.191 399.947 485.477 398.901 485.445 394.967
 c 485.285 376.029 485.262 357.088 485.453 338.151 c 485.512 333.975 484.043
 333.006 480.082 333.026 c h
480.082 333.026 m f
161.355 225.783 m 161.348 229.615 162.809 230.393 166.312 230.377 c 191.621
 230.252 216.926 230.299 242.23 230.299 c 247.59 230.299 l 247.59 317.881
 l 228.59 317.881 l 228.59 249.221 l 143.363 249.221 l 143.363 190.682 l
 161.383 190.682 l 161.379 202.389 161.398 214.08 161.352 225.783 c h
161.355 225.783 m f
315.246 205.108 m 315.246 141.951 l 361.801 141.951 l 361.801 160.83 l 
333.254 160.83 l 333.254 168.24 333.445 175.174 333.176 182.076 c 333.051
 185.74 334.18 186.885 337.898 186.858 c 346.039 186.779 354.176 186.873
 362.324 186.858 c 362.324 205.104 l 346.637 205.108 330.934 205.108 315.246
 205.108 c h
315.246 205.108 m f
485.23 289.299 m 485.23 117.408 l 418.617 117.408 l 418.391 118.186 418.102
 118.748 418.102 119.315 c 418.055 140.779 418.047 162.229 417.988 183.69
 c 417.988 186.322 419.391 186.846 421.66 186.807 c 427.438 186.721 433.215
 186.6 438.984 186.854 c 442.516 187.006 443.609 185.779 443.543 182.287
 c 443.375 171.346 443.477 171.401 443.5 160.455 c 443.5 158.748 443.66 
157.045 443.738 155.463 c 461.832 155.463 l 461.832 205.115 l 389.855 205.115
 l 389.855 186.869 l 391.477 186.877 393.102 186.854 394.723 186.869 c 398.738
 186.916 400.094 185.838 400.059 181.686 c 399.855 161.854 399.855 142.029
 400.059 122.197 c 400.102 117.967 398.648 117.084 394.711 117.096 c 361.711
 117.24 328.715 117.186 295.703 117.194 c 294.133 117.194 292.562 117.322
 290.484 117.416 c 290.484 162.346 l 204.344 162.346 l 204.344 169.572 204.516
 176.338 204.27 183.096 c 204.152 186.588 205.258 187.717 208.762 187.658
 c 220.145 187.475 220.535 187.58 231.926 187.604 c 233.484 187.612 235.047
 187.779 236.648 187.885 c 236.648 205.455 l 185.543 205.455 l 185.543 143.084
 l 270.41 143.084 l 270.41 117.397 l 161.809 117.397 l 161.668 118.869 161.441
 120.158 161.441 121.455 c 161.438 135.354 161.406 149.26 161.406 163.158
 c 143.363 163.158 l 143.363 126.994 l 143.363 117.186 143.363 117.186 133.598
 117.186 c 114.758 117.186 l 114.758 163.217 l 96.336 163.217 l 96.336 117.397
 l 74.414 117.397 l 74.414 274.108 l 55.93 274.108 l 55.93 98.381 l 504.148
 98.381 l 504.148 289.307 l 497.805 289.303 491.812 289.303 485.23 289.303
 c h
485.23 289.299 m f
0 g
38.312 282.834 m 32.188 282.834 l 31.66 282.834 31.199 282.373 31.199 281.846
 c 31.199 281.319 31.66 280.858 32.188 280.858 c 38.312 280.858 l 38.836
 280.858 39.297 281.319 39.297 281.846 c 39.297 282.373 38.902 282.834 38.312
 282.834 c h
38.312 282.834 m f
55.035 279.608 m 49.965 287.576 l 49.965 290.737 50.031 303.643 50.031 
303.643 c 50.031 305.815 48.254 307.592 46.082 307.592 c 24.551 307.592 
l 22.375 307.592 20.598 305.815 20.598 303.643 c 20.598 303.643 20.664 290.737
 20.664 287.576 c 15.527 279.608 l 14.738 278.686 14.543 277.369 15.004 
276.186 c 15.527 274.932 16.715 274.143 18.031 274.143 c 52.535 274.143 
l 53.852 274.143 55.035 274.932 55.562 276.186 c 56.023 277.369 55.824 278.686
 55.035 279.608 c h
46.082 303.643 m 46.082 303.643 46.016 291.791 46.016 288.037 c 24.551 
288.037 l 24.551 291.791 24.484 303.643 24.484 303.643 c h
19.281 278.158 m 24.023 285.6 l 24.09 285.666 l 24.352 286.127 l 46.344
 286.127 l 46.605 285.666 l 46.605 285.666 46.605 285.6 46.672 285.6 c 51.414
 278.158 l h
19.281 278.158 m f
0.952941 0.52549 0.188235 rg
3.2 w
1 J
1 j
[] 0.0 d
4 M q 1 0 0 -1 0 595.275574 cm
159.281 238.945 m 159.281 255.812 145.609 269.484 128.742 269.484 c 111.879
 269.484 98.207 255.812 98.207 238.945 c 98.207 222.082 111.879 208.41 128.742
 208.41 c 145.609 208.41 159.281 222.082 159.281 238.945 c h
159.281 238.945 m S Q
0.980392 0.411765 0 rg
128.742 358.631 m 128.672 358.631 l 127.312 358.631 124.773 360.838 123.766
 361.779 c 123.527 361.99 123.34 362.225 123.246 362.529 c 123.129 362.811
 122.965 362.998 122.824 363.139 c 123.059 363.447 123.434 363.822 124.023
 364.197 c 125.41 365.092 126.23 366.029 126.488 366.522 c 126.77 367.018
 126.746 367.252 126.254 367.276 c 125.762 367.299 124.656 366.428 124.656
 366.428 c 124.656 366.428 123.176 365.186 122.191 363.494 c 121.91 363.541
 121.508 363.541 121.18 363.26 c 120.641 362.811 120.758 362.131 120.945
 361.803 c 120.781 361.662 120.594 361.522 120.359 361.377 c 118.949 360.416
 118.148 359.475 117.867 359.006 c 117.586 358.514 117.609 358.279 118.102
 358.256 c 118.598 358.233 119.699 359.1 119.699 359.1 c 119.699 359.1 120.688
 359.947 121.602 361.166 c 121.789 361.072 122.074 360.932 122.426 360.768
 c 122.52 360.721 122.59 360.674 122.684 360.627 c 123.41 360.018 124.305
 358.608 124.961 357.455 c 125.48 356.565 125.48 355.436 124.961 354.545
 c 124.305 353.369 123.363 351.889 122.637 351.279 c 122.566 351.209 122.473
 351.162 122.402 351.139 c 122.238 351.069 122.121 350.998 122.004 350.951
 c 121.016 352.451 119.746 353.533 119.746 353.533 c 119.746 353.533 118.645
 354.404 118.148 354.381 c 117.656 354.358 117.633 354.119 117.914 353.627
 c 118.195 353.135 118.996 352.194 120.383 351.303 c 120.781 351.045 121.086
 350.787 121.32 350.549 c 121.18 350.455 121.086 350.385 121.016 350.291
 c 120.805 350.057 120.523 349.213 121.156 348.694 c 121.602 348.319 122.121
 348.412 122.402 348.506 c 122.473 348.529 122.543 348.553 122.59 348.6 
c 123.551 347.217 124.68 346.252 124.68 346.252 c 124.68 346.252 125.785
 345.381 126.277 345.404 c 126.77 345.432 126.793 345.666 126.512 346.158
 c 126.23 346.651 125.434 347.592 124.047 348.483 c 123.648 348.74 123.363
 349.002 123.129 349.213 c 123.152 349.26 123.176 349.307 123.199 349.377
 c 123.316 349.682 123.504 349.94 123.742 350.151 c 124.75 351.092 127.266
 353.299 128.648 353.299 c 128.625 353.276 m 129.988 353.276 132.645 351.069
 133.676 350.127 c 133.91 349.916 134.098 349.635 134.215 349.354 c 134.262
 349.26 134.289 349.19 134.336 349.119 c 134.121 348.904 133.84 348.67 133.488
 348.459 c 132.102 347.569 131.281 346.627 131.023 346.135 c 130.742 345.643
 130.766 345.404 131.258 345.381 c 131.75 345.358 132.855 346.229 132.855
 346.229 c 132.855 346.229 133.98 347.19 134.922 348.553 c 134.945 348.529
 134.992 348.529 135.016 348.506 c 135.297 348.412 135.812 348.319 136.262
 348.694 c 136.895 349.213 136.613 350.057 136.402 350.291 c 136.332 350.362
 136.262 350.432 136.168 350.502 c 136.402 350.764 136.707 351.022 137.152
 351.303 c 138.539 352.194 139.359 353.135 139.621 353.627 c 139.902 354.119
 139.879 354.358 139.383 354.381 c 138.891 354.404 137.785 353.533 137.785
 353.533 c 137.785 353.533 136.496 352.428 135.508 350.904 c 135.367 350.975
 135.203 351.045 135.016 351.139 c 134.922 351.186 134.852 351.233 134.758
 351.279 c 134.027 351.889 133.137 353.299 132.477 354.451 c 131.961 355.342
 131.961 356.471 132.477 357.362 c 133.137 358.537 134.074 360.018 134.805
 360.627 c 134.875 360.697 134.969 360.744 135.062 360.768 c 135.438 360.932
 135.695 361.049 135.883 361.166 c 136.801 359.924 137.785 359.1 137.785
 359.1 c 137.785 359.1 138.891 358.233 139.383 358.256 c 139.879 358.279
 139.902 358.514 139.621 359.006 c 139.336 359.498 138.539 360.44 137.152
 361.33 c 136.918 361.475 136.73 361.639 136.566 361.779 c 136.73 362.131
 136.848 362.787 136.332 363.237 c 136 363.518 135.625 363.518 135.344 363.471
 c 134.312 365.139 132.832 366.381 132.832 366.381 c 132.832 366.381 131.727
 367.252 131.234 367.229 c 130.742 367.205 130.715 366.971 131 366.475 c
 131.281 365.983 132.078 365.045 133.465 364.151 c 134.027 363.776 134.406
 363.424 134.664 363.115 c 134.523 362.998 134.359 362.787 134.238 362.529
 c 134.121 362.225 133.934 361.967 133.699 361.756 c 132.691 360.815 130.105
 358.608 128.719 358.608 c 135.438 362.928 m 135.859 363.022 136.238 362.647
 136.145 362.225 c 136.098 362.014 135.93 361.85 135.719 361.803 c 135.297
 361.709 134.922 362.084 135.016 362.506 c 135.062 362.717 135.227 362.881
 135.438 362.928 c h
122.004 361.873 m 121.578 361.779 121.203 362.154 121.297 362.576 c 121.344
 362.787 121.508 362.951 121.719 362.998 c 122.145 363.092 122.52 362.717
 122.426 362.295 c 122.379 362.084 122.215 361.92 122.004 361.873 c h
122.051 349.026 m 121.625 348.928 121.25 349.307 121.344 349.729 c 121.391
 349.94 121.555 350.104 121.766 350.151 c 122.191 350.244 122.566 349.869
 122.473 349.447 c 122.426 349.237 122.262 349.072 122.051 349.026 c h
135.602 349.096 m 135.18 349.002 134.805 349.377 134.898 349.799 c 134.945
 350.01 135.109 350.174 135.32 350.221 c 135.742 350.315 136.121 349.94 
136.023 349.518 c 135.977 349.307 135.812 349.143 135.602 349.096 c h
135.602 349.096 m f
0.234892 w
0 J
0 j
q 1 0 0 -1 0 595.275574 cm
128.742 236.645 m 128.672 236.645 l 127.312 236.645 124.773 234.438 123.766
 233.496 c 123.527 233.285 123.34 233.051 123.246 232.746 c 123.129 232.465
 122.965 232.277 122.824 232.137 c 123.059 231.828 123.434 231.453 124.023
 231.078 c 125.41 230.184 126.23 229.246 126.488 228.754 c 126.77 228.258
 126.746 228.023 126.254 228 c 125.762 227.977 124.656 228.848 124.656 228.848
 c 124.656 228.848 123.176 230.09 122.191 231.781 c 121.91 231.734 121.508
 231.734 121.18 232.016 c 120.641 232.465 120.758 233.145 120.945 233.473
 c 120.781 233.613 120.594 233.754 120.359 233.898 c 118.949 234.859 118.148
 235.801 117.867 236.27 c 117.586 236.762 117.609 236.996 118.102 237.02
 c 118.598 237.043 119.699 236.176 119.699 236.176 c 119.699 236.176 120.688
 235.328 121.602 234.109 c 121.789 234.203 122.074 234.344 122.426 234.508
 c 122.52 234.555 122.59 234.602 122.684 234.648 c 123.41 235.258 124.305
 236.668 124.961 237.82 c 125.48 238.711 125.48 239.84 124.961 240.73 c 
124.305 241.906 123.363 243.387 122.637 243.996 c 122.566 244.066 122.473
 244.113 122.402 244.137 c 122.238 244.207 122.121 244.277 122.004 244.324
 c 121.016 242.824 119.746 241.742 119.746 241.742 c 119.746 241.742 118.645
 240.871 118.148 240.895 c 117.656 240.918 117.633 241.156 117.914 241.648
 c 118.195 242.141 118.996 243.082 120.383 243.973 c 120.781 244.23 121.086
 244.488 121.32 244.727 c 121.18 244.82 121.086 244.891 121.016 244.984 
c 120.805 245.219 120.523 246.062 121.156 246.582 c 121.602 246.957 122.121
 246.863 122.402 246.77 c 122.473 246.746 122.543 246.723 122.59 246.676
 c 123.551 248.059 124.68 249.023 124.68 249.023 c 124.68 249.023 125.785
 249.895 126.277 249.871 c 126.77 249.844 126.793 249.609 126.512 249.117
 c 126.23 248.625 125.434 247.684 124.047 246.793 c 123.648 246.535 123.363
 246.273 123.129 246.062 c 123.152 246.016 123.176 245.969 123.199 245.898
 c 123.316 245.594 123.504 245.336 123.742 245.125 c 124.75 244.184 127.266
 241.977 128.648 241.977 c 128.625 242 m 129.988 242 132.645 244.207 133.676
 245.148 c 133.91 245.359 134.098 245.641 134.215 245.922 c 134.262 246.016
 134.289 246.086 134.336 246.156 c 134.121 246.371 133.84 246.605 133.488
 246.816 c 132.102 247.707 131.281 248.648 131.023 249.141 c 130.742 249.633
 130.766 249.871 131.258 249.895 c 131.75 249.918 132.855 249.047 132.855
 249.047 c 132.855 249.047 133.98 248.086 134.922 246.723 c 134.945 246.746
 134.992 246.746 135.016 246.77 c 135.297 246.863 135.812 246.957 136.262
 246.582 c 136.895 246.062 136.613 245.219 136.402 244.984 c 136.332 244.914
 136.262 244.844 136.168 244.773 c 136.402 244.512 136.707 244.254 137.152
 243.973 c 138.539 243.082 139.359 242.141 139.621 241.648 c 139.902 241.156
 139.879 240.918 139.383 240.895 c 138.891 240.871 137.785 241.742 137.785
 241.742 c 137.785 241.742 136.496 242.848 135.508 244.371 c 135.367 244.301
 135.203 244.23 135.016 244.137 c 134.922 244.09 134.852 244.043 134.758
 243.996 c 134.027 243.387 133.137 241.977 132.477 240.824 c 131.961 239.934
 131.961 238.805 132.477 237.914 c 133.137 236.738 134.074 235.258 134.805
 234.648 c 134.875 234.578 134.969 234.531 135.062 234.508 c 135.438 234.344
 135.695 234.227 135.883 234.109 c 136.801 235.352 137.785 236.176 137.785
 236.176 c 137.785 236.176 138.891 237.043 139.383 237.02 c 139.879 236.996
 139.902 236.762 139.621 236.27 c 139.336 235.777 138.539 234.836 137.152
 233.945 c 136.918 233.801 136.73 233.637 136.566 233.496 c 136.73 233.145
 136.848 232.488 136.332 232.039 c 136 231.758 135.625 231.758 135.344 231.805
 c 134.312 230.137 132.832 228.895 132.832 228.895 c 132.832 228.895 131.727
 228.023 131.234 228.047 c 130.742 228.07 130.715 228.305 131 228.801 c 
131.281 229.293 132.078 230.23 133.465 231.125 c 134.027 231.5 134.406 231.852
 134.664 232.16 c 134.523 232.277 134.359 232.488 134.238 232.746 c 134.121
 233.051 133.934 233.309 133.699 233.52 c 132.691 234.461 130.105 236.668
 128.719 236.668 c 135.438 232.348 m 135.859 232.254 136.238 232.629 136.145
 233.051 c 136.098 233.262 135.93 233.426 135.719 233.473 c 135.297 233.566
 134.922 233.191 135.016 232.77 c 135.062 232.559 135.227 232.395 135.438
 232.348 c h
122.004 233.402 m 121.578 233.496 121.203 233.121 121.297 232.699 c 121.344
 232.488 121.508 232.324 121.719 232.277 c 122.145 232.184 122.52 232.559
 122.426 232.98 c 122.379 233.191 122.215 233.355 122.004 233.402 c h
122.051 246.25 m 121.625 246.348 121.25 245.969 121.344 245.547 c 121.391
 245.336 121.555 245.172 121.766 245.125 c 122.191 245.031 122.566 245.406
 122.473 245.828 c 122.426 246.039 122.262 246.203 122.051 246.25 c h
135.602 246.18 m 135.18 246.273 134.805 245.898 134.898 245.477 c 134.945
 245.266 135.109 245.102 135.32 245.055 c 135.742 244.961 136.121 245.336
 136.023 245.758 c 135.977 245.969 135.812 246.133 135.602 246.18 c h
135.602 246.18 m S Q
0.952941 0.52549 0.188235 rg
3.2 w
1 J
1 j
q 1 0 0 -1 0 595.275574 cm
167.379 238.945 m 167.379 260.285 150.082 277.582 128.742 277.582 c 107.406
 277.582 90.109 260.285 90.109 238.945 c 90.109 217.609 107.406 200.312 
128.742 200.312 c 150.082 200.312 167.379 217.609 167.379 238.945 c h
167.379 238.945 m S Q
q 1 0 0 -1 0 595.275574 cm
151.043 238.945 m 151.043 251.262 141.059 261.246 128.742 261.246 c 116.426
 261.246 106.441 251.262 106.441 238.945 c 106.441 226.629 116.426 216.645
 128.742 216.645 c 141.059 216.645 151.043 226.629 151.043 238.945 c h
151.043 238.945 m S Q
q 1 0 0 -1 0 595.275574 cm
284.789 379.75 m 284.789 396.617 271.117 410.289 254.25 410.289 c 237.387
 410.289 223.715 396.617 223.715 379.75 c 223.715 362.887 237.387 349.215
 254.25 349.215 c 271.117 349.215 284.789 362.887 284.789 379.75 c h
284.789 379.75 m S Q
0.980392 0.411765 0 rg
254.25 217.826 m 254.18 217.826 l 252.816 217.826 250.281 220.033 249.27
 220.975 c 249.035 221.186 248.848 221.42 248.754 221.725 c 248.637 222.006
 248.473 222.194 248.332 222.334 c 248.566 222.643 248.941 223.018 249.531
 223.393 c 250.914 224.283 251.738 225.225 251.996 225.717 c 252.277 226.213
 252.254 226.447 251.762 226.471 c 251.27 226.494 250.164 225.623 250.164
 225.623 c 250.164 225.623 248.684 224.381 247.695 222.69 c 247.414 222.737
 247.016 222.737 246.688 222.451 c 246.148 222.006 246.266 221.326 246.453
 220.998 c 246.289 220.858 246.102 220.713 245.863 220.572 c 244.457 219.612
 243.656 218.67 243.375 218.201 c 243.094 217.709 243.117 217.475 243.609
 217.451 c 244.102 217.428 245.207 218.295 245.207 218.295 c 245.207 218.295
 246.195 219.143 247.109 220.362 c 247.297 220.268 247.578 220.127 247.934
 219.963 c 248.027 219.916 248.098 219.869 248.191 219.822 c 248.918 219.213
 249.812 217.803 250.469 216.651 c 250.984 215.76 250.984 214.631 250.469
 213.74 c 249.812 212.565 248.871 211.084 248.145 210.475 c 248.074 210.404
 247.98 210.358 247.91 210.334 c 247.746 210.264 247.625 210.194 247.508
 210.147 c 246.523 211.647 245.254 212.729 245.254 212.729 c 245.254 212.729
 244.148 213.596 243.656 213.572 c 243.164 213.549 243.141 213.315 243.422
 212.822 c 243.703 212.33 244.504 211.389 245.887 210.498 c 246.289 210.24
 246.594 209.979 246.828 209.744 c 246.688 209.651 246.594 209.58 246.523
 209.487 c 246.312 209.252 246.031 208.408 246.664 207.889 c 247.109 207.514
 247.625 207.608 247.91 207.701 c 247.98 207.725 248.051 207.748 248.098
 207.795 c 249.059 206.408 250.188 205.447 250.188 205.447 c 250.188 205.447
 251.293 204.576 251.785 204.6 c 252.277 204.623 252.301 204.862 252.02 
205.354 c 251.738 205.846 250.938 206.787 249.555 207.678 c 249.152 207.936
 248.871 208.194 248.637 208.408 c 248.66 208.455 248.684 208.502 248.707
 208.572 c 248.824 208.877 249.012 209.135 249.246 209.346 c 250.258 210.287
 252.77 212.494 254.156 212.494 c 254.133 212.471 m 255.496 212.471 258.148
 210.264 259.184 209.322 c 259.418 209.112 259.605 208.83 259.723 208.549
 c 259.77 208.455 259.793 208.385 259.84 208.311 c 259.629 208.1 259.348
 207.865 258.996 207.654 c 257.609 206.764 256.789 205.822 256.527 205.33
 c 256.246 204.838 256.27 204.6 256.766 204.576 c 257.258 204.553 258.359
 205.424 258.359 205.424 c 258.359 205.424 259.488 206.385 260.43 207.748
 c 260.453 207.725 260.5 207.725 260.523 207.701 c 260.805 207.608 261.32
 207.514 261.766 207.889 c 262.402 208.408 262.121 209.252 261.906 209.487
 c 261.836 209.557 261.766 209.627 261.672 209.697 c 261.906 209.955 262.215
 210.217 262.66 210.498 c 264.047 211.389 264.867 212.33 265.125 212.822
 c 265.406 213.315 265.383 213.549 264.891 213.572 c 264.398 213.596 263.293
 212.729 263.293 212.729 c 263.293 212.729 262.004 211.623 261.016 210.096
 c 260.875 210.17 260.711 210.24 260.523 210.334 c 260.43 210.381 260.359
 210.428 260.266 210.475 c 259.535 211.084 258.645 212.494 257.984 213.643
 c 257.469 214.537 257.469 215.666 257.984 216.557 c 258.645 217.733 259.582
 219.213 260.312 219.822 c 260.383 219.893 260.477 219.94 260.57 219.963
 c 260.945 220.127 261.203 220.244 261.391 220.362 c 262.309 219.119 263.293
 218.295 263.293 218.295 c 263.293 218.295 264.398 217.428 264.891 217.451
 c 265.383 217.475 265.406 217.709 265.125 218.201 c 264.844 218.694 264.047
 219.635 262.66 220.526 c 262.426 220.666 262.238 220.834 262.074 220.975
 c 262.238 221.326 262.355 221.983 261.836 222.428 c 261.508 222.713 261.133
 222.713 260.852 222.666 c 259.816 224.334 258.336 225.576 258.336 225.576
 c 258.336 225.576 257.234 226.447 256.742 226.424 c 256.246 226.401 256.223
 226.166 256.504 225.67 c 256.789 225.178 257.586 224.237 258.973 223.346
 c 259.535 222.971 259.91 222.619 260.172 222.311 c 260.027 222.194 259.863
 221.983 259.746 221.725 c 259.629 221.42 259.441 221.162 259.207 220.951
 c 258.195 220.01 255.613 217.803 254.227 217.803 c 260.945 222.123 m 261.367
 222.217 261.742 221.842 261.648 221.42 c 261.602 221.209 261.438 221.045
 261.227 220.998 c 260.805 220.904 260.43 221.279 260.523 221.701 c 260.57
 221.912 260.734 222.076 260.945 222.123 c h
247.508 221.069 m 247.086 220.975 246.711 221.35 246.805 221.772 c 246.852
 221.983 247.016 222.147 247.227 222.194 c 247.648 222.287 248.027 221.912
 247.934 221.49 c 247.887 221.279 247.723 221.115 247.508 221.069 c h
247.555 208.217 m 247.133 208.123 246.758 208.502 246.852 208.924 c 246.898
 209.135 247.062 209.299 247.273 209.346 c 247.695 209.44 248.074 209.065
 247.98 208.643 c 247.934 208.432 247.77 208.264 247.555 208.217 c h
261.109 208.287 m 260.688 208.194 260.312 208.572 260.406 208.994 c 260.453
 209.205 260.617 209.369 260.828 209.416 c 261.25 209.51 261.625 209.135
 261.531 208.713 c 261.484 208.502 261.32 208.334 261.109 208.287 c h
261.109 208.287 m f
0.234892 w
0 J
0 j
q 1 0 0 -1 0 595.275574 cm
254.25 377.449 m 254.18 377.449 l 252.816 377.449 250.281 375.242 249.27
 374.301 c 249.035 374.09 248.848 373.855 248.754 373.551 c 248.637 373.27
 248.473 373.082 248.332 372.941 c 248.566 372.633 248.941 372.258 249.531
 371.883 c 250.914 370.992 251.738 370.051 251.996 369.559 c 252.277 369.062
 252.254 368.828 251.762 368.805 c 251.27 368.781 250.164 369.652 250.164
 369.652 c 250.164 369.652 248.684 370.895 247.695 372.586 c 247.414 372.539
 247.016 372.539 246.688 372.824 c 246.148 373.27 246.266 373.949 246.453
 374.277 c 246.289 374.418 246.102 374.562 245.863 374.703 c 244.457 375.664
 243.656 376.605 243.375 377.074 c 243.094 377.566 243.117 377.801 243.609
 377.824 c 244.102 377.848 245.207 376.98 245.207 376.98 c 245.207 376.98
 246.195 376.133 247.109 374.914 c 247.297 375.008 247.578 375.148 247.934
 375.312 c 248.027 375.359 248.098 375.406 248.191 375.453 c 248.918 376.062
 249.812 377.473 250.469 378.625 c 250.984 379.516 250.984 380.645 250.469
 381.535 c 249.812 382.711 248.871 384.191 248.145 384.801 c 248.074 384.871
 247.98 384.918 247.91 384.941 c 247.746 385.012 247.625 385.082 247.508
 385.129 c 246.523 383.629 245.254 382.547 245.254 382.547 c 245.254 382.547
 244.148 381.68 243.656 381.703 c 243.164 381.727 243.141 381.961 243.422
 382.453 c 243.703 382.945 244.504 383.887 245.887 384.777 c 246.289 385.035
 246.594 385.297 246.828 385.531 c 246.688 385.625 246.594 385.695 246.523
 385.789 c 246.312 386.023 246.031 386.867 246.664 387.387 c 247.109 387.762
 247.625 387.668 247.91 387.574 c 247.98 387.551 248.051 387.527 248.098
 387.48 c 249.059 388.867 250.188 389.828 250.188 389.828 c 250.188 389.828
 251.293 390.699 251.785 390.676 c 252.277 390.652 252.301 390.414 252.02
 389.922 c 251.738 389.43 250.938 388.488 249.555 387.598 c 249.152 387.34
 248.871 387.082 248.637 386.867 c 248.66 386.82 248.684 386.773 248.707
 386.703 c 248.824 386.398 249.012 386.141 249.246 385.93 c 250.258 384.988
 252.77 382.781 254.156 382.781 c 254.133 382.805 m 255.496 382.805 258.148
 385.012 259.184 385.953 c 259.418 386.164 259.605 386.445 259.723 386.727
 c 259.77 386.82 259.793 386.891 259.84 386.965 c 259.629 387.176 259.348
 387.41 258.996 387.621 c 257.609 388.512 256.789 389.453 256.527 389.945
 c 256.246 390.438 256.27 390.676 256.766 390.699 c 257.258 390.723 258.359
 389.852 258.359 389.852 c 258.359 389.852 259.488 388.891 260.43 387.527
 c 260.453 387.551 260.5 387.551 260.523 387.574 c 260.805 387.668 261.32
 387.762 261.766 387.387 c 262.402 386.867 262.121 386.023 261.906 385.789
 c 261.836 385.719 261.766 385.648 261.672 385.578 c 261.906 385.32 262.215
 385.059 262.66 384.777 c 264.047 383.887 264.867 382.945 265.125 382.453
 c 265.406 381.961 265.383 381.727 264.891 381.703 c 264.398 381.68 263.293
 382.547 263.293 382.547 c 263.293 382.547 262.004 383.652 261.016 385.18
 c 260.875 385.105 260.711 385.035 260.523 384.941 c 260.43 384.895 260.359
 384.848 260.266 384.801 c 259.535 384.191 258.645 382.781 257.984 381.633
 c 257.469 380.738 257.469 379.609 257.984 378.719 c 258.645 377.543 259.582
 376.062 260.312 375.453 c 260.383 375.383 260.477 375.336 260.57 375.312
 c 260.945 375.148 261.203 375.031 261.391 374.914 c 262.309 376.156 263.293
 376.98 263.293 376.98 c 263.293 376.98 264.398 377.848 264.891 377.824 
c 265.383 377.801 265.406 377.566 265.125 377.074 c 264.844 376.582 264.047
 375.641 262.66 374.75 c 262.426 374.609 262.238 374.441 262.074 374.301
 c 262.238 373.949 262.355 373.293 261.836 372.848 c 261.508 372.562 261.133
 372.562 260.852 372.609 c 259.816 370.941 258.336 369.699 258.336 369.699
 c 258.336 369.699 257.234 368.828 256.742 368.852 c 256.246 368.875 256.223
 369.109 256.504 369.605 c 256.789 370.098 257.586 371.039 258.973 371.93
 c 259.535 372.305 259.91 372.656 260.172 372.965 c 260.027 373.082 259.863
 373.293 259.746 373.551 c 259.629 373.855 259.441 374.113 259.207 374.324
 c 258.195 375.266 255.613 377.473 254.227 377.473 c 260.945 373.152 m 261.367
 373.059 261.742 373.434 261.648 373.855 c 261.602 374.066 261.438 374.23
 261.227 374.277 c 260.805 374.371 260.43 373.996 260.523 373.574 c 260.57
 373.363 260.734 373.199 260.945 373.152 c h
247.508 374.207 m 247.086 374.301 246.711 373.926 246.805 373.504 c 246.852
 373.293 247.016 373.129 247.227 373.082 c 247.648 372.988 248.027 373.363
 247.934 373.785 c 247.887 373.996 247.723 374.16 247.508 374.207 c h
247.555 387.059 m 247.133 387.152 246.758 386.773 246.852 386.352 c 246.898
 386.141 247.062 385.977 247.273 385.93 c 247.695 385.836 248.074 386.211
 247.98 386.633 c 247.934 386.844 247.77 387.012 247.555 387.059 c h
261.109 386.988 m 260.688 387.082 260.312 386.703 260.406 386.281 c 260.453
 386.07 260.617 385.906 260.828 385.859 c 261.25 385.766 261.625 386.141
 261.531 386.562 c 261.484 386.773 261.32 386.941 261.109 386.988 c h
261.109 386.988 m S Q
0.952941 0.52549 0.188235 rg
3.2 w
1 J
1 j
q 1 0 0 -1 0 595.275574 cm
292.887 379.75 m 292.887 401.09 275.586 418.387 254.25 418.387 c 232.914
 418.387 215.617 401.09 215.617 379.75 c 215.617 358.414 232.914 341.117
 254.25 341.117 c 275.586 341.117 292.887 358.414 292.887 379.75 c h
292.887 379.75 m S Q
q 1 0 0 -1 0 595.275574 cm
276.551 379.75 m 276.551 392.066 266.566 402.051 254.25 402.051 c 241.934
 402.051 231.949 392.066 231.949 379.75 c 231.949 367.434 241.934 357.453
 254.25 357.453 c 266.566 357.453 276.551 367.434 276.551 379.75 c h
276.551 379.75 m S Q
q 1 0 0 -1 0 595.275574 cm
419.492 251.785 m 419.492 268.648 405.816 282.32 388.953 282.32 c 372.086
 282.32 358.414 268.648 358.414 251.785 c 358.414 234.918 372.086 221.246
 388.953 221.246 c 405.816 221.246 419.492 234.918 419.492 251.785 c h
419.492 251.785 m S Q
0.980392 0.411765 0 rg
388.953 345.791 m 388.883 345.791 l 387.52 345.791 384.984 348.002 383.973
 348.94 c 383.738 349.151 383.551 349.385 383.457 349.694 c 383.34 349.975
 383.176 350.162 383.035 350.303 c 383.27 350.608 383.645 350.983 384.23
 351.362 c 385.617 352.252 386.441 353.194 386.699 353.686 c 386.98 354.178
 386.957 354.412 386.465 354.436 c 385.969 354.459 384.867 353.592 384.867
 353.592 c 384.867 353.592 383.387 352.346 382.398 350.654 c 382.117 350.701
 381.719 350.701 381.391 350.42 c 380.848 349.975 380.965 349.291 381.156
 348.963 c 380.992 348.822 380.801 348.682 380.566 348.541 c 379.156 347.576
 378.359 346.639 378.078 346.17 c 377.797 345.674 377.82 345.44 378.312 
345.416 c 378.805 345.393 379.91 346.264 379.91 346.264 c 379.91 346.264
 380.895 347.108 381.812 348.33 c 382 348.237 382.281 348.096 382.633 347.932
 c 382.727 347.885 382.801 347.838 382.895 347.791 c 383.621 347.178 384.512
 345.768 385.172 344.619 c 385.688 343.725 385.688 342.6 385.172 341.705
 c 384.512 340.529 383.574 339.053 382.848 338.44 c 382.777 338.369 382.68
 338.322 382.609 338.299 c 382.445 338.229 382.328 338.158 382.211 338.112
 c 381.227 339.615 379.957 340.697 379.957 340.697 c 379.957 340.697 378.852
 341.565 378.359 341.541 c 377.867 341.518 377.844 341.283 378.125 340.791
 c 378.406 340.295 379.203 339.358 380.59 338.463 c 380.992 338.205 381.297
 337.947 381.531 337.713 c 381.391 337.619 381.297 337.549 381.227 337.455
 c 381.016 337.221 380.73 336.373 381.367 335.858 c 381.812 335.483 382.328
 335.576 382.609 335.67 c 382.68 335.694 382.75 335.717 382.801 335.764 
c 383.762 334.377 384.891 333.412 384.891 333.412 c 384.891 333.412 385.992
 332.545 386.488 332.569 c 386.98 332.592 387.004 332.826 386.723 333.319
 c 386.441 333.815 385.641 334.752 384.254 335.647 c 383.855 335.904 383.574
 336.162 383.34 336.373 c 383.363 336.42 383.387 336.467 383.41 336.537 
c 383.527 336.842 383.715 337.104 383.949 337.315 c 384.961 338.252 387.473
 340.459 388.859 340.459 c 388.836 340.436 m 390.199 340.436 392.852 338.229
 393.887 337.291 c 394.121 337.08 394.309 336.795 394.426 336.514 c 394.473
 336.42 394.496 336.35 394.543 336.279 c 394.332 336.069 394.051 335.834
 393.699 335.623 c 392.312 334.729 391.488 333.791 391.23 333.295 c 390.949
 332.803 390.973 332.569 391.465 332.545 c 391.961 332.522 393.062 333.389
 393.062 333.389 c 393.062 333.389 394.191 334.354 395.129 335.717 c 395.152
 335.694 395.203 335.694 395.227 335.67 c 395.508 335.576 396.023 335.483
 396.469 335.858 c 397.105 336.373 396.82 337.221 396.609 337.455 c 396.539
 337.526 396.469 337.596 396.375 337.666 c 396.609 337.924 396.914 338.182
 397.363 338.463 c 398.75 339.358 399.57 340.295 399.828 340.791 c 400.109
 341.283 400.086 341.518 399.594 341.541 c 399.102 341.565 397.996 340.697
 397.996 340.697 c 397.996 340.697 396.703 339.592 395.719 338.065 c 395.578
 338.135 395.414 338.205 395.227 338.299 c 395.129 338.346 395.059 338.393
 394.965 338.44 c 394.238 339.053 393.344 340.459 392.688 341.612 c 392.172
 342.506 392.172 343.631 392.688 344.526 c 393.344 345.697 394.285 347.178
 395.012 347.791 c 395.082 347.862 395.176 347.908 395.273 347.932 c 395.648
 348.096 395.906 348.213 396.094 348.33 c 397.012 347.084 397.996 346.264
 397.996 346.264 c 397.996 346.264 399.102 345.393 399.594 345.416 c 400.086
 345.44 400.109 345.674 399.828 346.17 c 399.547 346.662 398.75 347.6 397.363
 348.494 c 397.129 348.635 396.938 348.799 396.773 348.94 c 396.938 349.291
 397.059 349.951 396.539 350.397 c 396.211 350.678 395.836 350.678 395.555
 350.631 c 394.52 352.299 393.039 353.545 393.039 353.545 c 393.039 353.545
 391.938 354.412 391.441 354.389 c 390.949 354.365 390.926 354.131 391.207
 353.639 c 391.488 353.147 392.289 352.205 393.676 351.315 c 394.238 350.936
 394.613 350.584 394.871 350.279 c 394.73 350.162 394.566 349.951 394.449
 349.694 c 394.332 349.385 394.145 349.127 393.91 348.916 c 392.898 347.979
 390.316 345.768 388.93 345.768 c 395.648 350.092 m 396.07 350.186 396.445
 349.811 396.352 349.385 c 396.305 349.174 396.141 349.01 395.93 348.963
 c 395.508 348.869 395.129 349.244 395.227 349.67 c 395.273 349.881 395.438
 350.045 395.648 350.092 c h
382.211 349.033 m 381.789 348.94 381.414 349.315 381.508 349.74 c 381.555
 349.951 381.719 350.115 381.93 350.162 c 382.352 350.256 382.727 349.881
 382.633 349.459 c 382.586 349.244 382.422 349.08 382.211 349.033 c h
382.258 336.186 m 381.836 336.092 381.461 336.467 381.555 336.889 c 381.602
 337.104 381.766 337.268 381.977 337.315 c 382.398 337.408 382.777 337.033
 382.68 336.608 c 382.633 336.397 382.469 336.233 382.258 336.186 c h
395.812 336.256 m 395.391 336.162 395.012 336.537 395.105 336.959 c 395.152
 337.174 395.32 337.338 395.531 337.385 c 395.953 337.479 396.328 337.104
 396.234 336.678 c 396.188 336.467 396.023 336.303 395.812 336.256 c h
395.812 336.256 m f
0.234892 w
0 J
0 j
q 1 0 0 -1 0 595.275574 cm
388.953 249.484 m 388.883 249.484 l 387.52 249.484 384.984 247.273 383.973
 246.336 c 383.738 246.125 383.551 245.891 383.457 245.582 c 383.34 245.301
 383.176 245.113 383.035 244.973 c 383.27 244.668 383.645 244.293 384.23
 243.914 c 385.617 243.023 386.441 242.082 386.699 241.59 c 386.98 241.098
 386.957 240.863 386.465 240.84 c 385.969 240.816 384.867 241.684 384.867
 241.684 c 384.867 241.684 383.387 242.93 382.398 244.621 c 382.117 244.574
 381.719 244.574 381.391 244.855 c 380.848 245.301 380.965 245.984 381.156
 246.312 c 380.992 246.453 380.801 246.594 380.566 246.734 c 379.156 247.699
 378.359 248.637 378.078 249.105 c 377.797 249.602 377.82 249.836 378.312
 249.859 c 378.805 249.883 379.91 249.012 379.91 249.012 c 379.91 249.012
 380.895 248.168 381.812 246.945 c 382 247.039 382.281 247.18 382.633 247.344
 c 382.727 247.391 382.801 247.438 382.895 247.484 c 383.621 248.098 384.512
 249.508 385.172 250.656 c 385.688 251.551 385.688 252.676 385.172 253.57
 c 384.512 254.746 383.574 256.223 382.848 256.836 c 382.777 256.906 382.68
 256.953 382.609 256.977 c 382.445 257.047 382.328 257.117 382.211 257.164
 c 381.227 255.66 379.957 254.578 379.957 254.578 c 379.957 254.578 378.852
 253.711 378.359 253.734 c 377.867 253.758 377.844 253.992 378.125 254.484
 c 378.406 254.98 379.203 255.918 380.59 256.812 c 380.992 257.07 381.297
 257.328 381.531 257.562 c 381.391 257.656 381.297 257.727 381.227 257.82
 c 381.016 258.055 380.73 258.902 381.367 259.418 c 381.812 259.793 382.328
 259.699 382.609 259.605 c 382.68 259.582 382.75 259.559 382.801 259.512
 c 383.762 260.898 384.891 261.863 384.891 261.863 c 384.891 261.863 385.992
 262.73 386.488 262.707 c 386.98 262.684 387.004 262.449 386.723 261.957
 c 386.441 261.461 385.641 260.523 384.254 259.629 c 383.855 259.371 383.574
 259.113 383.34 258.902 c 383.363 258.855 383.387 258.809 383.41 258.738
 c 383.527 258.434 383.715 258.172 383.949 257.961 c 384.961 257.023 387.473
 254.816 388.859 254.816 c 388.836 254.84 m 390.199 254.84 392.852 257.047
 393.887 257.984 c 394.121 258.195 394.309 258.48 394.426 258.762 c 394.473
 258.855 394.496 258.926 394.543 258.996 c 394.332 259.207 394.051 259.441
 393.699 259.652 c 392.312 260.547 391.488 261.484 391.23 261.98 c 390.949
 262.473 390.973 262.707 391.465 262.73 c 391.961 262.754 393.062 261.887
 393.062 261.887 c 393.062 261.887 394.191 260.922 395.129 259.559 c 395.152
 259.582 395.203 259.582 395.227 259.605 c 395.508 259.699 396.023 259.793
 396.469 259.418 c 397.105 258.902 396.82 258.055 396.609 257.82 c 396.539
 257.75 396.469 257.68 396.375 257.609 c 396.609 257.352 396.914 257.094
 397.363 256.812 c 398.75 255.918 399.57 254.98 399.828 254.484 c 400.109
 253.992 400.086 253.758 399.594 253.734 c 399.102 253.711 397.996 254.578
 397.996 254.578 c 397.996 254.578 396.703 255.684 395.719 257.211 c 395.578
 257.141 395.414 257.07 395.227 256.977 c 395.129 256.93 395.059 256.883
 394.965 256.836 c 394.238 256.223 393.344 254.816 392.688 253.664 c 392.172
 252.77 392.172 251.645 392.688 250.75 c 393.344 249.578 394.285 248.098
 395.012 247.484 c 395.082 247.414 395.176 247.367 395.273 247.344 c 395.648
 247.18 395.906 247.062 396.094 246.945 c 397.012 248.191 397.996 249.012
 397.996 249.012 c 397.996 249.012 399.102 249.883 399.594 249.859 c 400.086
 249.836 400.109 249.602 399.828 249.105 c 399.547 248.613 398.75 247.676
 397.363 246.781 c 397.129 246.641 396.938 246.477 396.773 246.336 c 396.938
 245.984 397.059 245.324 396.539 244.879 c 396.211 244.598 395.836 244.598
 395.555 244.645 c 394.52 242.977 393.039 241.73 393.039 241.73 c 393.039
 241.73 391.938 240.863 391.441 240.887 c 390.949 240.91 390.926 241.145
 391.207 241.637 c 391.488 242.129 392.289 243.07 393.676 243.961 c 394.238
 244.34 394.613 244.691 394.871 244.996 c 394.73 245.113 394.566 245.324
 394.449 245.582 c 394.332 245.891 394.145 246.148 393.91 246.359 c 392.898
 247.297 390.316 249.508 388.93 249.508 c 395.648 245.184 m 396.07 245.09
 396.445 245.465 396.352 245.891 c 396.305 246.102 396.141 246.266 395.93
 246.312 c 395.508 246.406 395.129 246.031 395.227 245.605 c 395.273 245.395
 395.438 245.23 395.648 245.184 c h
382.211 246.242 m 381.789 246.336 381.414 245.961 381.508 245.535 c 381.555
 245.324 381.719 245.16 381.93 245.113 c 382.352 245.02 382.727 245.395 
382.633 245.816 c 382.586 246.031 382.422 246.195 382.211 246.242 c h
382.258 259.09 m 381.836 259.184 381.461 258.809 381.555 258.387 c 381.602
 258.172 381.766 258.008 381.977 257.961 c 382.398 257.867 382.777 258.242
 382.68 258.668 c 382.633 258.879 382.469 259.043 382.258 259.09 c h
395.812 259.02 m 395.391 259.113 395.012 258.738 395.105 258.316 c 395.152
 258.102 395.32 257.938 395.531 257.891 c 395.953 257.797 396.328 258.172
 396.234 258.598 c 396.188 258.809 396.023 258.973 395.812 259.02 c h
395.812 259.02 m S Q
0.952941 0.52549 0.188235 rg
3.2 w
1 J
1 j
q 1 0 0 -1 0 595.275574 cm
427.586 251.785 m 427.586 273.121 410.289 290.418 388.953 290.418 c 367.617
 290.418 350.32 273.121 350.32 251.785 c 350.32 230.449 367.617 213.148 
388.953 213.148 c 410.289 213.148 427.586 230.449 427.586 251.785 c h
427.586 251.785 m S Q
q 1 0 0 -1 0 595.275574 cm
411.254 251.785 m 411.254 264.102 401.27 274.086 388.953 274.086 c 376.637
 274.086 366.652 264.102 366.652 251.785 c 366.652 239.469 376.637 229.484
 388.953 229.484 c 401.27 229.484 411.254 239.469 411.254 251.785 c h
411.254 251.785 m S Q
q 1 0 0 -1 0 595.275574 cm
461.586 423.531 m 461.586 440.395 447.914 454.066 431.047 454.066 c 414.184
 454.066 400.512 440.395 400.512 423.531 c 400.512 406.664 414.184 392.992
 431.047 392.992 c 447.914 392.992 461.586 406.664 461.586 423.531 c h
461.586 423.531 m S Q
0.980392 0.411765 0 rg
431.047 174.049 m 430.977 174.049 l 429.613 174.049 427.078 176.256 426.066
 177.194 c 425.832 177.404 425.645 177.643 425.551 177.947 c 425.434 178.229
 425.27 178.416 425.129 178.557 c 425.363 178.862 425.738 179.24 426.328
 179.615 c 427.711 180.506 428.535 181.447 428.793 181.94 c 429.074 182.432
 429.051 182.666 428.559 182.69 c 428.062 182.713 426.961 181.846 426.961
 181.846 c 426.961 181.846 425.48 180.6 424.492 178.908 c 424.211 178.955
 423.812 178.955 423.484 178.674 c 422.945 178.229 423.062 177.549 423.25
 177.217 c 423.086 177.076 422.898 176.936 422.66 176.795 c 421.254 175.834
 420.453 174.893 420.172 174.424 c 419.891 173.932 419.914 173.694 420.406
 173.67 c 420.898 173.647 422.004 174.518 422.004 174.518 c 422.004 174.518
 422.992 175.362 423.906 176.584 c 424.094 176.49 424.375 176.35 424.73 
176.186 c 424.824 176.139 424.895 176.092 424.988 176.045 c 425.715 175.432
 426.609 174.026 427.266 172.873 c 427.781 171.979 427.781 170.854 427.266
 169.959 c 426.609 168.787 425.668 167.307 424.941 166.694 c 424.871 166.623
 424.777 166.576 424.707 166.553 c 424.543 166.483 424.422 166.412 424.305
 166.365 c 423.32 167.869 422.051 168.951 422.051 168.951 c 422.051 168.951
 420.945 169.819 420.453 169.795 c 419.961 169.772 419.938 169.537 420.219
 169.045 c 420.5 168.553 421.301 167.612 422.684 166.717 c 423.086 166.459
 423.391 166.201 423.625 165.967 c 423.484 165.873 423.391 165.803 423.32
 165.709 c 423.109 165.475 422.828 164.627 423.461 164.112 c 423.906 163.737
 424.422 163.83 424.707 163.924 c 424.777 163.947 424.848 163.971 424.895
 164.018 c 425.855 162.631 426.984 161.67 426.984 161.67 c 426.984 161.67
 428.09 160.799 428.582 160.822 c 429.074 160.846 429.098 161.08 428.816
 161.576 c 428.535 162.069 427.734 163.006 426.352 163.901 c 425.949 164.158
 425.668 164.416 425.434 164.627 c 425.457 164.674 425.48 164.721 425.504
 164.791 c 425.621 165.1 425.809 165.358 426.043 165.569 c 427.055 166.506
 429.566 168.717 430.953 168.717 c 430.93 168.694 m 432.293 168.694 434.945
 166.483 435.98 165.545 c 436.215 165.334 436.402 165.053 436.52 164.768
 c 436.566 164.674 436.59 164.604 436.637 164.533 c 436.426 164.322 436.145
 164.088 435.793 163.877 c 434.406 162.983 433.586 162.045 433.324 161.553
 c 433.043 161.057 433.066 160.822 433.562 160.799 c 434.055 160.776 435.156
 161.647 435.156 161.647 c 435.156 161.647 436.285 162.608 437.227 163.971
 c 437.25 163.947 437.297 163.947 437.32 163.924 c 437.602 163.83 438.117
 163.737 438.562 164.112 c 439.199 164.627 438.918 165.475 438.703 165.709
 c 438.633 165.779 438.562 165.85 438.469 165.92 c 438.703 166.178 439.012
 166.436 439.457 166.717 c 440.844 167.612 441.664 168.553 441.922 169.045
 c 442.203 169.537 442.18 169.772 441.688 169.795 c 441.195 169.819 440.09
 168.951 440.09 168.951 c 440.09 168.951 438.801 167.846 437.812 166.319
 c 437.672 166.389 437.508 166.459 437.32 166.553 c 437.227 166.6 437.156
 166.647 437.062 166.694 c 436.332 167.307 435.441 168.717 434.781 169.865
 c 434.266 170.76 434.266 171.885 434.781 172.779 c 435.441 173.955 436.379
 175.432 437.109 176.045 c 437.18 176.115 437.273 176.162 437.367 176.186
 c 437.742 176.35 438 176.467 438.188 176.584 c 439.105 175.338 440.09 174.518
 440.09 174.518 c 440.09 174.518 441.195 173.647 441.688 173.67 c 442.18
 173.694 442.203 173.932 441.922 174.424 c 441.641 174.916 440.844 175.858
 439.457 176.748 c 439.223 176.889 439.035 177.053 438.871 177.194 c 439.035
 177.549 439.152 178.205 438.633 178.651 c 438.305 178.932 437.93 178.932
 437.648 178.885 c 436.613 180.553 435.133 181.799 435.133 181.799 c 435.133
 181.799 434.031 182.666 433.539 182.643 c 433.043 182.619 433.02 182.385
 433.301 181.893 c 433.586 181.401 434.383 180.459 435.77 179.569 c 436.332
 179.19 436.707 178.838 436.969 178.533 c 436.824 178.416 436.66 178.205
 436.543 177.947 c 436.426 177.643 436.238 177.381 436.004 177.17 c 434.992
 176.233 432.41 174.026 431.023 174.026 c 437.742 178.346 m 438.164 178.44
 438.539 178.065 438.445 177.643 c 438.398 177.432 438.234 177.264 438.023
 177.217 c 437.602 177.123 437.227 177.502 437.32 177.924 c 437.367 178.135
 437.531 178.299 437.742 178.346 c h
424.305 177.287 m 423.883 177.194 423.508 177.572 423.602 177.994 c 423.648
 178.205 423.812 178.369 424.023 178.416 c 424.445 178.51 424.824 178.135
 424.73 177.713 c 424.684 177.502 424.516 177.334 424.305 177.287 c h
424.352 164.44 m 423.93 164.346 423.555 164.721 423.648 165.147 c 423.695
 165.358 423.859 165.522 424.07 165.569 c 424.492 165.662 424.871 165.287
 424.777 164.862 c 424.73 164.651 424.566 164.487 424.352 164.44 c h
437.906 164.51 m 437.484 164.416 437.109 164.791 437.203 165.217 c 437.25
 165.428 437.414 165.592 437.625 165.639 c 438.047 165.733 438.422 165.358
 438.328 164.932 c 438.281 164.721 438.117 164.557 437.906 164.51 c h
437.906 164.51 m f
0.234892 w
0 J
0 j
q 1 0 0 -1 0 595.275574 cm
431.047 421.227 m 430.977 421.227 l 429.613 421.227 427.078 419.02 426.066
 418.082 c 425.832 417.871 425.645 417.633 425.551 417.328 c 425.434 417.047
 425.27 416.859 425.129 416.719 c 425.363 416.414 425.738 416.035 426.328
 415.66 c 427.711 414.77 428.535 413.828 428.793 413.336 c 429.074 412.844
 429.051 412.609 428.559 412.586 c 428.062 412.562 426.961 413.43 426.961
 413.43 c 426.961 413.43 425.48 414.676 424.492 416.367 c 424.211 416.32
 423.812 416.32 423.484 416.602 c 422.945 417.047 423.062 417.727 423.25
 418.059 c 423.086 418.199 422.898 418.34 422.66 418.48 c 421.254 419.441
 420.453 420.383 420.172 420.852 c 419.891 421.344 419.914 421.582 420.406
 421.605 c 420.898 421.629 422.004 420.758 422.004 420.758 c 422.004 420.758
 422.992 419.914 423.906 418.691 c 424.094 418.785 424.375 418.926 424.73
 419.09 c 424.824 419.137 424.895 419.184 424.988 419.23 c 425.715 419.844
 426.609 421.25 427.266 422.402 c 427.781 423.297 427.781 424.422 427.266
 425.316 c 426.609 426.488 425.668 427.969 424.941 428.582 c 424.871 428.652
 424.777 428.699 424.707 428.723 c 424.543 428.793 424.422 428.863 424.305
 428.91 c 423.32 427.406 422.051 426.324 422.051 426.324 c 422.051 426.324
 420.945 425.457 420.453 425.48 c 419.961 425.504 419.938 425.738 420.219
 426.23 c 420.5 426.723 421.301 427.664 422.684 428.559 c 423.086 428.816
 423.391 429.074 423.625 429.309 c 423.484 429.402 423.391 429.473 423.32
 429.566 c 423.109 429.801 422.828 430.648 423.461 431.164 c 423.906 431.539
 424.422 431.445 424.707 431.352 c 424.777 431.328 424.848 431.305 424.895
 431.258 c 425.855 432.645 426.984 433.605 426.984 433.605 c 426.984 433.605
 428.09 434.477 428.582 434.453 c 429.074 434.43 429.098 434.195 428.816
 433.699 c 428.535 433.207 427.734 432.27 426.352 431.375 c 425.949 431.117
 425.668 430.859 425.434 430.648 c 425.457 430.602 425.48 430.555 425.504
 430.484 c 425.621 430.176 425.809 429.918 426.043 429.707 c 427.055 428.77
 429.566 426.559 430.953 426.559 c 430.93 426.582 m 432.293 426.582 434.945
 428.793 435.98 429.73 c 436.215 429.941 436.402 430.223 436.52 430.508 
c 436.566 430.602 436.59 430.672 436.637 430.742 c 436.426 430.953 436.145
 431.188 435.793 431.398 c 434.406 432.293 433.586 433.23 433.324 433.723
 c 433.043 434.219 433.066 434.453 433.562 434.477 c 434.055 434.5 435.156
 433.629 435.156 433.629 c 435.156 433.629 436.285 432.668 437.227 431.305
 c 437.25 431.328 437.297 431.328 437.32 431.352 c 437.602 431.445 438.117
 431.539 438.562 431.164 c 439.199 430.648 438.918 429.801 438.703 429.566
 c 438.633 429.496 438.562 429.426 438.469 429.355 c 438.703 429.098 439.012
 428.84 439.457 428.559 c 440.844 427.664 441.664 426.723 441.922 426.23
 c 442.203 425.738 442.18 425.504 441.688 425.48 c 441.195 425.457 440.09
 426.324 440.09 426.324 c 440.09 426.324 438.801 427.43 437.812 428.957 
c 437.672 428.887 437.508 428.816 437.32 428.723 c 437.227 428.676 437.156
 428.629 437.062 428.582 c 436.332 427.969 435.441 426.559 434.781 425.41
 c 434.266 424.516 434.266 423.391 434.781 422.496 c 435.441 421.32 436.379
 419.844 437.109 419.23 c 437.18 419.16 437.273 419.113 437.367 419.09 c
 437.742 418.926 438 418.809 438.188 418.691 c 439.105 419.938 440.09 420.758
 440.09 420.758 c 440.09 420.758 441.195 421.629 441.688 421.605 c 442.18
 421.582 442.203 421.344 441.922 420.852 c 441.641 420.359 440.844 419.418
 439.457 418.527 c 439.223 418.387 439.035 418.223 438.871 418.082 c 439.035
 417.727 439.152 417.07 438.633 416.625 c 438.305 416.344 437.93 416.344
 437.648 416.391 c 436.613 414.723 435.133 413.477 435.133 413.477 c 435.133
 413.477 434.031 412.609 433.539 412.633 c 433.043 412.656 433.02 412.891
 433.301 413.383 c 433.586 413.875 434.383 414.816 435.77 415.707 c 436.332
 416.086 436.707 416.438 436.969 416.742 c 436.824 416.859 436.66 417.07
 436.543 417.328 c 436.426 417.633 436.238 417.895 436.004 418.105 c 434.992
 419.043 432.41 421.25 431.023 421.25 c 437.742 416.93 m 438.164 416.836
 438.539 417.211 438.445 417.633 c 438.398 417.844 438.234 418.012 438.023
 418.059 c 437.602 418.152 437.227 417.773 437.32 417.352 c 437.367 417.141
 437.531 416.977 437.742 416.93 c h
424.305 417.988 m 423.883 418.082 423.508 417.703 423.602 417.281 c 423.648
 417.07 423.812 416.906 424.023 416.859 c 424.445 416.766 424.824 417.141
 424.73 417.562 c 424.684 417.773 424.516 417.941 424.305 417.988 c h
424.352 430.836 m 423.93 430.93 423.555 430.555 423.648 430.129 c 423.695
 429.918 423.859 429.754 424.07 429.707 c 424.492 429.613 424.871 429.988
 424.777 430.414 c 424.73 430.625 424.566 430.789 424.352 430.836 c h
437.906 430.766 m 437.484 430.859 437.109 430.484 437.203 430.059 c 437.25
 429.848 437.414 429.684 437.625 429.637 c 438.047 429.543 438.422 429.918
 438.328 430.344 c 438.281 430.555 438.117 430.719 437.906 430.766 c h
437.906 430.766 m S Q
0.952941 0.52549 0.188235 rg
3.2 w
1 J
1 j
q 1 0 0 -1 0 595.275574 cm
469.684 423.531 m 469.684 444.867 452.383 462.164 431.047 462.164 c 409.711
 462.164 392.414 444.867 392.414 423.531 c 392.414 402.191 409.711 384.895
 431.047 384.895 c 452.383 384.895 469.684 402.191 469.684 423.531 c h
469.684 423.531 m S Q
q 1 0 0 -1 0 595.275574 cm
453.348 423.531 m 453.348 435.848 443.363 445.832 431.047 445.832 c 418.73
 445.832 408.746 435.848 408.746 423.531 c 408.746 411.215 418.73 401.23
 431.047 401.23 c 443.363 401.23 453.348 411.215 453.348 423.531 c h
453.348 423.531 m S Q
0 g
8 w
0 J
0 j
q 1 0 0 -1 0 595.275574 cm
58.09 288.828 m 88.398 263.57 l S Q
q 1 0 0 -1 0 595.275574 cm
161.645 273.672 m 219.734 342.707 l S Q
q 1 0 0 -1 0 595.275574 cm
288.77 348.602 m 353.594 285.461 l S Q
q 1 0 0 -1 0 595.275574 cm
297.188 392.379 m 384.742 416.797 l S Q
q 1 0 0 -1 0 595.275574 cm
402.422 297.246 m 420.102 378.91 l S Q
560.301 352.342 m 559.648 352.783 l 559.43 352.932 559.129 352.877 558.98
 352.654 c 555.648 347.744 l 555.5 347.526 555.555 347.225 555.773 347.076
 c 556.426 346.635 l 556.648 346.487 556.945 346.541 557.094 346.764 c 560.43
 351.674 l 560.578 351.893 560.523 352.194 560.301 352.342 c h
560.301 352.342 m f
530.18 349.022 m 530.086 349.268 529.809 349.397 529.562 349.303 c 528.824
 349.026 l 528.574 348.932 528.449 348.654 528.543 348.404 c 530.633 342.85
 l 530.727 342.6 531.004 342.475 531.254 342.569 c 531.992 342.846 l 532.238
 342.94 532.367 343.217 532.273 343.463 c h
530.18 349.022 m f
552.527 358.487 m 552.402 358.819 552.035 358.987 551.703 358.862 c 550.719
 358.49 l 550.387 358.365 550.219 357.998 550.344 357.666 c 551.504 354.58
 l 544.504 351.947 l 544.105 352.346 543.555 352.592 542.945 352.592 c 541.777
 352.592 540.824 351.682 540.75 350.533 c 538.066 349.522 l 537.973 349.635
 l 537.477 350.237 536.586 350.315 535.984 349.815 c 535.602 349.494 535.43
 349.014 535.488 348.553 c 533.918 347.963 l 532.758 351.049 l 532.633 351.377
 532.266 351.545 531.934 351.42 c 530.949 351.053 l 530.617 350.928 530.449
 350.557 530.574 350.225 c 533.363 342.819 l 533.488 342.487 533.855 342.319
 534.188 342.444 c 535.172 342.815 l 535.504 342.94 535.672 343.307 535.547
 343.639 c 534.387 346.725 l 536.164 347.393 l 537.758 345.487 l 539.914
 344.955 l 539.914 340.244 l 539.914 340.115 539.324 327.971 539.324 327.971
 c 539.266 327.178 539.867 326.49 540.66 326.432 c 541.457 326.377 542.145
 326.975 542.199 327.772 c 542.688 337.229 l 542.777 337.221 543.156 337.217
 543.258 337.233 c 543.906 327.772 l 543.961 326.975 544.648 326.381 545.445
 326.432 c 546.234 326.49 546.84 327.178 546.781 327.971 c 546.781 327.971
 545.977 340.139 545.977 340.248 c 545.977 345.194 l 548.816 348.596 l 549.812
 349.783 l 550.312 350.381 550.23 351.272 549.633 351.772 c 549.352 352.006
 549.004 352.112 548.668 352.1 c 551.973 353.342 l 553.133 350.256 l 553.258
 349.924 553.625 349.76 553.957 349.885 c 554.941 350.252 l 555.273 350.377
 555.441 350.748 555.316 351.08 c h
547.641 351.596 m 547.641 351.596 544.688 348.088 544.68 348.092 c 544.188
 347.658 543.543 347.393 542.84 347.393 c 542.176 347.393 541.574 347.623
 541.094 348.01 c 539.316 347.987 l 538.949 348.44 l 541.07 349.24 l 541.457
 348.608 542.148 348.186 542.945 348.186 c 544.164 348.186 545.148 349.174
 545.148 350.389 c 545.148 350.514 545.133 350.639 545.113 350.76 c 547.836
 351.787 l 547.766 351.729 547.699 351.666 547.641 351.596 c h
547.641 351.596 m f
528.512 303.596 m 528.512 271.237 l 560.512 271.237 l 560.512 303.596 l
 h
544.156 287.166 m 544.156 275.451 l 532.441 275.451 l 532.441 287.166 l
 h
558.797 272.951 m 548.012 272.951 l 548.012 289.01 l 551.676 292.67 l 551.672
 287.444 l 555.047 290.819 l 555.047 298.776 l 547.094 298.776 l 543.719
 295.401 l 548.949 295.401 l 544.57 291.022 l 530.227 291.022 l 530.227 
301.881 l 558.797 301.881 l h
558.797 272.951 m f
560.395 402.33 m 561.039 407.194 559.066 413.018 553.238 415.635 c 548.633
 417.701 540.5 417.697 536.211 413.787 c 532.473 410.377 531.629 405.537
 531.629 405.537 c 531.629 405.537 531.242 403.74 531.242 403.143 c 531.242
 402.572 531.887 402.346 531.812 402.053 c 531.738 401.76 531.02 400.92 
530.469 400.002 c 529.918 399.088 528.512 397.049 528.512 396.498 c 528.512
 395.947 528.84 395.744 529.5 395.526 c 530.16 395.307 530.676 395.123 530.785
 394.865 c 530.895 394.608 530.473 393.877 530.449 393.354 c 530.43 392.908
 530.594 392.858 530.926 392.729 c 531.34 392.565 531.977 392.545 531.977
 392.545 c 531.977 392.545 530.559 392.279 530.699 391.697 c 530.848 391.096
 531.699 390.975 531.777 390.502 c 531.812 390.264 531.055 389.045 531.152
 387.858 c 531.285 386.311 532.75 385.619 535.078 385.99 c 537.293 386.346
 538.336 386.678 538.621 385.455 c 538.801 384.686 538.781 383.389 539.109
 381.92 c 539.125 381.862 539.137 381.799 539.152 381.737 c 556.16 381.737
 l 555.434 383.065 554.477 385.19 554.477 387.897 c 554.477 389.756 554.66
 392.514 555.992 393.979 c 557.664 395.819 559.879 398.424 560.395 402.33
 c h
553.375 398.475 m 553.375 398.475 553.152 396.041 551.367 395.729 c 549.836
 395.463 548.82 396.936 548.82 396.936 c 548.32 394.561 l 547.25 394.561
 l 547.25 394.561 546.277 398.139 545.609 398.744 c 544.938 399.346 543.898
 399.514 543.898 399.514 c 543.898 399.514 542.496 399.615 541.59 400.518
 c 540.688 401.42 541.523 402.526 541.523 402.526 c 541.523 402.526 540.387
 402.459 538.074 402.963 c 535.766 403.463 536.469 404.936 536.469 404.936
 c 536.469 404.936 535.867 404.838 535.363 405.471 c 535.008 405.924 534.746
 407.029 535.398 408.319 c 535.98 409.471 537.004 409.873 537.004 409.873
 c 537.004 409.873 536.625 410.354 537.422 411.026 c 537.84 411.373 538.578
 411.365 538.578 411.365 c 538.578 411.365 538.758 412.139 539.867 412.639
 c 541.121 413.205 541.957 412.737 541.957 412.737 c 541.957 412.737 542.293
 413.471 543.266 413.807 c 544.234 414.143 545.207 413.572 545.207 413.572
 c 545.207 413.572 545.863 414.166 547.066 414.166 c 548.273 414.166 548.723
 413.541 548.723 413.541 c 548.723 413.541 549.445 413.912 550.328 413.608
 c 551.16 413.319 551.402 412.51 551.402 412.51 c 551.402 412.51 552.004
 412.94 552.84 412.604 c 553.676 412.268 554.012 411.365 554.012 411.365
 c 554.012 411.365 554.586 411.447 555.16 410.94 c 555.586 410.561 555.449
 409.858 555.449 409.858 c 555.449 409.858 556.16 409.623 556.586 408.772
 c 556.98 407.983 556.422 407.315 556.422 407.315 c 556.422 407.315 557.594
 406.444 557.762 404.166 c 557.965 401.389 556.188 400.854 556.188 400.854
 c 556.188 400.854 556.539 399.971 555.918 399.01 c 555.074 397.705 553.375
 398.475 553.375 398.475 c h
553.375 398.475 m f
560.512 217.197 m 555.598 217.197 l 556.5 218.1 l 557.57 217.959 558.676
 217.889 559.82 217.889 c 559.82 219.276 l 554.105 219.276 549.414 221.115
 545.871 224.74 c 541.137 229.588 539.371 236.697 538.711 241.572 c 538.812
 241.67 l 538.68 241.803 l 538.285 244.834 538.32 246.947 538.32 246.998
 c 536.934 247.033 l 536.93 246.819 536.895 244.858 537.227 242.049 c 536.238
 241.061 l 536.238 248.404 l 534.852 248.404 l 534.852 217.197 l 528.512
 217.197 l 528.512 215.811 l 534.852 215.811 l 534.852 210.162 l 536.238
 210.162 l 536.238 215.811 l 560.512 215.811 l h
553.637 217.197 m 551.438 217.197 l 553.07 218.83 l 553.641 218.658 554.227
 218.51 554.828 218.385 c h
550.312 219.885 m 550.734 219.686 551.164 219.494 551.605 219.326 c 549.621
 217.338 l 549.762 217.197 l 547.625 217.197 l h
545.66 217.197 m 543.461 217.197 l 547.676 221.408 l 548.113 221.108 548.562
 220.822 549.023 220.557 c h
546.555 222.252 m 541.645 217.342 l 541.789 217.197 l 539.301 217.197 l
 545.387 223.279 l 545.766 222.92 546.152 222.576 546.555 222.252 c h
539.688 232.026 m 536.242 228.58 l 536.242 231.065 l 536.383 230.924 l 
539.09 233.631 l 539.273 233.096 539.473 232.561 539.688 232.026 c h
536.242 232.74 m 536.242 234.94 l 538.156 236.854 l 538.293 236.287 538.449
 235.705 538.621 235.119 c h
536.242 226.904 m 536.383 226.76 l 540.273 230.651 l 540.5 230.158 540.742
 229.666 541 229.178 c 536.242 224.42 l h
536.242 222.459 m 541.707 227.924 l 541.98 227.471 542.27 227.026 542.57
 226.588 c 536.242 220.256 l h
537.465 240.322 m 537.559 239.725 537.668 239.104 537.797 238.459 c 536.242
 236.901 l 536.242 239.1 l h
536.242 218.295 m 543.402 225.459 l 543.723 225.053 544.062 224.658 544.418
 224.272 c 537.34 217.197 l 536.242 217.197 l h
536.242 218.295 m f
545.949 228.354 m 546.145 228.451 546.344 228.6 546.547 228.799 c 546.75
 229.002 546.945 229.264 547.125 229.588 c 547.305 229.912 547.434 230.322
 547.508 230.811 c 548.176 235.033 l 549.328 235.033 l 549.434 235.213 549.469
 235.393 549.434 235.572 c 548.281 235.572 l 548.383 236.092 l 548.461 236.455
 548.539 236.74 548.625 236.947 c 548.707 237.154 548.793 237.315 548.887
 237.432 c 548.98 237.545 549.082 237.623 549.184 237.666 c 549.289 237.705
 549.402 237.744 549.527 237.779 c 550.32 237.135 l 550.457 237.252 550.555
 237.393 550.617 237.557 c 550.676 237.717 550.711 237.877 550.723 238.029
 c 550.613 238.084 550.477 238.127 550.312 238.154 c 550.152 238.182 550.008
 238.194 549.891 238.194 c 549.609 238.194 549.34 238.166 549.09 238.1 c
 548.84 238.037 548.613 237.928 548.406 237.764 c 548.195 237.6 548.016 
237.377 547.859 237.096 c 547.703 236.819 547.578 236.463 547.488 236.033
 c 547.418 235.666 l 547.277 235.631 547.129 235.584 546.977 235.522 c 546.82
 235.463 546.672 235.393 546.531 235.311 c 546.531 235.033 l 547.293 235.033
 l 546.617 230.615 l 546.562 230.268 546.484 229.967 546.383 229.705 c 546.281
 229.447 546.172 229.229 546.059 229.049 c 545.945 228.869 545.828 228.725
 545.711 228.619 c 545.594 228.51 545.492 228.436 545.41 228.397 c 545.504
 228.166 l 545.605 228.194 545.754 228.256 545.949 228.354 c h
545.949 228.354 m f
549.672 231.588 m 549.672 230.951 549.801 230.354 550.055 229.795 c 550.305
 229.237 550.73 228.701 551.328 228.19 c 551.629 228.397 l 551.219 228.897
 550.938 229.416 550.785 229.963 c 550.633 230.506 550.562 231.092 550.57
 231.713 c 550.562 232.365 550.648 232.979 550.832 233.557 c 551.02 234.131
 551.254 234.658 551.547 235.143 c 551.836 235.623 552.16 236.061 552.512
 236.459 c 552.867 236.854 553.215 237.197 553.555 237.487 c 553.375 237.674
 l 552.961 237.412 552.535 237.092 552.098 236.713 c 551.66 236.334 551.262
 235.897 550.906 235.397 c 550.547 234.897 550.254 234.334 550.023 233.701
 c 549.789 233.072 549.672 232.365 549.672 231.588 c h
549.672 231.588 m f
553.199 235.252 m 553.199 234.99 l 553.867 234.908 l 554.574 232.994 l 
554.461 232.897 554.293 232.748 554.074 232.553 c 553.852 232.354 553.621
 232.135 553.387 231.893 c 553.152 231.647 552.934 231.401 552.742 231.143
 c 552.547 230.885 552.418 230.654 552.355 230.447 c 552.508 230.354 552.699
 230.311 552.93 230.311 c 553.039 230.311 553.156 230.322 553.277 230.342
 c 553.398 230.362 553.516 230.397 553.637 230.447 c 553.629 230.487 553.625
 230.553 553.625 230.639 c 553.625 230.725 553.629 230.819 553.629 230.92
 c 553.633 231.022 553.637 231.115 553.641 231.205 c 553.645 231.295 553.652
 231.365 553.668 231.412 c 553.715 231.502 553.781 231.6 553.863 231.705
 c 553.949 231.811 554.039 231.912 554.137 232.018 c 554.234 232.119 554.332
 232.221 554.434 232.319 c 554.531 232.416 554.621 232.506 554.695 232.588
 c 555.27 230.705 l 555.305 230.596 555.359 230.502 555.438 230.424 c 555.516
 230.35 555.629 230.311 555.777 230.311 c 555.867 230.311 555.965 230.322
 556.074 230.35 c 556.184 230.381 556.285 230.412 556.383 230.455 c 556.477
 230.498 556.562 230.541 556.645 230.58 c 556.727 230.623 556.789 230.658
 556.828 230.686 c 556.828 230.947 l 556.152 231.029 l 555.406 233.057 l
 555.473 233.119 555.57 233.205 555.691 233.311 c 555.812 233.42 555.941
 233.541 556.082 233.678 c 556.219 233.811 556.363 233.959 556.512 234.112
 c 556.66 234.268 556.801 234.428 556.934 234.588 c 557.066 234.744 557.18
 234.904 557.277 235.065 c 557.375 235.225 557.441 235.373 557.484 235.514
 c 557.316 235.604 557.125 235.647 556.902 235.647 c 556.781 235.647 556.668
 235.635 556.551 235.612 c 556.438 235.588 556.32 235.553 556.203 235.514
 c 556.211 235.471 556.219 235.408 556.223 235.319 c 556.23 235.233 556.238
 235.139 556.242 235.037 c 556.25 234.94 556.254 234.842 556.254 234.752
 c 556.254 234.662 556.25 234.592 556.242 234.545 c 556.148 234.365 556.004
 234.174 555.812 233.975 c 555.621 233.772 555.445 233.592 555.289 233.432
 c 554.777 235.24 l 554.734 235.346 554.68 235.44 554.609 235.518 c 554.539
 235.596 554.426 235.639 554.273 235.639 c 554.176 235.639 554.074 235.623
 553.969 235.596 c 553.863 235.569 553.758 235.533 553.656 235.49 c 553.555
 235.451 553.465 235.408 553.383 235.362 c 553.305 235.315 553.242 235.279
 553.199 235.252 c h
553.199 235.252 m f
559.27 235.908 m 559.348 235.658 559.406 235.404 559.438 235.147 c 559.469
 234.893 559.484 234.615 559.484 234.315 c 559.484 233.623 559.383 232.971
 559.188 232.362 c 558.988 231.748 558.742 231.194 558.449 230.69 c 558.152
 230.19 557.832 229.744 557.48 229.354 c 557.129 228.967 556.801 228.647
 556.496 228.397 c 556.707 228.19 l 557.148 228.447 557.586 228.772 558.02
 229.162 c 558.453 229.553 558.844 230.002 559.191 230.51 c 559.539 231.014
 559.82 231.58 560.035 232.197 c 560.25 232.819 560.355 233.49 560.355 234.213
 c 560.355 234.862 560.227 235.467 559.969 236.026 c 559.707 236.584 559.277
 237.135 558.684 237.674 c 558.41 237.487 l 558.625 237.197 558.805 236.924
 558.941 236.666 c 559.082 236.408 559.191 236.158 559.27 235.908 c h
559.27 235.908 m f
0.265186 w
10 M q 1 0 0 -1 0 595.275574 cm
544.488 407.949 m 544.488 439.758 l S Q
q 1 0 0 -1 0 595.275574 cm
528.617 423.852 m 560.359 423.852 l 560.359 423.852 558.594 436 556.465
 436.02 c 554.336 436.039 552.43 423.852 552.43 423.852 c 552.43 423.852
 550.523 418.414 548.395 418.434 c 546.266 418.453 544.5 423.852 544.5 423.852
 c 544.5 423.852 542.738 436 540.609 436.02 c 538.48 436.039 536.574 423.852
 536.574 423.852 c 536.574 423.852 534.668 411.664 532.539 411.688 c 530.406
 411.707 528.645 423.852 528.645 423.852 c h
528.617 423.852 m S Q
559.246 125.717 m 559.945 125.717 560.512 126.283 560.512 126.983 c 560.512
 127.682 559.945 128.248 559.246 128.248 c 558.648 128.248 558.148 127.83
 558.016 127.272 c 551.773 126.006 l 551.473 126.596 550.906 127.029 550.234
 127.151 c 550.137 129.904 l 550.652 130.123 551.016 130.635 551.016 131.237
 c 551.016 132.033 550.367 132.682 549.566 132.682 c 548.77 132.682 548.121
 132.033 548.121 131.237 c 548.121 130.549 548.594 129.983 549.234 129.83
 c 549.328 127.123 l 548.793 126.99 548.336 126.658 548.043 126.209 c 542.922
 129.303 l 542.945 129.401 542.965 129.502 542.965 129.608 c 542.965 130.307
 542.398 130.873 541.695 130.873 c 541 130.873 540.43 130.307 540.43 129.608
 c 540.43 128.908 540.996 128.342 541.695 128.342 c 541.961 128.342 542.207
 128.42 542.41 128.561 c 547.715 125.35 l 547.699 125.244 547.688 125.139
 547.688 125.029 c 547.688 124.713 547.758 124.416 547.879 124.143 c 539.816
 116.1 l 539.445 116.404 538.973 116.588 538.453 116.588 c 538.012 116.588
 537.602 116.455 537.262 116.229 c 533.438 120.057 l 533.637 120.342 533.758
 120.69 533.758 121.069 c 533.758 122.041 532.969 122.83 531.996 122.83 
c 531.02 122.83 530.23 122.041 530.23 121.069 c 530.23 120.092 531.02 119.303
 531.996 119.303 c 532.262 119.303 532.512 119.369 532.738 119.475 c 536.629
 115.584 l 536.418 115.248 536.293 114.854 536.293 114.428 c 536.293 114.268
 536.312 114.108 536.348 113.955 c 530.832 112.104 l 530.605 112.444 530.219
 112.67 529.777 112.67 c 529.078 112.67 528.512 112.104 528.512 111.404 
c 528.512 110.705 529.078 110.139 529.777 110.139 c 530.414 110.139 530.934
 110.604 531.027 111.213 c 536.73 113.131 l 537.059 112.697 537.543 112.393
 538.102 112.303 c 538.102 109.061 l 537.453 108.916 536.969 108.342 536.969
 107.651 c 536.969 106.85 537.617 106.201 538.418 106.201 c 539.219 106.201
 539.867 106.85 539.867 107.651 c 539.867 108.24 539.512 108.744 539.008
 108.971 c 539.008 112.346 l 539.629 112.51 540.141 112.947 540.41 113.518
 c 547.707 112.049 l 547.695 111.975 547.68 111.897 547.68 111.819 c 547.68
 110.889 548.434 110.139 549.363 110.139 c 549.484 110.139 549.602 110.151
 549.719 110.178 c 550.91 107.229 l 550.566 106.955 550.344 106.537 550.344
 106.065 c 550.344 105.822 550.406 105.596 550.508 105.393 c 548.086 102.854
 l 548.078 102.858 548.066 102.865 548.055 102.869 c 547.398 103.104 546.672
 102.764 546.434 102.104 c 546.199 101.447 546.539 100.721 547.199 100.487
 c 547.855 100.248 548.582 100.592 548.82 101.248 c 548.941 101.588 548.906
 101.944 548.758 102.244 c 551.145 104.748 l 551.352 104.639 551.586 104.572
 551.836 104.572 c 552.227 104.572 552.578 104.725 552.848 104.975 c 557.336
 101.955 l 557.293 101.826 557.262 101.686 557.262 101.541 c 557.262 100.842
 557.828 100.276 558.527 100.276 c 559.227 100.276 559.793 100.842 559.793
 101.541 c 559.793 102.24 559.227 102.807 558.527 102.807 c 558.309 102.807
 558.105 102.748 557.926 102.647 c 553.293 105.76 l 553.316 105.858 553.328
 105.959 553.328 106.065 c 553.328 106.889 552.66 107.557 551.832 107.557
 c 551.809 107.557 551.785 107.549 551.758 107.549 c 550.527 110.612 l 550.844
 110.916 551.043 111.346 551.043 111.819 c 551.043 112.748 550.289 113.498
 549.363 113.498 c 548.84 113.498 548.379 113.256 548.07 112.881 c 540.609
 114.408 l 540.609 114.416 540.609 114.42 540.609 114.428 c 540.609 114.776
 540.527 115.104 540.383 115.393 c 548.418 123.416 l 548.797 123.08 549.297
 122.873 549.848 122.873 c 550.293 122.873 550.703 123.006 551.047 123.237
 c 555.211 119.069 l 555.133 118.889 555.082 118.69 555.082 118.479 c 555.082
 117.682 555.73 117.033 556.531 117.033 c 557.332 117.033 557.977 117.682
 557.977 118.479 c 557.977 119.279 557.332 119.928 556.531 119.928 c 556.273
 119.928 556.035 119.854 555.824 119.737 c 551.676 123.885 l 551.883 124.217
 552.008 124.608 552.008 125.029 c 552.008 125.065 552.004 125.096 552 125.131
 c 558.141 126.373 l 558.359 125.983 558.77 125.717 559.246 125.717 c h
559.246 125.717 m f
1 g
546.16 119.772 m 546.16 118.319 545.129 117.139 543.855 117.139 c 542.582
 117.139 541.547 118.319 541.547 119.772 c 541.547 121.229 542.582 122.408
 543.855 122.408 c 545.129 122.408 546.16 121.229 546.16 119.772 c h
546.16 119.772 m f
546.488 113.186 m 546.488 111.729 545.457 110.549 544.184 110.549 c 542.91
 110.549 541.879 111.729 541.879 113.186 c 541.879 114.639 542.91 115.819
 544.184 115.819 c 545.457 115.819 546.488 114.639 546.488 113.186 c h
546.488 113.186 m f
Q Q
showpage
%%Trailer
end restore
%%EOF
