%!PS-Adobe-3.0 EPSF-3.0
%%Creator: cairo 1.14.2 (http://cairographics.org)
%%CreationDate: Tue May  5 10:51:40 2015
%%Pages: 1
%%DocumentData: Clean7Bit
%%LanguageLevel: 2
%%BoundingBox: 0 -1 490 321
%%EndComments
%%BeginProlog
save
50 dict begin
/q { gsave } bind def
/Q { grestore } bind def
/cm { 6 array astore concat } bind def
/w { setlinewidth } bind def
/J { setlinecap } bind def
/j { setlinejoin } bind def
/M { setmiterlimit } bind def
/d { setdash } bind def
/m { moveto } bind def
/l { lineto } bind def
/c { curveto } bind def
/h { closepath } bind def
/re { exch dup neg 3 1 roll 5 3 roll moveto 0 rlineto
      0 exch rlineto 0 rlineto closepath } bind def
/S { stroke } bind def
/f { fill } bind def
/f* { eofill } bind def
/n { newpath } bind def
/W { clip } bind def
/W* { eoclip } bind def
/BT { } bind def
/ET { } bind def
/pdfmark where { pop globaldict /?pdfmark /exec load put }
    { globaldict begin /?pdfmark /pop load def /pdfmark
    /cleartomark load def end } ifelse
/BDC { mark 3 1 roll /BDC pdfmark } bind def
/EMC { mark /EMC pdfmark } bind def
/cairo_store_point { /cairo_point_y exch def /cairo_point_x exch def } def
/Tj { show currentpoint cairo_store_point } bind def
/TJ {
  {
    dup
    type /stringtype eq
    { show } { -0.001 mul 0 cairo_font_matrix dtransform rmoveto } ifelse
  } forall
  currentpoint cairo_store_point
} bind def
/cairo_selectfont { cairo_font_matrix aload pop pop pop 0 0 6 array astore
    cairo_font exch selectfont cairo_point_x cairo_point_y moveto } bind def
/Tf { pop /cairo_font exch def /cairo_font_matrix where
      { pop cairo_selectfont } if } bind def
/Td { matrix translate cairo_font_matrix matrix concatmatrix dup
      /cairo_font_matrix exch def dup 4 get exch 5 get cairo_store_point
      /cairo_font where { pop cairo_selectfont } if } bind def
/Tm { 2 copy 8 2 roll 6 array astore /cairo_font_matrix exch def
      cairo_store_point /cairo_font where { pop cairo_selectfont } if } bind def
/g { setgray } bind def
/rg { setrgbcolor } bind def
/d1 { setcachedevice } bind def
%%EndProlog
%%BeginSetup
%%EndSetup
%%Page: 1 1
%%BeginPageSetup
%%PageBoundingBox: 0 -1 490 321
%%EndPageSetup
q 0 -1 490 322 rectclip q
0.784314 g
275.215 277.927 m 170.527 277.927 l 170.527 272.76 l 170.527 248.65 170.418
 224.533 170.617 200.42 c 170.637 196.135 169.355 194.658 165.086 194.927
 c 159.918 195.26 154.734 195.099 149.562 194.99 c 146.719 194.927 145.711
 196.025 145.723 198.912 c 145.762 214.49 145.715 230.068 145.715 245.646
 c 126.98 245.646 l 126.98 176.517 l 189.297 176.517 l 189.297 181.959 l
 189.297 206.084 189.371 230.205 189.207 254.33 c 189.176 258.213 190.258
 259.373 194.188 259.338 c 213.133 259.142 232.07 259.252 251.016 259.236
 c 252.574 259.232 254.121 259.029 256.223 258.885 c 256.223 86.908 l 275.105
 86.908 l 275.105 130.345 l 297.449 130.345 l 297.449 150.545 l 275.215 
150.545 l h
275.215 277.927 m f
465.324 234.646 m 440.32 234.81 415.309 234.732 390.305 234.732 c 385.109
 234.732 l 385.109 216.052 l 489.02 216.052 l 489.02 320.521 l 41.535 320.521
 l 41.535 206.385 l 80.492 206.385 l 80.492 92.306 l 98.238 92.306 l 98.238
 269.498 l 80.117 269.498 l 80.117 224.888 l 74.297 224.888 69.125 225.084
 63.977 224.818 c 60.457 224.638 59.438 225.795 59.461 229.314 c 59.609 
251.806 59.621 274.299 59.461 296.795 c 59.438 300.498 60.559 301.584 64.227
 301.556 c 83.012 301.396 101.805 301.482 120.602 301.478 c 126.949 301.478
 126.969 301.47 126.969 295.26 c 126.969 273.17 l 145.699 273.17 l 145.688
 281.256 145.723 289.342 145.699 297.427 c 145.699 300.517 146.723 301.529
 149.797 301.521 c 197.73 301.443 245.66 301.47 293.598 301.443 c 294.59
 301.443 295.574 301.185 297.039 300.982 c 297.039 175.674 l 316.062 175.674
 l 316.062 258.861 l 340.219 258.861 l 340.219 150.533 l 321.312 150.533
 l 321.312 130.334 l 359.828 130.334 l 359.828 173.763 l 372.598 173.763
 l 388.875 173.76 405.156 173.814 421.434 173.67 c 422.801 173.658 425.328
 172.431 425.348 171.693 c 425.652 164.377 425.531 157.033 425.531 149.287
 c 401.035 149.287 l 401.035 129.705 l 444.062 129.705 l 444.062 193.138
 l 359.945 193.138 l 359.945 259.263 l 428.242 259.263 l 428.242 278.236
 l 420.902 278.236 l 382.129 278.236 359.891 278.263 321.113 278.185 c 317.852
 278.181 315.742 278.447 316.066 282.623 c 316.422 287.181 316.422 291.814
 316.066 296.377 c 315.73 300.568 317.297 301.564 321.305 301.556 c 369.398
 301.435 417.484 301.435 465.586 301.556 c 469.438 301.564 470.719 300.517
 470.688 296.588 c 470.527 277.646 470.504 258.709 470.695 239.767 c 470.754
 235.592 469.285 234.623 465.324 234.646 c h
465.324 234.646 m f
146.598 127.404 m 146.59 131.236 148.051 132.013 151.555 131.998 c 176.863
 131.869 202.168 131.92 227.473 131.92 c 232.832 131.92 l 232.832 219.502
 l 213.832 219.502 l 213.832 150.842 l 128.605 150.842 l 128.605 92.299 
l 146.625 92.299 l 146.621 104.006 146.641 115.701 146.594 127.4 c h
146.598 127.404 m f
300.488 106.728 m 300.488 43.572 l 347.043 43.572 l 347.043 62.451 l 318.496
 62.451 l 318.496 69.857 318.691 76.795 318.418 83.697 c 318.293 87.361 
319.422 88.506 323.141 88.478 c 331.281 88.4 339.418 88.494 347.566 88.478
 c 347.566 106.724 l 331.879 106.728 316.176 106.728 300.488 106.728 c h
300.488 106.728 m f
470.473 190.916 m 470.473 19.029 l 403.859 19.029 l 403.633 19.806 403.344
 20.369 403.344 20.935 c 403.297 42.396 403.289 63.849 403.23 85.31 c 403.23
 87.943 404.633 88.467 406.902 88.427 c 412.68 88.342 418.457 88.217 424.227
 88.474 c 427.758 88.627 428.852 87.4 428.789 83.908 c 428.617 72.967 428.719
 73.021 428.742 62.076 c 428.742 60.369 428.902 58.666 428.98 57.084 c 447.074
 57.084 l 447.074 106.736 l 375.098 106.736 l 375.098 88.49 l 376.719 88.498
 378.344 88.474 379.965 88.49 c 383.98 88.533 385.336 87.459 385.301 83.306
 c 385.098 63.474 385.098 43.65 385.301 23.818 c 385.348 19.588 383.891 
18.705 379.953 18.717 c 346.957 18.861 313.957 18.802 280.945 18.814 c 279.375
 18.814 277.805 18.943 275.727 19.037 c 275.727 63.963 l 189.586 63.963 
l 189.586 71.193 189.758 77.955 189.512 84.717 c 189.395 88.209 190.5 89.338
 194.004 89.275 c 205.387 89.095 205.777 89.201 217.168 89.224 c 218.73 
89.232 220.289 89.4 221.891 89.506 c 221.891 107.072 l 170.785 107.072 l
 170.785 44.705 l 255.652 44.705 l 255.652 19.017 l 147.051 19.017 l 146.91
 20.486 146.688 21.775 146.688 23.076 c 146.68 36.974 146.648 50.877 146.648
 64.775 c 128.605 64.775 l 128.605 28.611 l 128.605 18.806 128.605 18.806
 118.84 18.806 c 100 18.806 l 100 64.838 l 81.578 64.838 l 81.578 19.017
 l 59.656 19.017 l 59.656 175.728 l 41.172 175.728 l 41.172 0.002 l 489.391
 0.002 l 489.391 190.927 l 483.051 190.92 477.055 190.92 470.473 190.92 
c h
470.473 190.916 m f
0 g
23.555 184.455 m 17.43 184.455 l 16.902 184.455 16.441 183.994 16.441 183.467
 c 16.441 182.939 16.902 182.478 17.43 182.478 c 23.555 182.478 l 24.082
 182.478 24.543 182.939 24.543 183.467 c 24.543 183.994 24.145 184.455 23.555
 184.455 c h
23.555 184.455 m f
40.277 181.228 m 35.207 189.193 l 35.207 192.357 35.273 205.26 35.273 205.26
 c 35.273 207.435 33.496 209.213 31.324 209.213 c 9.793 209.213 l 7.621 
209.213 5.84 207.435 5.84 205.26 c 5.84 205.26 5.906 192.357 5.906 189.193
 c 0.773 181.228 l -0.02 180.306 -0.215 178.99 0.246 177.802 c 0.773 176.552
 1.957 175.763 3.273 175.763 c 37.777 175.763 l 39.094 175.763 40.277 176.552
 40.805 177.802 c 41.266 178.99 41.066 180.306 40.277 181.228 c h
31.324 205.26 m 31.324 205.26 31.258 193.408 31.258 189.654 c 9.793 189.654
 l 9.793 193.408 9.727 205.26 9.727 205.26 c h
4.523 179.779 m 9.266 187.22 l 9.332 187.287 l 9.594 187.748 l 31.586 187.748
 l 31.852 187.287 l 31.852 187.287 31.852 187.22 31.914 187.22 c 36.656 
179.779 l h
4.523 179.779 m f
0.952941 0.52549 0.188235 rg
3.2 w
1 J
1 j
[] 0.0 d
4 M q 1 0 0 -1 0 320.52124 cm
144.523 62.574 m 144.523 79.438 130.852 93.109 113.984 93.109 c 97.121 
93.109 83.449 79.438 83.449 62.574 c 83.449 45.707 97.121 32.035 113.984
 32.035 c 130.852 32.035 144.523 45.707 144.523 62.574 c h
144.523 62.574 m S Q
0.980392 0.411765 0 rg
113.984 260.252 m 113.914 260.252 l 112.555 260.252 110.016 262.459 109.008
 263.396 c 108.773 263.611 108.582 263.845 108.488 264.15 c 108.371 264.431
 108.207 264.619 108.066 264.76 c 108.301 265.064 108.676 265.443 109.266
 265.818 c 110.652 266.709 111.473 267.65 111.73 268.142 c 112.012 268.635
 111.988 268.869 111.496 268.892 c 111.004 268.92 109.898 268.049 109.898
 268.049 c 109.898 268.049 108.418 266.802 107.434 265.111 c 107.152 265.158
 106.75 265.158 106.422 264.877 c 105.883 264.431 106 263.752 106.188 263.42
 c 106.023 263.279 105.836 263.138 105.602 262.998 c 104.191 262.037 103.391
 261.095 103.109 260.627 c 102.828 260.135 102.852 259.896 103.344 259.873
 c 103.84 259.849 104.941 260.72 104.941 260.72 c 104.941 260.72 105.93 
261.564 106.844 262.787 c 107.035 262.693 107.316 262.552 107.668 262.388
 c 107.762 262.342 107.832 262.295 107.926 262.248 c 108.652 261.635 109.547
 260.228 110.203 259.076 c 110.723 258.181 110.723 257.056 110.203 256.162
 c 109.547 254.99 108.605 253.51 107.879 252.896 c 107.809 252.826 107.715
 252.779 107.645 252.756 c 107.48 252.685 107.363 252.615 107.246 252.568
 c 106.258 254.072 104.988 255.154 104.988 255.154 c 104.988 255.154 103.887
 256.021 103.391 255.998 c 102.898 255.974 102.875 255.74 103.156 255.248
 c 103.441 254.756 104.238 253.814 105.625 252.92 c 106.023 252.662 106.328
 252.404 106.562 252.17 c 106.422 252.076 106.328 252.006 106.258 251.912
 c 106.047 251.677 105.766 250.83 106.398 250.314 c 106.844 249.939 107.363
 250.033 107.645 250.127 c 107.715 250.15 107.785 250.174 107.832 250.22
 c 108.797 248.834 109.922 247.873 109.922 247.873 c 109.922 247.873 111.027
 247.002 111.52 247.025 c 112.012 247.049 112.035 247.283 111.754 247.779
 c 111.473 248.271 110.676 249.209 109.289 250.103 c 108.891 250.361 108.605
 250.619 108.371 250.83 c 108.395 250.877 108.418 250.924 108.441 250.994
 c 108.559 251.302 108.75 251.56 108.984 251.771 c 109.992 252.709 112.508
 254.92 113.891 254.92 c 113.867 254.896 m 115.23 254.896 117.887 252.685
 118.918 251.748 c 119.152 251.537 119.34 251.256 119.461 250.97 c 119.508
 250.877 119.531 250.806 119.578 250.736 c 119.363 250.525 119.082 250.291
 118.73 250.08 c 117.344 249.185 116.523 248.248 116.266 247.756 c 115.984
 247.26 116.008 247.025 116.5 247.002 c 116.992 246.978 118.098 247.849 
118.098 247.849 c 118.098 247.849 119.223 248.81 120.164 250.174 c 120.188
 250.15 120.234 250.15 120.258 250.127 c 120.539 250.033 121.055 249.939
 121.504 250.314 c 122.137 250.83 121.855 251.677 121.645 251.912 c 121.574
 251.982 121.504 252.052 121.41 252.123 c 121.645 252.381 121.949 252.638
 122.395 252.92 c 123.781 253.814 124.602 254.756 124.863 255.248 c 125.145
 255.74 125.121 255.974 124.625 255.998 c 124.133 256.021 123.031 255.154
 123.031 255.154 c 123.031 255.154 121.738 254.049 120.75 252.521 c 120.609
 252.592 120.445 252.662 120.258 252.756 c 120.164 252.802 120.094 252.849
 120 252.896 c 119.27 253.51 118.379 254.92 117.723 256.068 c 117.203 256.963
 117.203 258.088 117.723 258.982 c 118.379 260.158 119.316 261.635 120.047
 262.248 c 120.117 262.318 120.211 262.365 120.305 262.388 c 120.68 262.552
 120.938 262.67 121.125 262.787 c 122.043 261.541 123.031 260.72 123.031
 260.72 c 123.031 260.72 124.133 259.849 124.625 259.873 c 125.121 259.896
 125.145 260.135 124.863 260.627 c 124.578 261.119 123.781 262.06 122.395
 262.951 c 122.16 263.092 121.973 263.256 121.809 263.396 c 121.973 263.752
 122.09 264.408 121.574 264.853 c 121.246 265.135 120.867 265.135 120.586
 265.088 c 119.555 266.756 118.074 268.002 118.074 268.002 c 118.074 268.002
 116.969 268.869 116.477 268.845 c 115.984 268.822 115.961 268.588 116.242
 268.095 c 116.523 267.603 117.32 266.662 118.707 265.771 c 119.27 265.396
 119.648 265.041 119.906 264.736 c 119.766 264.619 119.602 264.408 119.484
 264.15 c 119.363 263.845 119.176 263.584 118.941 263.373 c 117.934 262.435
 115.348 260.228 113.961 260.228 c 120.68 264.549 m 121.102 264.642 121.48
 264.267 121.387 263.845 c 121.34 263.635 121.172 263.467 120.961 263.42
 c 120.539 263.326 120.164 263.705 120.258 264.127 c 120.305 264.338 120.469
 264.502 120.68 264.549 c h
107.246 263.49 m 106.82 263.396 106.445 263.775 106.539 264.197 c 106.586
 264.408 106.75 264.572 106.961 264.619 c 107.387 264.713 107.762 264.338
 107.668 263.916 c 107.621 263.705 107.457 263.537 107.246 263.49 c h
107.293 250.642 m 106.867 250.549 106.492 250.924 106.586 251.349 c 106.633
 251.56 106.797 251.724 107.012 251.771 c 107.434 251.865 107.809 251.49
 107.715 251.064 c 107.668 250.853 107.504 250.689 107.293 250.642 c h
120.844 250.713 m 120.422 250.619 120.047 250.994 120.141 251.42 c 120.188
 251.631 120.352 251.795 120.562 251.842 c 120.984 251.935 121.363 251.56
 121.27 251.135 c 121.223 250.924 121.055 250.76 120.844 250.713 c h
120.844 250.713 m f
0.234892 w
0 J
0 j
q 1 0 0 -1 0 320.52124 cm
113.984 60.27 m 113.914 60.27 l 112.555 60.27 110.016 58.062 109.008 57.125
 c 108.773 56.91 108.582 56.676 108.488 56.371 c 108.371 56.09 108.207 55.902
 108.066 55.762 c 108.301 55.457 108.676 55.078 109.266 54.703 c 110.652
 53.812 111.473 52.871 111.73 52.379 c 112.012 51.887 111.988 51.652 111.496
 51.629 c 111.004 51.602 109.898 52.473 109.898 52.473 c 109.898 52.473 
108.418 53.719 107.434 55.41 c 107.152 55.363 106.75 55.363 106.422 55.645
 c 105.883 56.09 106 56.77 106.188 57.102 c 106.023 57.242 105.836 57.383
 105.602 57.523 c 104.191 58.484 103.391 59.426 103.109 59.895 c 102.828
 60.387 102.852 60.625 103.344 60.648 c 103.84 60.672 104.941 59.801 104.941
 59.801 c 104.941 59.801 105.93 58.957 106.844 57.734 c 107.035 57.828 107.316
 57.969 107.668 58.133 c 107.762 58.18 107.832 58.227 107.926 58.273 c 108.652
 58.887 109.547 60.293 110.203 61.445 c 110.723 62.34 110.723 63.465 110.203
 64.359 c 109.547 65.531 108.605 67.012 107.879 67.625 c 107.809 67.695 
107.715 67.742 107.645 67.766 c 107.48 67.836 107.363 67.906 107.246 67.953
 c 106.258 66.449 104.988 65.367 104.988 65.367 c 104.988 65.367 103.887
 64.5 103.391 64.523 c 102.898 64.547 102.875 64.781 103.156 65.273 c 103.441
 65.766 104.238 66.707 105.625 67.602 c 106.023 67.859 106.328 68.117 106.562
 68.352 c 106.422 68.445 106.328 68.516 106.258 68.609 c 106.047 68.844 
105.766 69.691 106.398 70.207 c 106.844 70.582 107.363 70.488 107.645 70.395
 c 107.715 70.371 107.785 70.348 107.832 70.301 c 108.797 71.688 109.922
 72.648 109.922 72.648 c 109.922 72.648 111.027 73.52 111.52 73.496 c 112.012
 73.473 112.035 73.238 111.754 72.742 c 111.473 72.25 110.676 71.312 109.289
 70.418 c 108.891 70.16 108.605 69.902 108.371 69.691 c 108.395 69.645 108.418
 69.598 108.441 69.527 c 108.559 69.219 108.75 68.961 108.984 68.75 c 109.992
 67.812 112.508 65.602 113.891 65.602 c 113.867 65.625 m 115.23 65.625 117.887
 67.836 118.918 68.773 c 119.152 68.984 119.34 69.266 119.461 69.551 c 119.508
 69.645 119.531 69.715 119.578 69.785 c 119.363 69.996 119.082 70.23 118.73
 70.441 c 117.344 71.336 116.523 72.273 116.266 72.766 c 115.984 73.262 
116.008 73.496 116.5 73.52 c 116.992 73.543 118.098 72.672 118.098 72.672
 c 118.098 72.672 119.223 71.711 120.164 70.348 c 120.188 70.371 120.234
 70.371 120.258 70.395 c 120.539 70.488 121.055 70.582 121.504 70.207 c 
122.137 69.691 121.855 68.844 121.645 68.609 c 121.574 68.539 121.504 68.469
 121.41 68.398 c 121.645 68.141 121.949 67.883 122.395 67.602 c 123.781 
66.707 124.602 65.766 124.863 65.273 c 125.145 64.781 125.121 64.547 124.625
 64.523 c 124.133 64.5 123.031 65.367 123.031 65.367 c 123.031 65.367 121.738
 66.473 120.75 68 c 120.609 67.93 120.445 67.859 120.258 67.766 c 120.164
 67.719 120.094 67.672 120 67.625 c 119.27 67.012 118.379 65.602 117.723
 64.453 c 117.203 63.559 117.203 62.434 117.723 61.539 c 118.379 60.363 
119.316 58.887 120.047 58.273 c 120.117 58.203 120.211 58.156 120.305 58.133
 c 120.68 57.969 120.938 57.852 121.125 57.734 c 122.043 58.98 123.031 59.801
 123.031 59.801 c 123.031 59.801 124.133 60.672 124.625 60.648 c 125.121
 60.625 125.145 60.387 124.863 59.895 c 124.578 59.402 123.781 58.461 122.395
 57.57 c 122.16 57.43 121.973 57.266 121.809 57.125 c 121.973 56.77 122.09
 56.113 121.574 55.668 c 121.246 55.387 120.867 55.387 120.586 55.434 c 
119.555 53.766 118.074 52.52 118.074 52.52 c 118.074 52.52 116.969 51.652
 116.477 51.676 c 115.984 51.699 115.961 51.934 116.242 52.426 c 116.523
 52.918 117.32 53.859 118.707 54.75 c 119.27 55.125 119.648 55.48 119.906
 55.785 c 119.766 55.902 119.602 56.113 119.484 56.371 c 119.363 56.676 
119.176 56.938 118.941 57.148 c 117.934 58.086 115.348 60.293 113.961 60.293
 c 120.68 55.973 m 121.102 55.879 121.48 56.254 121.387 56.676 c 121.34 
56.887 121.172 57.055 120.961 57.102 c 120.539 57.195 120.164 56.816 120.258
 56.395 c 120.305 56.184 120.469 56.02 120.68 55.973 c h
107.246 57.031 m 106.82 57.125 106.445 56.746 106.539 56.324 c 106.586 
56.113 106.75 55.949 106.961 55.902 c 107.387 55.809 107.762 56.184 107.668
 56.605 c 107.621 56.816 107.457 56.984 107.246 57.031 c h
107.293 69.879 m 106.867 69.973 106.492 69.598 106.586 69.172 c 106.633
 68.961 106.797 68.797 107.012 68.75 c 107.434 68.656 107.809 69.031 107.715
 69.457 c 107.668 69.668 107.504 69.832 107.293 69.879 c h
120.844 69.809 m 120.422 69.902 120.047 69.527 120.141 69.102 c 120.188
 68.891 120.352 68.727 120.562 68.68 c 120.984 68.586 121.363 68.961 121.27
 69.387 c 121.223 69.598 121.055 69.762 120.844 69.809 c h
120.844 69.809 m S Q
0.952941 0.52549 0.188235 rg
3.2 w
1 J
1 j
q 1 0 0 -1 0 320.52124 cm
152.621 62.574 m 152.621 83.91 135.324 101.207 113.984 101.207 c 92.648
 101.207 75.352 83.91 75.352 62.574 c 75.352 41.234 92.648 23.938 113.984
 23.938 c 135.324 23.938 152.621 41.234 152.621 62.574 c h
152.621 62.574 m S Q
q 1 0 0 -1 0 320.52124 cm
136.285 62.574 m 136.285 74.891 126.301 84.875 113.984 84.875 c 101.668
 84.875 91.684 74.891 91.684 62.574 c 91.684 50.258 101.668 40.273 113.984
 40.273 c 126.301 40.273 136.285 50.258 136.285 62.574 c h
136.285 62.574 m S Q
q 1 0 0 -1 0 320.52124 cm
270.031 203.379 m 270.031 220.242 256.359 233.914 239.492 233.914 c 222.629
 233.914 208.957 220.242 208.957 203.379 c 208.957 186.512 222.629 172.84
 239.492 172.84 c 256.359 172.84 270.031 186.512 270.031 203.379 c h
270.031 203.379 m S Q
0.980392 0.411765 0 rg
239.492 119.447 m 239.422 119.447 l 238.059 119.447 235.523 121.654 234.512
 122.592 c 234.277 122.802 234.09 123.041 233.996 123.345 c 233.879 123.627
 233.715 123.814 233.574 123.955 c 233.809 124.26 234.184 124.635 234.773
 125.013 c 236.156 125.904 236.98 126.845 237.238 127.338 c 237.52 127.83
 237.496 128.064 237.004 128.088 c 236.512 128.111 235.406 127.244 235.406
 127.244 c 235.406 127.244 233.926 125.998 232.941 124.306 c 232.656 124.353
 232.258 124.353 231.93 124.072 c 231.391 123.627 231.508 122.943 231.695
 122.615 c 231.531 122.474 231.344 122.334 231.109 122.193 c 229.699 121.232
 228.898 120.291 228.617 119.822 c 228.336 119.326 228.359 119.092 228.852
 119.068 c 229.348 119.045 230.449 119.916 230.449 119.916 c 230.449 119.916
 231.438 120.76 232.352 121.982 c 232.539 121.888 232.82 121.748 233.176
 121.584 c 233.27 121.537 233.34 121.49 233.434 121.443 c 234.16 120.83 
235.055 119.42 235.711 118.271 c 236.227 117.377 236.227 116.252 235.711
 115.357 c 235.055 114.185 234.113 112.705 233.387 112.092 c 233.316 112.021
 233.223 111.974 233.152 111.951 c 232.988 111.881 232.871 111.81 232.75
 111.763 c 231.766 113.267 230.496 114.349 230.496 114.349 c 230.496 114.349
 229.395 115.217 228.898 115.193 c 228.406 115.17 228.383 114.935 228.664
 114.443 c 228.945 113.947 229.746 113.01 231.133 112.115 c 231.531 111.857
 231.836 111.599 232.07 111.365 c 231.93 111.271 231.836 111.201 231.766
 111.107 c 231.555 110.873 231.273 110.025 231.906 109.51 c 232.352 109.135
 232.871 109.228 233.152 109.322 c 233.223 109.345 233.293 109.369 233.34
 109.416 c 234.301 108.029 235.43 107.068 235.43 107.068 c 235.43 107.068
 236.535 106.197 237.027 106.22 c 237.52 106.244 237.543 106.478 237.262
 106.97 c 236.98 107.467 236.18 108.404 234.797 109.299 c 234.395 109.556
 234.113 109.814 233.879 110.025 c 233.902 110.072 233.926 110.119 233.949
 110.189 c 234.066 110.494 234.254 110.756 234.488 110.967 c 235.5 111.904
 238.012 114.115 239.398 114.115 c 239.375 114.088 m 240.738 114.088 243.391
 111.881 244.426 110.943 c 244.66 110.732 244.848 110.447 244.965 110.166
 c 245.012 110.072 245.035 110.002 245.082 109.931 c 244.871 109.72 244.59
 109.486 244.238 109.275 c 242.852 108.381 242.031 107.443 241.773 106.947
 c 241.488 106.455 241.512 106.22 242.008 106.197 c 242.5 106.174 243.605
 107.045 243.605 107.045 c 243.605 107.045 244.73 108.006 245.672 109.369
 c 245.695 109.345 245.742 109.345 245.766 109.322 c 246.047 109.228 246.562
 109.135 247.008 109.51 c 247.645 110.025 247.363 110.873 247.152 111.107
 c 247.082 111.177 247.008 111.248 246.914 111.318 c 247.152 111.576 247.457
 111.834 247.902 112.115 c 249.289 113.01 250.109 113.947 250.367 114.443
 c 250.652 114.935 250.629 115.17 250.133 115.193 c 249.641 115.217 248.535
 114.349 248.535 114.349 c 248.535 114.349 247.246 113.244 246.258 111.717
 c 246.117 111.787 245.953 111.857 245.766 111.951 c 245.672 111.998 245.602
 112.045 245.508 112.092 c 244.777 112.705 243.887 114.115 243.227 115.263
 c 242.711 116.158 242.711 117.283 243.227 118.177 c 243.887 119.349 244.824
 120.83 245.555 121.443 c 245.625 121.513 245.719 121.56 245.812 121.584
 c 246.188 121.748 246.445 121.865 246.633 121.982 c 247.551 120.736 248.535
 119.916 248.535 119.916 c 248.535 119.916 249.641 119.045 250.133 119.068
 c 250.629 119.092 250.652 119.326 250.367 119.822 c 250.086 120.314 249.289
 121.256 247.902 122.146 c 247.668 122.287 247.48 122.451 247.316 122.592
 c 247.48 122.943 247.598 123.603 247.082 124.049 c 246.75 124.33 246.375
 124.33 246.094 124.283 c 245.059 125.951 243.582 127.197 243.582 127.197
 c 243.582 127.197 242.477 128.064 241.984 128.041 c 241.488 128.017 241.465
 127.783 241.75 127.291 c 242.031 126.799 242.828 125.857 244.215 124.967
 c 244.777 124.588 245.152 124.236 245.414 123.931 c 245.273 123.814 245.105
 123.603 244.988 123.345 c 244.871 123.041 244.684 122.779 244.449 122.568
 c 243.438 121.631 240.855 119.42 239.469 119.42 c 246.188 123.744 m 246.609
 123.838 246.984 123.463 246.891 123.041 c 246.844 122.826 246.68 122.662
 246.469 122.615 c 246.047 122.521 245.672 122.896 245.766 123.322 c 245.812
 123.533 245.977 123.697 246.188 123.744 c h
232.75 122.685 m 232.328 122.592 231.953 122.967 232.047 123.392 c 232.094
 123.603 232.258 123.767 232.469 123.814 c 232.895 123.908 233.27 123.533
 233.176 123.111 c 233.129 122.896 232.965 122.732 232.75 122.685 c h
232.797 109.838 m 232.375 109.744 232 110.119 232.094 110.541 c 232.141
 110.756 232.305 110.92 232.516 110.967 c 232.941 111.06 233.316 110.685
 233.223 110.26 c 233.176 110.049 233.012 109.885 232.797 109.838 c h
246.352 109.908 m 245.93 109.814 245.555 110.189 245.648 110.615 c 245.695
 110.826 245.859 110.99 246.07 111.037 c 246.492 111.131 246.867 110.756
 246.773 110.33 c 246.727 110.119 246.562 109.955 246.352 109.908 c h
246.352 109.908 m f
0.234892 w
0 J
0 j
q 1 0 0 -1 0 320.52124 cm
239.492 201.074 m 239.422 201.074 l 238.059 201.074 235.523 198.867 234.512
 197.93 c 234.277 197.719 234.09 197.48 233.996 197.176 c 233.879 196.895
 233.715 196.707 233.574 196.566 c 233.809 196.262 234.184 195.887 234.773
 195.508 c 236.156 194.617 236.98 193.676 237.238 193.184 c 237.52 192.691
 237.496 192.457 237.004 192.434 c 236.512 192.41 235.406 193.277 235.406
 193.277 c 235.406 193.277 233.926 194.523 232.941 196.215 c 232.656 196.168
 232.258 196.168 231.93 196.449 c 231.391 196.895 231.508 197.578 231.695
 197.906 c 231.531 198.047 231.344 198.188 231.109 198.328 c 229.699 199.289
 228.898 200.23 228.617 200.699 c 228.336 201.195 228.359 201.43 228.852
 201.453 c 229.348 201.477 230.449 200.605 230.449 200.605 c 230.449 200.605
 231.438 199.762 232.352 198.539 c 232.539 198.633 232.82 198.773 233.176
 198.938 c 233.27 198.984 233.34 199.031 233.434 199.078 c 234.16 199.691
 235.055 201.102 235.711 202.25 c 236.227 203.145 236.227 204.27 235.711
 205.164 c 235.055 206.336 234.113 207.816 233.387 208.43 c 233.316 208.5
 233.223 208.547 233.152 208.57 c 232.988 208.641 232.871 208.711 232.75
 208.758 c 231.766 207.254 230.496 206.172 230.496 206.172 c 230.496 206.172
 229.395 205.305 228.898 205.328 c 228.406 205.352 228.383 205.586 228.664
 206.078 c 228.945 206.574 229.746 207.512 231.133 208.406 c 231.531 208.664
 231.836 208.922 232.07 209.156 c 231.93 209.25 231.836 209.32 231.766 209.414
 c 231.555 209.648 231.273 210.496 231.906 211.012 c 232.352 211.387 232.871
 211.293 233.152 211.199 c 233.223 211.176 233.293 211.152 233.34 211.105
 c 234.301 212.492 235.43 213.453 235.43 213.453 c 235.43 213.453 236.535
 214.324 237.027 214.301 c 237.52 214.277 237.543 214.043 237.262 213.551
 c 236.98 213.055 236.18 212.117 234.797 211.223 c 234.395 210.965 234.113
 210.707 233.879 210.496 c 233.902 210.449 233.926 210.402 233.949 210.332
 c 234.066 210.027 234.254 209.766 234.488 209.555 c 235.5 208.617 238.012
 206.406 239.398 206.406 c 239.375 206.434 m 240.738 206.434 243.391 208.641
 244.426 209.578 c 244.66 209.789 244.848 210.074 244.965 210.355 c 245.012
 210.449 245.035 210.52 245.082 210.59 c 244.871 210.801 244.59 211.035 
244.238 211.246 c 242.852 212.141 242.031 213.078 241.773 213.574 c 241.488
 214.066 241.512 214.301 242.008 214.324 c 242.5 214.348 243.605 213.477
 243.605 213.477 c 243.605 213.477 244.73 212.516 245.672 211.152 c 245.695
 211.176 245.742 211.176 245.766 211.199 c 246.047 211.293 246.562 211.387
 247.008 211.012 c 247.645 210.496 247.363 209.648 247.152 209.414 c 247.082
 209.344 247.008 209.273 246.914 209.203 c 247.152 208.945 247.457 208.688
 247.902 208.406 c 249.289 207.512 250.109 206.574 250.367 206.078 c 250.652
 205.586 250.629 205.352 250.133 205.328 c 249.641 205.305 248.535 206.172
 248.535 206.172 c 248.535 206.172 247.246 207.277 246.258 208.805 c 246.117
 208.734 245.953 208.664 245.766 208.57 c 245.672 208.523 245.602 208.477
 245.508 208.43 c 244.777 207.816 243.887 206.406 243.227 205.258 c 242.711
 204.363 242.711 203.238 243.227 202.344 c 243.887 201.172 244.824 199.691
 245.555 199.078 c 245.625 199.008 245.719 198.961 245.812 198.938 c 246.188
 198.773 246.445 198.656 246.633 198.539 c 247.551 199.785 248.535 200.605
 248.535 200.605 c 248.535 200.605 249.641 201.477 250.133 201.453 c 250.629
 201.43 250.652 201.195 250.367 200.699 c 250.086 200.207 249.289 199.266
 247.902 198.375 c 247.668 198.234 247.48 198.07 247.316 197.93 c 247.48
 197.578 247.598 196.918 247.082 196.473 c 246.75 196.191 246.375 196.191
 246.094 196.238 c 245.059 194.57 243.582 193.324 243.582 193.324 c 243.582
 193.324 242.477 192.457 241.984 192.48 c 241.488 192.504 241.465 192.738
 241.75 193.23 c 242.031 193.723 242.828 194.664 244.215 195.555 c 244.777
 195.934 245.152 196.285 245.414 196.59 c 245.273 196.707 245.105 196.918
 244.988 197.176 c 244.871 197.48 244.684 197.742 244.449 197.953 c 243.438
 198.891 240.855 201.102 239.469 201.102 c 246.188 196.777 m 246.609 196.684
 246.984 197.059 246.891 197.48 c 246.844 197.695 246.68 197.859 246.469
 197.906 c 246.047 198 245.672 197.625 245.766 197.199 c 245.812 196.988
 245.977 196.824 246.188 196.777 c h
232.75 197.836 m 232.328 197.93 231.953 197.555 232.047 197.129 c 232.094
 196.918 232.258 196.754 232.469 196.707 c 232.895 196.613 233.27 196.988
 233.176 197.41 c 233.129 197.625 232.965 197.789 232.75 197.836 c h
232.797 210.684 m 232.375 210.777 232 210.402 232.094 209.98 c 232.141 
209.766 232.305 209.602 232.516 209.555 c 232.941 209.461 233.316 209.836
 233.223 210.262 c 233.176 210.473 233.012 210.637 232.797 210.684 c h
246.352 210.613 m 245.93 210.707 245.555 210.332 245.648 209.906 c 245.695
 209.695 245.859 209.531 246.07 209.484 c 246.492 209.391 246.867 209.766
 246.773 210.191 c 246.727 210.402 246.562 210.566 246.352 210.613 c h
246.352 210.613 m S Q
0.952941 0.52549 0.188235 rg
3.2 w
1 J
1 j
q 1 0 0 -1 0 320.52124 cm
278.129 203.379 m 278.129 224.715 260.832 242.012 239.492 242.012 c 218.156
 242.012 200.859 224.715 200.859 203.379 c 200.859 182.039 218.156 164.742
 239.492 164.742 c 260.832 164.742 278.129 182.039 278.129 203.379 c h
278.129 203.379 m S Q
q 1 0 0 -1 0 320.52124 cm
261.793 203.379 m 261.793 215.695 251.809 225.68 239.492 225.68 c 227.176
 225.68 217.191 215.695 217.191 203.379 c 217.191 191.062 227.176 181.078
 239.492 181.078 c 251.809 181.078 261.793 191.062 261.793 203.379 c h
261.793 203.379 m S Q
q 1 0 0 -1 0 320.52124 cm
404.734 75.41 m 404.734 92.277 391.062 105.949 374.195 105.949 c 357.332
 105.949 343.66 92.277 343.66 75.41 c 343.66 58.547 357.332 44.875 374.195
 44.875 c 391.062 44.875 404.734 58.547 404.734 75.41 c h
404.734 75.41 m S Q
0.980392 0.411765 0 rg
374.195 247.412 m 374.125 247.412 l 372.762 247.412 370.227 249.619 369.215
 250.56 c 368.98 250.771 368.793 251.006 368.699 251.31 c 368.582 251.592
 368.418 251.783 368.277 251.924 c 368.512 252.228 368.887 252.603 369.473
 252.978 c 370.859 253.873 371.684 254.81 371.941 255.306 c 372.223 255.799
 372.199 256.033 371.707 256.056 c 371.211 256.08 370.109 255.213 370.109
 255.213 c 370.109 255.213 368.629 253.967 367.641 252.275 c 367.359 252.322
 366.961 252.322 366.633 252.041 c 366.09 251.592 366.211 250.912 366.398
 250.584 c 366.234 250.443 366.043 250.302 365.809 250.162 c 364.402 249.197
 363.602 248.26 363.32 247.787 c 363.039 247.295 363.062 247.06 363.555 
247.037 c 364.047 247.013 365.152 247.881 365.152 247.881 c 365.152 247.881
 366.141 248.728 367.055 249.951 c 367.242 249.853 367.523 249.713 367.875
 249.549 c 367.973 249.502 368.043 249.455 368.137 249.408 c 368.863 248.799
 369.758 247.388 370.414 246.236 c 370.93 245.345 370.93 244.217 370.414
 243.326 c 369.758 242.15 368.816 240.67 368.09 240.06 c 368.02 239.99 367.926
 239.943 367.852 239.92 c 367.688 239.849 367.57 239.779 367.453 239.732
 c 366.469 241.236 365.199 242.314 365.199 242.314 c 365.199 242.314 364.094
 243.185 363.602 243.162 c 363.109 243.138 363.086 242.904 363.367 242.408
 c 363.648 241.916 364.449 240.974 365.832 240.084 c 366.234 239.826 366.539
 239.568 366.773 239.334 c 366.633 239.24 366.539 239.166 366.469 239.072
 c 366.258 238.838 365.973 237.994 366.609 237.478 c 367.055 237.099 367.57
 237.193 367.852 237.287 c 367.926 237.31 367.996 237.334 368.043 237.381
 c 369.004 235.998 370.133 235.033 370.133 235.033 c 370.133 235.033 371.234
 234.166 371.73 234.189 c 372.223 234.213 372.246 234.447 371.965 234.939
 c 371.684 235.431 370.883 236.373 369.496 237.263 c 369.098 237.525 368.816
 237.783 368.582 237.994 c 368.605 238.041 368.629 238.088 368.652 238.158
 c 368.77 238.463 368.957 238.72 369.191 238.931 c 370.203 239.873 372.715
 242.08 374.102 242.08 c 374.078 242.056 m 375.441 242.056 378.094 239.849
 379.129 238.908 c 379.363 238.697 379.551 238.416 379.668 238.135 c 379.715
 238.041 379.738 237.97 379.785 237.9 c 379.574 237.689 379.293 237.455 
378.941 237.24 c 377.555 236.349 376.73 235.408 376.473 234.916 c 376.191
 234.424 376.215 234.189 376.707 234.166 c 377.203 234.142 378.305 235.01
 378.305 235.01 c 378.305 235.01 379.434 235.974 380.375 237.334 c 380.398
 237.31 380.445 237.31 380.469 237.287 c 380.75 237.193 381.266 237.099 
381.711 237.478 c 382.348 237.994 382.062 238.838 381.852 239.072 c 381.781
 239.142 381.711 239.217 381.617 239.287 c 381.852 239.545 382.16 239.802
 382.605 240.084 c 383.992 240.974 384.812 241.916 385.07 242.408 c 385.352
 242.904 385.328 243.138 384.836 243.162 c 384.344 243.185 383.238 242.314
 383.238 242.314 c 383.238 242.314 381.945 241.213 380.961 239.685 c 380.82
 239.756 380.656 239.826 380.469 239.92 c 380.375 239.967 380.301 240.013
 380.207 240.06 c 379.48 240.67 378.59 242.08 377.93 243.232 c 377.414 244.123
 377.414 245.252 377.93 246.142 c 378.59 247.318 379.527 248.799 380.254
 249.408 c 380.328 249.478 380.422 249.525 380.516 249.549 c 380.891 249.713
 381.148 249.83 381.336 249.951 c 382.254 248.705 383.238 247.881 383.238
 247.881 c 383.238 247.881 384.344 247.013 384.836 247.037 c 385.328 247.06
 385.352 247.295 385.07 247.787 c 384.789 248.283 383.992 249.22 382.605
 250.115 c 382.371 250.256 382.184 250.42 382.016 250.56 c 382.184 250.912
 382.301 251.568 381.781 252.017 c 381.453 252.299 381.078 252.299 380.797
 252.252 c 379.762 253.92 378.281 255.162 378.281 255.162 c 378.281 255.162
 377.18 256.033 376.684 256.01 c 376.191 255.986 376.168 255.752 376.449
 255.26 c 376.73 254.763 377.531 253.826 378.918 252.931 c 379.48 252.556
 379.855 252.205 380.113 251.9 c 379.973 251.783 379.809 251.568 379.691
 251.31 c 379.574 251.006 379.387 250.748 379.152 250.537 c 378.141 249.595
 375.559 247.388 374.172 247.388 c 380.891 251.713 m 381.312 251.806 381.688
 251.427 381.594 251.006 c 381.547 250.795 381.383 250.631 381.172 250.584
 c 380.75 250.49 380.375 250.865 380.469 251.287 c 380.516 251.498 380.68
 251.666 380.891 251.713 c h
367.453 250.654 m 367.031 250.56 366.656 250.935 366.75 251.357 c 366.797
 251.568 366.961 251.736 367.172 251.783 c 367.594 251.877 367.973 251.498
 367.875 251.076 c 367.828 250.865 367.664 250.701 367.453 250.654 c h
367.5 237.806 m 367.078 237.713 366.703 238.088 366.797 238.51 c 366.844
 238.72 367.008 238.885 367.219 238.931 c 367.641 239.025 368.02 238.65 
367.926 238.228 c 367.875 238.017 367.711 237.853 367.5 237.806 c h
381.055 237.877 m 380.633 237.783 380.254 238.158 380.352 238.58 c 380.398
 238.791 380.562 238.955 380.773 239.002 c 381.195 239.095 381.57 238.72
 381.477 238.299 c 381.43 238.088 381.266 237.924 381.055 237.877 c h
381.055 237.877 m f
0.234892 w
0 J
0 j
q 1 0 0 -1 0 320.52124 cm
374.195 73.109 m 374.125 73.109 l 372.762 73.109 370.227 70.902 369.215
 69.961 c 368.98 69.75 368.793 69.516 368.699 69.211 c 368.582 68.93 368.418
 68.738 368.277 68.598 c 368.512 68.293 368.887 67.918 369.473 67.543 c 
370.859 66.648 371.684 65.711 371.941 65.215 c 372.223 64.723 372.199 64.488
 371.707 64.465 c 371.211 64.441 370.109 65.309 370.109 65.309 c 370.109
 65.309 368.629 66.555 367.641 68.246 c 367.359 68.199 366.961 68.199 366.633
 68.48 c 366.09 68.93 366.211 69.609 366.398 69.938 c 366.234 70.078 366.043
 70.219 365.809 70.359 c 364.402 71.324 363.602 72.262 363.32 72.734 c 363.039
 73.227 363.062 73.461 363.555 73.484 c 364.047 73.508 365.152 72.641 365.152
 72.641 c 365.152 72.641 366.141 71.793 367.055 70.57 c 367.242 70.668 367.523
 70.809 367.875 70.973 c 367.973 71.02 368.043 71.066 368.137 71.113 c 368.863
 71.723 369.758 73.133 370.414 74.285 c 370.93 75.176 370.93 76.305 370.414
 77.195 c 369.758 78.371 368.816 79.852 368.09 80.461 c 368.02 80.531 367.926
 80.578 367.852 80.602 c 367.688 80.672 367.57 80.742 367.453 80.789 c 366.469
 79.285 365.199 78.207 365.199 78.207 c 365.199 78.207 364.094 77.336 363.602
 77.359 c 363.109 77.383 363.086 77.617 363.367 78.113 c 363.648 78.605 
364.449 79.547 365.832 80.438 c 366.234 80.695 366.539 80.953 366.773 81.188
 c 366.633 81.281 366.539 81.355 366.469 81.449 c 366.258 81.684 365.973
 82.527 366.609 83.043 c 367.055 83.422 367.57 83.328 367.852 83.234 c 367.926
 83.211 367.996 83.188 368.043 83.141 c 369.004 84.523 370.133 85.488 370.133
 85.488 c 370.133 85.488 371.234 86.355 371.73 86.332 c 372.223 86.309 372.246
 86.074 371.965 85.582 c 371.684 85.09 370.883 84.148 369.496 83.258 c 369.098
 82.996 368.816 82.738 368.582 82.527 c 368.605 82.48 368.629 82.434 368.652
 82.363 c 368.77 82.059 368.957 81.801 369.191 81.59 c 370.203 80.648 372.715
 78.441 374.102 78.441 c 374.078 78.465 m 375.441 78.465 378.094 80.672 
379.129 81.613 c 379.363 81.824 379.551 82.105 379.668 82.387 c 379.715 
82.48 379.738 82.551 379.785 82.621 c 379.574 82.832 379.293 83.066 378.941
 83.281 c 377.555 84.172 376.73 85.113 376.473 85.605 c 376.191 86.098 376.215
 86.332 376.707 86.355 c 377.203 86.379 378.305 85.512 378.305 85.512 c 
378.305 85.512 379.434 84.547 380.375 83.188 c 380.398 83.211 380.445 83.211
 380.469 83.234 c 380.75 83.328 381.266 83.422 381.711 83.043 c 382.348 
82.527 382.062 81.684 381.852 81.449 c 381.781 81.379 381.711 81.305 381.617
 81.234 c 381.852 80.977 382.16 80.719 382.605 80.438 c 383.992 79.547 384.812
 78.605 385.07 78.113 c 385.352 77.617 385.328 77.383 384.836 77.359 c 384.344
 77.336 383.238 78.207 383.238 78.207 c 383.238 78.207 381.945 79.309 380.961
 80.836 c 380.82 80.766 380.656 80.695 380.469 80.602 c 380.375 80.555 380.301
 80.508 380.207 80.461 c 379.48 79.852 378.59 78.441 377.93 77.289 c 377.414
 76.398 377.414 75.27 377.93 74.379 c 378.59 73.203 379.527 71.723 380.254
 71.113 c 380.328 71.043 380.422 70.996 380.516 70.973 c 380.891 70.809 
381.148 70.691 381.336 70.57 c 382.254 71.816 383.238 72.641 383.238 72.641
 c 383.238 72.641 384.344 73.508 384.836 73.484 c 385.328 73.461 385.352
 73.227 385.07 72.734 c 384.789 72.238 383.992 71.301 382.605 70.406 c 382.371
 70.266 382.184 70.102 382.016 69.961 c 382.184 69.609 382.301 68.953 381.781
 68.504 c 381.453 68.223 381.078 68.223 380.797 68.27 c 379.762 66.602 378.281
 65.359 378.281 65.359 c 378.281 65.359 377.18 64.488 376.684 64.512 c 376.191
 64.535 376.168 64.77 376.449 65.262 c 376.73 65.758 377.531 66.695 378.918
 67.59 c 379.48 67.965 379.855 68.316 380.113 68.621 c 379.973 68.738 379.809
 68.953 379.691 69.211 c 379.574 69.516 379.387 69.773 379.152 69.984 c 
378.141 70.926 375.559 73.133 374.172 73.133 c 380.891 68.809 m 381.312 
68.715 381.688 69.094 381.594 69.516 c 381.547 69.727 381.383 69.891 381.172
 69.938 c 380.75 70.031 380.375 69.656 380.469 69.234 c 380.516 69.023 380.68
 68.855 380.891 68.809 c h
367.453 69.867 m 367.031 69.961 366.656 69.586 366.75 69.164 c 366.797 
68.953 366.961 68.785 367.172 68.738 c 367.594 68.645 367.973 69.023 367.875
 69.445 c 367.828 69.656 367.664 69.82 367.453 69.867 c h
367.5 82.715 m 367.078 82.809 366.703 82.434 366.797 82.012 c 366.844 81.801
 367.008 81.637 367.219 81.59 c 367.641 81.496 368.02 81.871 367.926 82.293
 c 367.875 82.504 367.711 82.668 367.5 82.715 c h
381.055 82.645 m 380.633 82.738 380.254 82.363 380.352 81.941 c 380.398
 81.73 380.562 81.566 380.773 81.52 c 381.195 81.426 381.57 81.801 381.477
 82.223 c 381.43 82.434 381.266 82.598 381.055 82.645 c h
381.055 82.645 m S Q
0.952941 0.52549 0.188235 rg
3.2 w
1 J
1 j
q 1 0 0 -1 0 320.52124 cm
412.828 75.41 m 412.828 96.746 395.531 114.047 374.195 114.047 c 352.859
 114.047 335.562 96.746 335.562 75.41 c 335.562 54.074 352.859 36.777 374.195
 36.777 c 395.531 36.777 412.828 54.074 412.828 75.41 c h
412.828 75.41 m S Q
q 1 0 0 -1 0 320.52124 cm
396.496 75.41 m 396.496 87.727 386.512 97.711 374.195 97.711 c 361.879 
97.711 351.895 87.727 351.895 75.41 c 351.895 63.094 361.879 53.109 374.195
 53.109 c 386.512 53.109 396.496 63.094 396.496 75.41 c h
396.496 75.41 m S Q
q 1 0 0 -1 0 320.52124 cm
446.828 247.156 m 446.828 264.023 433.156 277.695 416.289 277.695 c 399.426
 277.695 385.754 264.023 385.754 247.156 c 385.754 230.293 399.426 216.621
 416.289 216.621 c 433.156 216.621 446.828 230.293 446.828 247.156 c h
446.828 247.156 m S Q
0.980392 0.411765 0 rg
416.289 75.666 m 416.219 75.666 l 414.855 75.666 412.32 77.877 411.309 
78.814 c 411.074 79.025 410.887 79.26 410.793 79.564 c 410.676 79.849 410.512
 80.037 410.371 80.177 c 410.605 80.482 410.98 80.857 411.57 81.232 c 412.953
 82.127 413.777 83.064 414.035 83.56 c 414.316 84.052 414.293 84.287 413.801
 84.31 c 413.309 84.334 412.203 83.467 412.203 83.467 c 412.203 83.467 410.723
 82.22 409.738 80.529 c 409.453 80.576 409.055 80.576 408.727 80.295 c 408.188
 79.849 408.305 79.166 408.492 78.838 c 408.328 78.697 408.141 78.556 407.906
 78.416 c 406.496 77.451 405.695 76.513 405.414 76.041 c 405.133 75.549 
405.156 75.314 405.648 75.291 c 406.145 75.267 407.246 76.138 407.246 76.138
 c 407.246 76.138 408.234 76.982 409.148 78.205 c 409.336 78.111 409.617
 77.97 409.973 77.802 c 410.066 77.756 410.137 77.709 410.23 77.662 c 410.957
 77.052 411.852 75.642 412.508 74.494 c 413.023 73.599 413.023 72.47 412.508
 71.58 c 411.852 70.404 410.91 68.924 410.184 68.314 c 410.113 68.244 410.02
 68.197 409.949 68.174 c 409.785 68.103 409.668 68.033 409.547 67.986 c 
408.562 69.49 407.293 70.568 407.293 70.568 c 407.293 70.568 406.191 71.439
 405.695 71.416 c 405.203 71.392 405.18 71.158 405.461 70.662 c 405.742 
70.17 406.543 69.232 407.93 68.338 c 408.328 68.08 408.633 67.822 408.867
 67.588 c 408.727 67.494 408.633 67.424 408.562 67.33 c 408.352 67.092 408.07
 66.248 408.703 65.732 c 409.148 65.353 409.668 65.451 409.949 65.545 c 
410.02 65.568 410.09 65.592 410.137 65.638 c 411.098 64.252 412.227 63.287
 412.227 63.287 c 412.227 63.287 413.332 62.42 413.824 62.443 c 414.316 
62.467 414.34 62.701 414.059 63.193 c 413.777 63.689 412.977 64.627 411.594
 65.521 c 411.191 65.779 410.91 66.037 410.676 66.248 c 410.699 66.295 410.723
 66.342 410.746 66.412 c 410.863 66.717 411.051 66.974 411.285 67.185 c 
412.297 68.127 414.809 70.334 416.195 70.334 c 416.172 70.31 m 417.535 70.31
 420.188 68.103 421.223 67.162 c 421.457 66.951 421.645 66.67 421.762 66.388
 c 421.809 66.295 421.832 66.224 421.879 66.154 c 421.668 65.943 421.387
 65.709 421.035 65.498 c 419.648 64.603 418.828 63.666 418.57 63.17 c 418.285
 62.677 418.309 62.443 418.805 62.42 c 419.297 62.396 420.402 63.263 420.402
 63.263 c 420.402 63.263 421.527 64.228 422.469 65.592 c 422.492 65.568 
422.539 65.568 422.562 65.545 c 422.844 65.451 423.359 65.353 423.805 65.732
 c 424.441 66.248 424.16 67.092 423.949 67.33 c 423.879 67.4 423.805 67.47
 423.711 67.541 c 423.949 67.799 424.254 68.056 424.699 68.338 c 426.086
 69.232 426.906 70.17 427.164 70.662 c 427.449 71.158 427.426 71.392 426.93
 71.416 c 426.438 71.439 425.332 70.568 425.332 70.568 c 425.332 70.568 
424.043 69.467 423.055 67.939 c 422.914 68.01 422.75 68.08 422.562 68.174
 c 422.469 68.22 422.398 68.267 422.305 68.314 c 421.574 68.924 420.684 
70.334 420.023 71.486 c 419.508 72.377 419.508 73.506 420.023 74.4 c 420.684
 75.572 421.621 77.052 422.352 77.662 c 422.422 77.732 422.516 77.779 422.609
 77.802 c 422.984 77.97 423.242 78.088 423.43 78.205 c 424.348 76.959 425.332
 76.138 425.332 76.138 c 425.332 76.138 426.438 75.267 426.93 75.291 c 427.426
 75.314 427.449 75.549 427.164 76.041 c 426.883 76.537 426.086 77.474 424.699
 78.369 c 424.465 78.51 424.277 78.674 424.113 78.814 c 424.277 79.166 424.395
 79.826 423.879 80.271 c 423.547 80.552 423.172 80.552 422.891 80.506 c 
421.855 82.174 420.379 83.42 420.379 83.42 c 420.379 83.42 419.273 84.287
 418.781 84.263 c 418.285 84.24 418.262 84.006 418.547 83.513 c 418.828 
83.017 419.625 82.08 421.012 81.185 c 421.574 80.81 421.949 80.459 422.211
 80.154 c 422.066 80.037 421.902 79.826 421.785 79.564 c 421.668 79.26 421.48
 79.002 421.246 78.791 c 420.234 77.853 417.652 75.642 416.266 75.642 c 
422.984 79.967 m 423.406 80.06 423.781 79.685 423.688 79.26 c 423.641 79.049
 423.477 78.885 423.266 78.838 c 422.844 78.744 422.469 79.119 422.562 79.541
 c 422.609 79.756 422.773 79.92 422.984 79.967 c h
409.547 78.908 m 409.125 78.814 408.75 79.189 408.844 79.611 c 408.891 
79.826 409.055 79.99 409.266 80.037 c 409.691 80.131 410.066 79.756 409.973
 79.33 c 409.926 79.119 409.762 78.955 409.547 78.908 c h
409.594 66.06 m 409.172 65.967 408.797 66.342 408.891 66.763 c 408.938 
66.974 409.102 67.138 409.312 67.185 c 409.738 67.283 410.113 66.904 410.02
 66.482 c 409.973 66.271 409.809 66.107 409.594 66.06 c h
423.148 66.131 m 422.727 66.037 422.352 66.412 422.445 66.834 c 422.492
 67.045 422.656 67.213 422.867 67.26 c 423.289 67.353 423.664 66.974 423.57
 66.552 c 423.523 66.342 423.359 66.177 423.148 66.131 c h
423.148 66.131 m f
0.234892 w
0 J
0 j
q 1 0 0 -1 0 320.52124 cm
416.289 244.855 m 416.219 244.855 l 414.855 244.855 412.32 242.645 411.309
 241.707 c 411.074 241.496 410.887 241.262 410.793 240.957 c 410.676 240.672
 410.512 240.484 410.371 240.344 c 410.605 240.039 410.98 239.664 411.57
 239.289 c 412.953 238.395 413.777 237.457 414.035 236.961 c 414.316 236.469
 414.293 236.234 413.801 236.211 c 413.309 236.188 412.203 237.055 412.203
 237.055 c 412.203 237.055 410.723 238.301 409.738 239.992 c 409.453 239.945
 409.055 239.945 408.727 240.227 c 408.188 240.672 408.305 241.355 408.492
 241.684 c 408.328 241.824 408.141 241.965 407.906 242.105 c 406.496 243.07
 405.695 244.008 405.414 244.48 c 405.133 244.973 405.156 245.207 405.648
 245.23 c 406.145 245.254 407.246 244.383 407.246 244.383 c 407.246 244.383
 408.234 243.539 409.148 242.316 c 409.336 242.41 409.617 242.551 409.973
 242.719 c 410.066 242.766 410.137 242.812 410.23 242.859 c 410.957 243.469
 411.852 244.879 412.508 246.027 c 413.023 246.922 413.023 248.051 412.508
 248.941 c 411.852 250.117 410.91 251.598 410.184 252.207 c 410.113 252.277
 410.02 252.324 409.949 252.348 c 409.785 252.418 409.668 252.488 409.547
 252.535 c 408.562 251.031 407.293 249.953 407.293 249.953 c 407.293 249.953
 406.191 249.082 405.695 249.105 c 405.203 249.129 405.18 249.363 405.461
 249.859 c 405.742 250.352 406.543 251.289 407.93 252.184 c 408.328 252.441
 408.633 252.699 408.867 252.934 c 408.727 253.027 408.633 253.098 408.562
 253.191 c 408.352 253.43 408.07 254.273 408.703 254.789 c 409.148 255.168
 409.668 255.07 409.949 254.977 c 410.02 254.953 410.09 254.93 410.137 254.883
 c 411.098 256.27 412.227 257.234 412.227 257.234 c 412.227 257.234 413.332
 258.102 413.824 258.078 c 414.316 258.055 414.34 257.82 414.059 257.328
 c 413.777 256.832 412.977 255.895 411.594 255 c 411.191 254.742 410.91 
254.484 410.676 254.273 c 410.699 254.227 410.723 254.18 410.746 254.109
 c 410.863 253.805 411.051 253.547 411.285 253.336 c 412.297 252.395 414.809
 250.188 416.195 250.188 c 416.172 250.211 m 417.535 250.211 420.188 252.418
 421.223 253.359 c 421.457 253.57 421.645 253.852 421.762 254.133 c 421.809
 254.227 421.832 254.297 421.879 254.367 c 421.668 254.578 421.387 254.812
 421.035 255.023 c 419.648 255.918 418.828 256.855 418.57 257.352 c 418.285
 257.844 418.309 258.078 418.805 258.102 c 419.297 258.125 420.402 257.258
 420.402 257.258 c 420.402 257.258 421.527 256.293 422.469 254.93 c 422.492
 254.953 422.539 254.953 422.562 254.977 c 422.844 255.07 423.359 255.168
 423.805 254.789 c 424.441 254.273 424.16 253.43 423.949 253.191 c 423.879
 253.121 423.805 253.051 423.711 252.98 c 423.949 252.723 424.254 252.465
 424.699 252.184 c 426.086 251.289 426.906 250.352 427.164 249.859 c 427.449
 249.363 427.426 249.129 426.93 249.105 c 426.438 249.082 425.332 249.953
 425.332 249.953 c 425.332 249.953 424.043 251.055 423.055 252.582 c 422.914
 252.512 422.75 252.441 422.562 252.348 c 422.469 252.301 422.398 252.254
 422.305 252.207 c 421.574 251.598 420.684 250.188 420.023 249.035 c 419.508
 248.145 419.508 247.016 420.023 246.121 c 420.684 244.949 421.621 243.469
 422.352 242.859 c 422.422 242.789 422.516 242.742 422.609 242.719 c 422.984
 242.551 423.242 242.434 423.43 242.316 c 424.348 243.562 425.332 244.383
 425.332 244.383 c 425.332 244.383 426.438 245.254 426.93 245.23 c 427.426
 245.207 427.449 244.973 427.164 244.48 c 426.883 243.984 426.086 243.047
 424.699 242.152 c 424.465 242.012 424.277 241.848 424.113 241.707 c 424.277
 241.355 424.395 240.695 423.879 240.25 c 423.547 239.969 423.172 239.969
 422.891 240.016 c 421.855 238.348 420.379 237.102 420.379 237.102 c 420.379
 237.102 419.273 236.234 418.781 236.258 c 418.285 236.281 418.262 236.516
 418.547 237.008 c 418.828 237.504 419.625 238.441 421.012 239.336 c 421.574
 239.711 421.949 240.062 422.211 240.367 c 422.066 240.484 421.902 240.695
 421.785 240.957 c 421.668 241.262 421.48 241.52 421.246 241.73 c 420.234
 242.668 417.652 244.879 416.266 244.879 c 422.984 240.555 m 423.406 240.461
 423.781 240.836 423.688 241.262 c 423.641 241.473 423.477 241.637 423.266
 241.684 c 422.844 241.777 422.469 241.402 422.562 240.98 c 422.609 240.766
 422.773 240.602 422.984 240.555 c h
409.547 241.613 m 409.125 241.707 408.75 241.332 408.844 240.91 c 408.891
 240.695 409.055 240.531 409.266 240.484 c 409.691 240.391 410.066 240.766
 409.973 241.191 c 409.926 241.402 409.762 241.566 409.547 241.613 c h
409.594 254.461 m 409.172 254.555 408.797 254.18 408.891 253.758 c 408.938
 253.547 409.102 253.383 409.312 253.336 c 409.738 253.238 410.113 253.617
 410.02 254.039 c 409.973 254.25 409.809 254.414 409.594 254.461 c h
423.148 254.391 m 422.727 254.484 422.352 254.109 422.445 253.688 c 422.492
 253.477 422.656 253.309 422.867 253.262 c 423.289 253.168 423.664 253.547
 423.57 253.969 c 423.523 254.18 423.359 254.344 423.148 254.391 c h
423.148 254.391 m S Q
0.952941 0.52549 0.188235 rg
3.2 w
1 J
1 j
q 1 0 0 -1 0 320.52124 cm
454.926 247.156 m 454.926 268.492 437.629 285.789 416.289 285.789 c 394.953
 285.789 377.656 268.492 377.656 247.156 c 377.656 225.82 394.953 208.523
 416.289 208.523 c 437.629 208.523 454.926 225.82 454.926 247.156 c h
454.926 247.156 m S Q
q 1 0 0 -1 0 320.52124 cm
438.59 247.156 m 438.59 259.473 428.605 269.457 416.289 269.457 c 403.973
 269.457 393.988 259.473 393.988 247.156 c 393.988 234.84 403.973 224.855
 416.289 224.855 c 428.605 224.855 438.59 234.84 438.59 247.156 c h
438.59 247.156 m S Q
0 g
8 w
0 J
0 j
q 1 0 0 -1 0 320.52124 cm
43.332 112.453 m 73.641 87.199 l S Q
q 1 0 0 -1 0 320.52124 cm
146.887 97.301 m 204.977 166.336 l S Q
q 1 0 0 -1 0 320.52124 cm
274.012 172.227 m 338.836 109.086 l S Q
q 1 0 0 -1 0 320.52124 cm
282.43 216.008 m 369.984 240.422 l S Q
q 1 0 0 -1 0 320.52124 cm
387.664 120.871 m 405.344 202.535 l S Q
Q Q
showpage
%%Trailer
end restore
%%EOF
