%!PS-Adobe-3.0 EPSF-3.0
%%Creator: cairo 1.14.2 (http://cairographics.org)
%%CreationDate: Thu Apr 30 14:36:45 2015
%%Pages: 1
%%DocumentData: Clean7Bit
%%LanguageLevel: 2
%%BoundingBox: 2 2 78 78
%%EndComments
%%BeginProlog
save
50 dict begin
/q { gsave } bind def
/Q { grestore } bind def
/cm { 6 array astore concat } bind def
/w { setlinewidth } bind def
/J { setlinecap } bind def
/j { setlinejoin } bind def
/M { setmiterlimit } bind def
/d { setdash } bind def
/m { moveto } bind def
/l { lineto } bind def
/c { curveto } bind def
/h { closepath } bind def
/re { exch dup neg 3 1 roll 5 3 roll moveto 0 rlineto
      0 exch rlineto 0 rlineto closepath } bind def
/S { stroke } bind def
/f { fill } bind def
/f* { eofill } bind def
/n { newpath } bind def
/W { clip } bind def
/W* { eoclip } bind def
/BT { } bind def
/ET { } bind def
/pdfmark where { pop globaldict /?pdfmark /exec load put }
    { globaldict begin /?pdfmark /pop load def /pdfmark
    /cleartomark load def end } ifelse
/BDC { mark 3 1 roll /BDC pdfmark } bind def
/EMC { mark /EMC pdfmark } bind def
/cairo_store_point { /cairo_point_y exch def /cairo_point_x exch def } def
/Tj { show currentpoint cairo_store_point } bind def
/TJ {
  {
    dup
    type /stringtype eq
    { show } { -0.001 mul 0 cairo_font_matrix dtransform rmoveto } ifelse
  } forall
  currentpoint cairo_store_point
} bind def
/cairo_selectfont { cairo_font_matrix aload pop pop pop 0 0 6 array astore
    cairo_font exch selectfont cairo_point_x cairo_point_y moveto } bind def
/Tf { pop /cairo_font exch def /cairo_font_matrix where
      { pop cairo_selectfont } if } bind def
/Td { matrix translate cairo_font_matrix matrix concatmatrix dup
      /cairo_font_matrix exch def dup 4 get exch 5 get cairo_store_point
      /cairo_font where { pop cairo_selectfont } if } bind def
/Tm { 2 copy 8 2 roll 6 array astore /cairo_font_matrix exch def
      cairo_store_point /cairo_font where { pop cairo_selectfont } if } bind def
/g { setgray } bind def
/rg { setrgbcolor } bind def
/d1 { setcachedevice } bind def
%%EndProlog
%%BeginSetup
%%EndSetup
%%Page: 1 1
%%BeginPageSetup
%%PageBoundingBox: 2 2 78 78
%%EndPageSetup
q 2 2 76 76 rectclip q
0.980392 0.411765 0 rg
53.609 7.871 m 53.609 3.766 l 53.609 3.012 52.98 2.398 52.203 2.398 c 27.797
 2.398 l 27.02 2.398 26.391 3.012 26.391 3.766 c 26.391 7.871 l 26.391 12.691
 29.609 16.789 34.074 18.242 c 35.781 17.18 37.809 16.566 39.98 16.566 c
 42.16 16.566 44.191 17.184 45.906 18.25 c 50.383 16.805 53.609 12.703 53.609
 7.871 c h
53.609 7.871 m f
0 g
29.621 46.711 m 29.621 42.605 l 29.621 41.852 28.992 41.238 28.215 41.238
 c 3.809 41.238 l 3.027 41.238 2.398 41.852 2.398 42.605 c 2.398 46.711 
l 2.398 51.531 5.621 55.629 10.082 57.078 c 11.793 56.02 13.82 55.406 15.992
 55.406 c 18.172 55.406 20.203 56.023 21.914 57.09 c 26.391 55.645 29.621
 51.543 29.621 46.711 c h
29.621 46.711 m f
24.676 68.977 m 24.676 66.488 l 24.676 61.727 20.777 57.863 15.992 57.863
 c 11.203 57.863 7.309 61.727 7.309 66.488 c 7.309 68.977 l 7.309 73.73 
11.203 77.602 15.992 77.602 c 20.777 77.602 24.676 73.73 24.676 68.977 c
 h
24.676 68.977 m f
77.602 46.711 m 77.602 42.605 l 77.602 41.852 76.973 41.238 76.191 41.238
 c 51.785 41.238 l 51.008 41.238 50.379 41.852 50.379 42.605 c 50.379 46.711
 l 50.379 51.531 53.598 55.629 58.062 57.078 c 59.77 56.02 61.797 55.406
 63.969 55.406 c 66.148 55.406 68.18 56.023 69.895 57.09 c 74.371 55.645
 77.602 51.543 77.602 46.711 c h
77.602 46.711 m f
72.652 68.977 m 72.652 66.488 l 72.652 61.727 68.758 57.863 63.969 57.863
 c 59.184 57.863 55.289 61.727 55.289 66.488 c 55.289 68.977 l 55.289 73.73
 59.184 77.602 63.969 77.602 c 68.758 77.602 72.652 73.73 72.652 68.977 
c h
72.652 68.977 m f
0.980392 0.411765 0 rg
48.664 30.137 m 48.664 27.648 l 48.664 22.887 44.77 19.023 39.98 19.023
 c 35.195 19.023 31.297 22.887 31.297 27.648 c 31.297 30.137 l 31.297 34.891
 35.195 38.762 39.98 38.762 c 44.77 38.762 48.664 34.891 48.664 30.137 c
 h
48.664 30.137 m f
0 g
13.105 38.488 m 8.488 38.488 l 8.969 27.379 15.289 17.75 24.48 12.57 c 
25.02 14.016 25.801 15.355 26.793 16.539 c 18.977 20.926 13.582 29.07 13.105
 38.488 c h
13.105 38.488 m f
66.895 38.488 m 66.418 29.07 61.023 20.926 53.211 16.539 c 54.199 15.355
 54.98 14.016 55.523 12.57 c 64.715 17.75 71.031 27.379 71.512 38.484 c 
66.895 38.484 l h
66.895 38.488 m f
52.516 66.488 m 52.516 68.613 l 48.676 70.27 44.445 71.195 40 71.195 c 
35.539 71.195 31.297 70.266 27.445 68.602 c 27.445 66.488 l 27.445 65.367
 27.277 64.281 26.969 63.258 c 30.832 65.391 35.273 66.605 40 66.605 c 44.707
 66.605 49.133 65.398 52.988 63.281 c 52.684 64.301 52.516 65.375 52.516
 66.488 c h
52.516 66.488 m f
Q Q
showpage
%%Trailer
end restore
%%EOF
