%!PS-Adobe-3.0 EPSF-3.0
%%Creator: cairo 1.14.2 (http://cairographics.org)
%%CreationDate: Wed Apr 29 17:12:28 2015
%%Pages: 1
%%DocumentData: Clean7Bit
%%LanguageLevel: 2
%%BoundingBox: 15 10 65 70
%%EndComments
%%BeginProlog
save
50 dict begin
/q { gsave } bind def
/Q { grestore } bind def
/cm { 6 array astore concat } bind def
/w { setlinewidth } bind def
/J { setlinecap } bind def
/j { setlinejoin } bind def
/M { setmiterlimit } bind def
/d { setdash } bind def
/m { moveto } bind def
/l { lineto } bind def
/c { curveto } bind def
/h { closepath } bind def
/re { exch dup neg 3 1 roll 5 3 roll moveto 0 rlineto
      0 exch rlineto 0 rlineto closepath } bind def
/S { stroke } bind def
/f { fill } bind def
/f* { eofill } bind def
/n { newpath } bind def
/W { clip } bind def
/W* { eoclip } bind def
/BT { } bind def
/ET { } bind def
/pdfmark where { pop globaldict /?pdfmark /exec load put }
    { globaldict begin /?pdfmark /pop load def /pdfmark
    /cleartomark load def end } ifelse
/BDC { mark 3 1 roll /BDC pdfmark } bind def
/EMC { mark /EMC pdfmark } bind def
/cairo_store_point { /cairo_point_y exch def /cairo_point_x exch def } def
/Tj { show currentpoint cairo_store_point } bind def
/TJ {
  {
    dup
    type /stringtype eq
    { show } { -0.001 mul 0 cairo_font_matrix dtransform rmoveto } ifelse
  } forall
  currentpoint cairo_store_point
} bind def
/cairo_selectfont { cairo_font_matrix aload pop pop pop 0 0 6 array astore
    cairo_font exch selectfont cairo_point_x cairo_point_y moveto } bind def
/Tf { pop /cairo_font exch def /cairo_font_matrix where
      { pop cairo_selectfont } if } bind def
/Td { matrix translate cairo_font_matrix matrix concatmatrix dup
      /cairo_font_matrix exch def dup 4 get exch 5 get cairo_store_point
      /cairo_font where { pop cairo_selectfont } if } bind def
/Tm { 2 copy 8 2 roll 6 array astore /cairo_font_matrix exch def
      cairo_store_point /cairo_font where { pop cairo_selectfont } if } bind def
/g { setgray } bind def
/rg { setrgbcolor } bind def
/d1 { setcachedevice } bind def
%%EndProlog
%%BeginSetup
%%EndSetup
%%Page: 1 1
%%BeginPageSetup
%%PageBoundingBox: 15 10 65 70
%%EndPageSetup
q 15 10 50 60 rectclip q
0 g
62.516 34.715 m 57.832 34.715 l 57.832 33.59 l 52.266 33.59 l 45.617 51.176
 l 47.102 52.633 48.023 54.66 48.023 56.906 c 48.023 60.527 45.629 63.586
 42.336 64.586 c 42.336 67.289 l 42.336 68.582 41.293 69.629 40 69.629 c
 38.711 69.629 37.664 68.582 37.664 67.289 c 37.664 64.586 l 34.371 63.586
 31.977 60.527 31.977 56.906 c 31.977 54.66 32.902 52.633 34.387 51.176 
c 27.734 33.59 l 22.168 33.59 l 22.168 34.715 l 17.484 34.715 l 16.195 34.715
 15.152 33.672 15.152 32.383 c 15.152 31.094 16.195 30.047 17.484 30.047
 c 22.168 30.047 l 22.168 31.254 l 26.848 31.254 l 23.457 22.285 l 22.707
 20.285 23.25 18.121 24.664 16.695 c 24.664 10.371 l 32.531 31.254 l 38.594
 31.254 l 38.594 28.332 l 38.594 27.547 39.234 26.906 40.02 26.906 c 40.805
 26.906 41.445 27.547 41.445 28.332 c 41.445 31.254 l 47.469 31.254 l 55.34
 10.375 l 55.34 16.695 l 56.75 18.121 57.293 20.285 56.547 22.285 c 53.152
 31.258 l 57.832 31.258 l 57.832 30.047 l 62.516 30.047 l 63.805 30.047 
64.848 31.094 64.848 32.383 c 64.852 33.672 63.805 34.715 62.516 34.715 
c h
40 60.711 m 42.102 60.711 43.805 59.008 43.805 56.906 c 43.805 54.805 42.102
 53.102 40 53.102 c 37.898 53.102 36.195 54.805 36.195 56.906 c 36.195 59.008
 37.898 60.711 40 60.711 c h
41.445 33.59 m 41.445 36.516 l 41.445 37.301 40.805 37.938 40.02 37.938
 c 39.234 37.938 38.594 37.301 38.594 36.516 c 38.594 33.59 l 33.414 33.59
 l 39.191 48.922 l 39.457 48.895 39.727 48.883 40 48.883 c 40.273 48.883
 40.543 48.895 40.809 48.922 c 46.586 33.59 l h
41.445 33.59 m f
Q Q
showpage
%%Trailer
end restore
%%EOF
