<?xml version="1.0" encoding="UTF-8" standalone="no"?>
<svg
   xmlns:dc="http://purl.org/dc/elements/1.1/"
   xmlns:cc="http://creativecommons.org/ns#"
   xmlns:rdf="http://www.w3.org/1999/02/22-rdf-syntax-ns#"
   xmlns:svg="http://www.w3.org/2000/svg"
   xmlns="http://www.w3.org/2000/svg"
   xmlns:sodipodi="http://sodipodi.sourceforge.net/DTD/sodipodi-0.dtd"
   xmlns:inkscape="http://www.inkscape.org/namespaces/inkscape"
   version="1.1"
   id="svg3434"
   viewBox="0 0 744.09448819 1052.3622047"
   height="297mm"
   width="210mm"
   inkscape:version="0.91 r13725"
   sodipodi:docname="d002.svg">
  <sodipodi:namedview
     pagecolor="#ffffff"
     bordercolor="#666666"
     borderopacity="1"
     objecttolerance="10"
     gridtolerance="10"
     guidetolerance="10"
     inkscape:pageopacity="0"
     inkscape:pageshadow="2"
     inkscape:window-width="1601"
     inkscape:window-height="1127"
     id="namedview3434"
     showgrid="false"
     inkscape:zoom="0.95024317"
     inkscape:cx="372.04724"
     inkscape:cy="526.1811"
     inkscape:window-x="-2"
     inkscape:window-y="-2"
     inkscape:window-maximized="1"
     inkscape:current-layer="svg3434" />
  <defs
     id="defs3436" />
  <metadata
     id="metadata3439">
    <rdf:RDF>
      <cc:Work
         rdf:about="">
        <dc:format>image/svg+xml</dc:format>
        <dc:type
           rdf:resource="http://purl.org/dc/dcmitype/StillImage" />
        <dc:title />
      </cc:Work>
    </rdf:RDF>
  </metadata>
  <rect
     style="opacity:1;fill:none;fill-opacity:1;stroke:#000000;stroke-width:1;stroke-linecap:round;stroke-linejoin:bevel;stroke-miterlimit:4;stroke-dasharray:none;stroke-dashoffset:0;stroke-opacity:1"
     id="rect3517"
     width="458.82993"
     height="287.29489"
     x="184.68701"
     y="89.555511" />
  <path
     inkscape:connector-curvature="0"
     style="fill:none"
     d="m 299.06651,237.4663 -0.32921,-0.57613 -27.48971,0 -0.32922,0.57613 c 0,0 0,0.0823 -0.0823,0.0823 l -5.92593,9.30041 40,0 -5.92592,-9.30041 c 0.0823,0 0.0823,0 0.0823,-0.0823 z m -10.28806,6.00823 -7.65432,0 c -0.65844,0 -1.23457,-0.57613 -1.23457,-1.23457 0,-0.65843 0.57613,-1.23456 1.23457,-1.23456 l 7.65432,0 c 0.65844,0 1.23457,0.57613 1.23457,1.23456 0,0.65844 -0.49383,1.23457 -1.23457,1.23457 z"
     id="path3398" />
  <path
     inkscape:connector-curvature="0"
     style="fill:none"
     d="m 298.40808,234.50334 c 0,-4.69136 0.0823,-19.50617 0.0823,-19.50617 l -26.91358,0 c 0,0 0.0823,14.81481 0.0823,19.50617 l 26.74897,0 z"
     id="path3400" />
  <path
     inkscape:connector-curvature="0"
     style="fill:none;stroke:#000000;stroke-width:2.46913576;stroke-linecap:round;stroke-linejoin:round;stroke-miterlimit:10"
     stroke-miterlimit="10"
     d="m 307.21466,212.77494 c 0,-3.53909 -2.88066,-6.50205 -6.50205,-6.50205"
     id="path3406" />
  <path
     inkscape:connector-curvature="0"
     style="fill:none;stroke:#000000;stroke-width:2.46913576;stroke-linecap:round;stroke-linejoin:round;stroke-miterlimit:10"
     stroke-miterlimit="10"
     d="m 312.64676,212.77494 c 0,-6.58436 -5.34979,-11.93415 -11.93415,-11.93415"
     id="path3408" />
  <path
     inkscape:connector-curvature="0"
     style="fill:none"
     d="m 446.12287,322.91136 -0.32921,-0.57613 -27.48972,0 -0.32921,0.57613 c 0,0 0,0.0823 -0.0823,0.0823 l -5.92593,9.30041 40,0 -5.92593,-9.30041 c 0.0823,0 0.0823,0 0.0823,-0.0823 z m -10.28806,6.00823 -7.65432,0 c -0.65844,0 -1.23457,-0.57613 -1.23457,-1.23457 0,-0.65843 0.57613,-1.23456 1.23457,-1.23456 l 7.65432,0 c 0.65843,0 1.23457,0.57613 1.23457,1.23456 0,0.65844 -0.49383,1.23457 -1.23457,1.23457 z"
     id="path3398-4" />
  <path
     inkscape:connector-curvature="0"
     style="fill:none"
     d="m 445.46444,319.9484 c 0,-4.69136 0.0823,-19.50617 0.0823,-19.50617 l -26.91358,0 c 0,0 0.0823,14.81481 0.0823,19.50617 l 26.74897,0 z"
     id="path3400-7" />
  <path
     inkscape:connector-curvature="0"
     style="fill:none;stroke:#000000;stroke-width:2.46913576;stroke-linecap:round;stroke-linejoin:round;stroke-miterlimit:10"
     stroke-miterlimit="10"
     d="m 454.27102,298.22 c 0,-3.53909 -2.88066,-6.50205 -6.50206,-6.50205"
     id="path3406-0" />
  <path
     inkscape:connector-curvature="0"
     style="fill:none;stroke:#000000;stroke-width:2.46913576;stroke-linecap:round;stroke-linejoin:round;stroke-miterlimit:10"
     stroke-miterlimit="10"
     d="m 459.70312,298.22 c 0,-6.58436 -5.34979,-11.93415 -11.93416,-11.93415"
     id="path3408-7" />
  <path
     inkscape:connector-curvature="0"
     style="fill:none"
     d="m 547.64818,161.83852 -0.32922,-0.57613 -27.48971,0 -0.32922,0.57613 c 0,0 0,0.0823 -0.0823,0.0823 l -5.92592,9.30041 40,0 -5.92593,-9.30041 c 0.0823,0 0.0823,0 0.0823,-0.0823 z m -10.28807,6.00823 -7.65432,0 c -0.65843,0 -1.23457,-0.57613 -1.23457,-1.23457 0,-0.65843 0.57614,-1.23456 1.23457,-1.23456 l 7.65432,0 c 0.65844,0 1.23457,0.57613 1.23457,1.23456 0,0.65844 -0.49383,1.23457 -1.23457,1.23457 z"
     id="path3398-6" />
  <path
     inkscape:connector-curvature="0"
     style="fill:none"
     d="m 546.98974,158.87556 c 0,-4.69136 0.0823,-19.50617 0.0823,-19.50617 l -26.91358,0 c 0,0 0.0823,14.81481 0.0823,19.50617 l 26.74897,0 z"
     id="path3400-5" />
  <path
     inkscape:connector-curvature="0"
     style="fill:none;stroke:#000000;stroke-width:2.46913576;stroke-linecap:round;stroke-linejoin:round;stroke-miterlimit:10"
     stroke-miterlimit="10"
     d="m 555.79633,137.14716 c 0,-3.53909 -2.88066,-6.50205 -6.50206,-6.50205"
     id="path3406-6" />
  <path
     inkscape:connector-curvature="0"
     style="fill:none;stroke:#000000;stroke-width:2.46913576;stroke-linecap:round;stroke-linejoin:round;stroke-miterlimit:10"
     stroke-miterlimit="10"
     d="m 561.22843,137.14716 c 0,-6.58436 -5.3498,-11.93415 -11.93416,-11.93415"
     id="path3408-0" />
  <path
     inkscape:connector-curvature="0"
     style="fill:none;fill-rule:evenodd;stroke:#000000;stroke-width:1px;stroke-linecap:butt;stroke-linejoin:miter;stroke-opacity:1"
     d="M 334.65118,228.3626 494.61024,172.5874"
     id="path3509" />
  <path
     inkscape:connector-curvature="0"
     style="fill:none;fill-rule:evenodd;stroke:#000000;stroke-width:1px;stroke-linecap:butt;stroke-linejoin:miter;stroke-opacity:1"
     d="m 334.65118,271.50945 54.72284,32.62323"
     id="path3511" />
  <path
     inkscape:connector-curvature="0"
     style="fill:none;fill-rule:evenodd;stroke:#000000;stroke-width:1px;stroke-linecap:butt;stroke-linejoin:miter;stroke-opacity:1"
     d="m 472.51063,277.82362 52.61811,-77.8748"
     id="path3515" />
  <path
     inkscape:connector-curvature="0"
     d="m 290.55834,236.19529 c 0,0.59259 -0.44444,1.03704 -1.03704,1.03704 -0.59259,0 -1.03703,-0.44445 -1.03703,-1.03704 0,-0.59259 0.44444,-1.03703 1.03703,-1.03703 0.5926,0 1.03704,0.44444 1.03704,1.03703 z"
     id="path4523" />
  <path
     inkscape:connector-curvature="0"
     d="m 292.41019,235.15826 c 0,0.22222 -0.14815,0.37037 -0.37037,0.37037 -0.22222,0 -0.37037,-0.14815 -0.37037,-0.37037 0,-0.22223 0.14815,-0.37038 0.37037,-0.37038 0.22222,0 0.37037,0.14815 0.37037,0.37038 z"
     id="path4525" />
  <path
     inkscape:connector-curvature="0"
     d="m 325.07686,222.04714 -5.55556,0.2963 c -0.44444,0 -0.81481,0 -1.25926,0 l 0,-0.2963 -1.03703,0 0,0.37037 c -0.44445,0 -0.88889,0 -1.25926,0 l -5.55556,-0.37037 c -0.44444,0 -0.81481,0.37037 -0.81481,0.81482 0,0.44444 0.37037,0.81481 0.81481,0.81481 l 5.70371,-0.29629 c 0.37037,0 0.74074,0 1.11111,0 l 0,2.74074 -0.81482,0 0,1.85185 -13.48148,0 c 0,0 0,-0.0741 0,-0.0741 0,-0.0741 0,-0.14815 -0.0741,-0.22223 0,0 0,0 0,0 -0.0741,-0.14814 -0.14814,-0.22222 -0.22222,-0.37037 -0.0741,-0.0741 -0.0741,-0.14814 -0.14814,-0.22222 -0.0741,-0.0741 -0.14815,-0.14815 -0.22223,-0.22222 -0.0741,-0.0741 -0.22222,-0.14815 -0.29629,-0.22222 -0.0741,-0.0741 -0.14815,-0.0741 -0.22222,-0.0741 -0.14815,-0.0741 -0.2963,-0.14815 -0.44445,-0.14815 -0.22222,-0.0741 -0.44444,-0.0741 -0.74074,-0.0741 l -4.66667,0 c -0.66666,-0.59259 -2.88888,-1.03704 -5.55555,-1.03704 -2.66667,0 -4.88889,0.44445 -5.55556,1.03704 l -4.66666,0 c -0.22223,0 -0.51852,0 -0.74074,0.0741 -0.14815,0 -0.22223,0.0741 -0.2963,0.14815 -0.14815,0.0741 -0.22222,0.0741 -0.37037,0.14815 -0.0741,0.0741 -0.14815,0.14815 -0.2963,0.22222 -0.0741,0.0741 -0.22222,0.14815 -0.29629,0.22223 -0.0741,0.0741 -0.0741,0.14814 -0.14815,0.22222 -0.0741,0.0741 -0.14815,0.22222 -0.22222,0.37037 0,0 0,0 0,0 -0.0741,0.0741 -0.0741,0.14815 -0.0741,0.29629 0,0 0,0 0,0 l -13.11111,0 0,-1.85185 -0.88889,0 0,-2.74074 c 0.37037,0 0.74074,0 1.11111,0 l 5.7037,0.2963 c 0.44445,0 0.81482,-0.37037 0.81482,-0.81482 0,-0.44444 -0.37037,-0.81481 -0.81482,-0.81481 l -5.55556,0.29629 c -0.44444,0 -0.88889,0 -1.25926,0 l 0,-0.37037 -1.03703,0 0,0.37037 c -0.44445,0 -0.81482,0 -1.25926,0 l -5.48148,-0.37037 c -0.44445,0 -0.81482,0.37037 -0.81482,0.81482 0,0.44444 0.37037,0.81481 0.81482,0.81481 l 5.7037,-0.29629 c 0.37037,0 0.74074,0 1.11111,0 l 0,2.74074 -0.88889,0 0,4.44444 2.74074,0 0,-1.11111 12.96296,0 c 0,0 0,0 0,0 0,0.0741 0,0.22222 0.0741,0.37037 0,0.0741 0.0741,0.22222 0.14815,0.2963 0.0741,0.14815 0.0741,0.22222 0.14815,0.29629 l 0.66667,0.88889 c -3.25926,3.48148 -3.62963,4 -3.62963,8.2963 0,2.88889 0.81481,5.62963 2.22222,7.33333 0.14815,0.22222 0.44444,0.2963 0.66667,0.2963 0.22222,0 0.37037,-0.0741 0.59259,-0.22222 0.37037,-0.2963 0.44444,-0.88889 0.14815,-1.25926 -1.11111,-1.33334 -1.77778,-3.70371 -1.77778,-6.22222 0,-3.48149 0.0741,-3.70371 2.88889,-6.74075 l 0.88889,1.25926 c 0.51852,0.66667 1.25926,1.11112 2.14815,1.11112 l 1.11111,0 c 0.14815,-0.44445 0.37037,-0.81482 0.74074,-1.18519 0.96296,-1.11111 2.74074,-1.85185 4.81482,-2 l 0,0.88889 c -1.85186,0.37037 -3.25926,1.7037 -3.25926,3.25926 0,1.85185 1.85185,3.33333 4.14814,3.33333 2.2963,0 4.14815,-1.48148 4.14815,-3.33333 0,-1.62963 -1.4074,-2.96296 -3.18518,-3.25926 l 0,-0.88889 c 2.07407,0.14815 3.85185,0.96296 4.81481,2 0.2963,0.37037 0.59259,0.74074 0.66667,1.18519 l 1.18518,0 c 0.81482,0 1.62963,-0.37038 2.14815,-1.11112 l 0.81482,-1.11111 c 2.81481,3.03704 2.81481,3.25926 2.81481,6.66667 0,2.51852 -0.66666,4.81481 -1.77778,6.22222 -0.29629,0.37037 -0.22222,0.96296 0.14815,1.25926 0.14815,0.14815 0.37037,0.22222 0.59259,0.22222 0.22223,0 0.51852,-0.0741 0.66667,-0.29629 1.33333,-1.70371 2.14815,-4.44445 2.14815,-7.33334 0,-4.22222 -0.44444,-4.74074 -3.55556,-8.14814 l 0.74074,-1.03704 c 0.0741,-0.14815 0.14815,-0.22222 0.14815,-0.37037 0.0741,-0.0741 0.0741,-0.14815 0.14815,-0.2963 0.0741,-0.14815 0.0741,-0.22222 0.0741,-0.37037 l 13.33333,0 0,1.11111 2.81482,0 0,-4.44444 -0.96296,0 0,-2.74074 c 0.37037,0 0.74074,0 1.11111,0 l 5.7037,0.29629 c 0.44444,0 0.81482,-0.37037 0.81482,-0.81481 0.0741,-0.44445 -0.2963,-0.81482 -0.74074,-0.81482 z m -33.03704,12.51852 c 0.2963,0 0.5926,0.2963 0.5926,0.5926 0,0.29629 -0.22223,0.59259 -0.5926,0.59259 -0.29629,0 -0.59259,-0.22222 -0.59259,-0.59259 0,-0.37038 0.2963,-0.5926 0.59259,-0.5926 z m -2.44444,3.18519 c -0.88889,0 -1.55556,-0.74074 -1.55556,-1.55556 0,-0.88889 0.74074,-1.55555 1.55556,-1.55555 0.88889,0 1.55555,0.74074 1.55555,1.55555 0,0.81482 -0.74074,1.55556 -1.55555,1.55556 z"
     id="path4527"
     style="fill:#fa6900;fill-opacity:1" />
  <path
     inkscape:connector-curvature="0"
     d="m 436.8367,317.22723 c 0,0.59259 -0.44444,1.03704 -1.03704,1.03704 -0.59259,0 -1.03703,-0.44445 -1.03703,-1.03704 0,-0.59259 0.44444,-1.03703 1.03703,-1.03703 0.5926,0 1.03704,0.44444 1.03704,1.03703 z"
     id="path4523-1" />
  <path
     inkscape:connector-curvature="0"
     d="m 438.68855,316.1902 c 0,0.22222 -0.14815,0.37037 -0.37037,0.37037 -0.22222,0 -0.37037,-0.14815 -0.37037,-0.37037 0,-0.22223 0.14815,-0.37038 0.37037,-0.37038 0.22222,0 0.37037,0.14815 0.37037,0.37038 z"
     id="path4525-9" />
  <path
     inkscape:connector-curvature="0"
     d="m 471.35522,303.07908 -5.55556,0.2963 c -0.44444,0 -0.81481,0 -1.25926,0 l 0,-0.2963 -1.03703,0 0,0.37037 c -0.44445,0 -0.88889,0 -1.25926,0 l -5.55556,-0.37037 c -0.44444,0 -0.81481,0.37037 -0.81481,0.81482 0,0.44444 0.37037,0.81481 0.81481,0.81481 l 5.70371,-0.29629 c 0.37037,0 0.74074,0 1.11111,0 l 0,2.74074 -0.81482,0 0,1.85185 -13.48148,0 c 0,0 0,-0.0741 0,-0.0741 0,-0.0741 0,-0.14815 -0.0741,-0.22223 0,0 0,0 0,0 -0.0741,-0.14814 -0.14814,-0.22222 -0.22222,-0.37037 -0.0741,-0.0741 -0.0741,-0.14814 -0.14814,-0.22222 -0.0741,-0.0741 -0.14815,-0.14815 -0.22223,-0.22222 -0.0741,-0.0741 -0.22222,-0.14815 -0.29629,-0.22222 -0.0741,-0.0741 -0.14815,-0.0741 -0.22222,-0.0741 -0.14815,-0.0741 -0.2963,-0.14815 -0.44445,-0.14815 -0.22222,-0.0741 -0.44444,-0.0741 -0.74074,-0.0741 l -4.66667,0 c -0.66666,-0.59259 -2.88888,-1.03704 -5.55555,-1.03704 -2.66667,0 -4.88889,0.44445 -5.55556,1.03704 l -4.66666,0 c -0.22223,0 -0.51852,0 -0.74074,0.0741 -0.14815,0 -0.22223,0.0741 -0.2963,0.14815 -0.14815,0.0741 -0.22222,0.0741 -0.37037,0.14815 -0.0741,0.0741 -0.14815,0.14815 -0.2963,0.22222 -0.0741,0.0741 -0.22222,0.14815 -0.29629,0.22223 -0.0741,0.0741 -0.0741,0.14814 -0.14815,0.22222 -0.0741,0.0741 -0.14815,0.22222 -0.22222,0.37037 0,0 0,0 0,0 -0.0741,0.0741 -0.0741,0.14815 -0.0741,0.29629 0,0 0,0 0,0 l -13.11111,0 0,-1.85185 -0.88889,0 0,-2.74074 c 0.37037,0 0.74074,0 1.11111,0 l 5.7037,0.2963 c 0.44445,0 0.81482,-0.37037 0.81482,-0.81482 0,-0.44444 -0.37037,-0.81481 -0.81482,-0.81481 l -5.55556,0.29629 c -0.44444,0 -0.88889,0 -1.25926,0 l 0,-0.37037 -1.03703,0 0,0.37037 c -0.44445,0 -0.81482,0 -1.25926,0 l -5.48148,-0.37037 c -0.44445,0 -0.81482,0.37037 -0.81482,0.81482 0,0.44444 0.37037,0.81481 0.81482,0.81481 l 5.7037,-0.29629 c 0.37037,0 0.74074,0 1.11111,0 l 0,2.74074 -0.88889,0 0,4.44444 2.74074,0 0,-1.11111 12.96296,0 c 0,0 0,0 0,0 0,0.0741 0,0.22222 0.0741,0.37037 0,0.0741 0.0741,0.22222 0.14815,0.2963 0.0741,0.14815 0.0741,0.22222 0.14815,0.29629 l 0.66667,0.88889 c -3.25926,3.48148 -3.62963,4 -3.62963,8.2963 0,2.88889 0.81481,5.62963 2.22222,7.33333 0.14815,0.22222 0.44444,0.2963 0.66667,0.2963 0.22222,0 0.37037,-0.0741 0.59259,-0.22222 0.37037,-0.2963 0.44444,-0.88889 0.14815,-1.25926 -1.11111,-1.33334 -1.77778,-3.70371 -1.77778,-6.22222 0,-3.48149 0.0741,-3.70371 2.88889,-6.74075 l 0.88889,1.25926 c 0.51852,0.66667 1.25926,1.11112 2.14815,1.11112 l 1.11111,0 c 0.14815,-0.44445 0.37037,-0.81482 0.74074,-1.18519 0.96296,-1.11111 2.74074,-1.85185 4.81482,-2 l 0,0.88889 c -1.85186,0.37037 -3.25926,1.7037 -3.25926,3.25926 0,1.85185 1.85185,3.33333 4.14814,3.33333 2.2963,0 4.14815,-1.48148 4.14815,-3.33333 0,-1.62963 -1.4074,-2.96296 -3.18518,-3.25926 l 0,-0.88889 c 2.07407,0.14815 3.85185,0.96296 4.81481,2 0.2963,0.37037 0.59259,0.74074 0.66667,1.18519 l 1.18518,0 c 0.81482,0 1.62963,-0.37038 2.14815,-1.11112 l 0.81482,-1.11111 c 2.81481,3.03704 2.81481,3.25926 2.81481,6.66667 0,2.51852 -0.66666,4.81481 -1.77778,6.22222 -0.29629,0.37037 -0.22222,0.96296 0.14815,1.25926 0.14815,0.14815 0.37037,0.22222 0.59259,0.22222 0.22223,0 0.51852,-0.0741 0.66667,-0.29629 1.33333,-1.70371 2.14815,-4.44445 2.14815,-7.33334 0,-4.22222 -0.44444,-4.74074 -3.55556,-8.14814 l 0.74074,-1.03704 c 0.0741,-0.14815 0.14815,-0.22222 0.14815,-0.37037 0.0741,-0.0741 0.0741,-0.14815 0.14815,-0.2963 0.0741,-0.14815 0.0741,-0.22222 0.0741,-0.37037 l 13.33333,0 0,1.11111 2.81482,0 0,-4.44444 -0.96296,0 0,-2.74074 c 0.37037,0 0.74074,0 1.11111,0 l 5.7037,0.29629 c 0.44444,0 0.81482,-0.37037 0.81482,-0.81481 0.0741,-0.44445 -0.2963,-0.81482 -0.74074,-0.81482 z m -33.03704,12.51852 c 0.2963,0 0.5926,0.2963 0.5926,0.5926 0,0.29629 -0.22223,0.59259 -0.5926,0.59259 -0.29629,0 -0.59259,-0.22222 -0.59259,-0.59259 0,-0.37038 0.2963,-0.5926 0.59259,-0.5926 z m -2.44444,3.18519 c -0.88889,0 -1.55556,-0.74074 -1.55556,-1.55556 0,-0.88889 0.74074,-1.55555 1.55556,-1.55555 0.88889,0 1.55555,0.74074 1.55555,1.55555 0,0.81482 -0.74074,1.55556 -1.55555,1.55556 z"
     id="path4527-8"
     style="fill:#fa6900;fill-opacity:1" />
  <path
     inkscape:connector-curvature="0"
     style="fill:none"
     d="m 545.10983,160.53919 -0.32921,-0.57613 -27.48971,0 -0.32922,0.57613 c 0,0 0,0.0823 -0.0823,0.0823 l -5.92593,9.30041 40,0 -5.92592,-9.30041 c 0.0823,0 0.0823,0 0.0823,-0.0823 z m -10.28806,6.00823 -7.65432,0 c -0.65844,0 -1.23457,-0.57613 -1.23457,-1.23457 0,-0.65843 0.57613,-1.23456 1.23457,-1.23456 l 7.65432,0 c 0.65844,0 1.23457,0.57613 1.23457,1.23456 0,0.65844 -0.49383,1.23457 -1.23457,1.23457 z"
     id="path3398-7" />
  <path
     inkscape:connector-curvature="0"
     d="m 536.60166,159.26818 c 0,0.59259 -0.44444,1.03704 -1.03704,1.03704 -0.59259,0 -1.03703,-0.44445 -1.03703,-1.03704 0,-0.59259 0.44444,-1.03703 1.03703,-1.03703 0.5926,0 1.03704,0.44444 1.03704,1.03703 z"
     id="path4523-4" />
  <path
     inkscape:connector-curvature="0"
     d="m 538.45351,158.23115 c 0,0.22222 -0.14815,0.37037 -0.37037,0.37037 -0.22222,0 -0.37037,-0.14815 -0.37037,-0.37037 0,-0.22223 0.14815,-0.37038 0.37037,-0.37038 0.22222,0 0.37037,0.14815 0.37037,0.37038 z"
     id="path4525-95" />
  <path
     inkscape:connector-curvature="0"
     d="m 571.12018,145.12003 -5.55556,0.2963 c -0.44444,0 -0.81481,0 -1.25926,0 l 0,-0.2963 -1.03703,0 0,0.37037 c -0.44445,0 -0.88889,0 -1.25926,0 l -5.55556,-0.37037 c -0.44444,0 -0.81481,0.37037 -0.81481,0.81482 0,0.44444 0.37037,0.81481 0.81481,0.81481 l 5.70371,-0.29629 c 0.37037,0 0.74074,0 1.11111,0 l 0,2.74074 -0.81482,0 0,1.85185 -13.48148,0 c 0,0 0,-0.0741 0,-0.0741 0,-0.0741 0,-0.14815 -0.0741,-0.22223 0,0 0,0 0,0 -0.0741,-0.14814 -0.14814,-0.22222 -0.22222,-0.37037 -0.0741,-0.0741 -0.0741,-0.14814 -0.14814,-0.22222 -0.0741,-0.0741 -0.14815,-0.14815 -0.22223,-0.22222 -0.0741,-0.0741 -0.22222,-0.14815 -0.29629,-0.22222 -0.0741,-0.0741 -0.14815,-0.0741 -0.22222,-0.0741 -0.14815,-0.0741 -0.2963,-0.14815 -0.44445,-0.14815 -0.22222,-0.0741 -0.44444,-0.0741 -0.74074,-0.0741 l -4.66667,0 c -0.66666,-0.59259 -2.88888,-1.03704 -5.55555,-1.03704 -2.66667,0 -4.88889,0.44445 -5.55556,1.03704 l -4.66666,0 c -0.22223,0 -0.51852,0 -0.74074,0.0741 -0.14815,0 -0.22223,0.0741 -0.2963,0.14815 -0.14815,0.0741 -0.22222,0.0741 -0.37037,0.14815 -0.0741,0.0741 -0.14815,0.14815 -0.2963,0.22222 -0.0741,0.0741 -0.22222,0.14815 -0.29629,0.22223 -0.0741,0.0741 -0.0741,0.14814 -0.14815,0.22222 -0.0741,0.0741 -0.14815,0.22222 -0.22222,0.37037 0,0 0,0 0,0 -0.0741,0.0741 -0.0741,0.14815 -0.0741,0.29629 0,0 0,0 0,0 l -13.11111,0 0,-1.85185 -0.88889,0 0,-2.74074 c 0.37037,0 0.74074,0 1.11111,0 l 5.7037,0.2963 c 0.44445,0 0.81482,-0.37037 0.81482,-0.81482 0,-0.44444 -0.37037,-0.81481 -0.81482,-0.81481 l -5.55556,0.29629 c -0.44444,0 -0.88889,0 -1.25926,0 l 0,-0.37037 -1.03703,0 0,0.37037 c -0.44445,0 -0.81482,0 -1.25926,0 l -5.48148,-0.37037 c -0.44445,0 -0.81482,0.37037 -0.81482,0.81482 0,0.44444 0.37037,0.81481 0.81482,0.81481 l 5.7037,-0.29629 c 0.37037,0 0.74074,0 1.11111,0 l 0,2.74074 -0.88889,0 0,4.44444 2.74074,0 0,-1.11111 12.96296,0 c 0,0 0,0 0,0 0,0.0741 0,0.22222 0.0741,0.37037 0,0.0741 0.0741,0.22222 0.14815,0.2963 0.0741,0.14815 0.0741,0.22222 0.14815,0.29629 l 0.66667,0.88889 c -3.25926,3.48148 -3.62963,4 -3.62963,8.2963 0,2.88889 0.81481,5.62963 2.22222,7.33333 0.14815,0.22222 0.44444,0.2963 0.66667,0.2963 0.22222,0 0.37037,-0.0741 0.59259,-0.22222 0.37037,-0.2963 0.44444,-0.88889 0.14815,-1.25926 -1.11111,-1.33334 -1.77778,-3.70371 -1.77778,-6.22222 0,-3.48149 0.0741,-3.70371 2.88889,-6.74075 l 0.88889,1.25926 c 0.51852,0.66667 1.25926,1.11112 2.14815,1.11112 l 1.11111,0 c 0.14815,-0.44445 0.37037,-0.81482 0.74074,-1.18519 0.96296,-1.11111 2.74074,-1.85185 4.81482,-2 l 0,0.88889 c -1.85186,0.37037 -3.25926,1.7037 -3.25926,3.25926 0,1.85185 1.85185,3.33333 4.14814,3.33333 2.2963,0 4.14815,-1.48148 4.14815,-3.33333 0,-1.62963 -1.4074,-2.96296 -3.18518,-3.25926 l 0,-0.88889 c 2.07407,0.14815 3.85185,0.96296 4.81481,2 0.2963,0.37037 0.59259,0.74074 0.66667,1.18519 l 1.18518,0 c 0.81482,0 1.62963,-0.37038 2.14815,-1.11112 l 0.81482,-1.11111 c 2.81481,3.03704 2.81481,3.25926 2.81481,6.66667 0,2.51852 -0.66666,4.81481 -1.77778,6.22222 -0.29629,0.37037 -0.22222,0.96296 0.14815,1.25926 0.14815,0.14815 0.37037,0.22222 0.59259,0.22222 0.22223,0 0.51852,-0.0741 0.66667,-0.29629 1.33333,-1.70371 2.14815,-4.44445 2.14815,-7.33334 0,-4.22222 -0.44444,-4.74074 -3.55556,-8.14814 l 0.74074,-1.03704 c 0.0741,-0.14815 0.14815,-0.22222 0.14815,-0.37037 0.0741,-0.0741 0.0741,-0.14815 0.14815,-0.2963 0.0741,-0.14815 0.0741,-0.22222 0.0741,-0.37037 l 13.33333,0 0,1.11111 2.81482,0 0,-4.44444 -0.96296,0 0,-2.74074 c 0.37037,0 0.74074,0 1.11111,0 l 5.7037,0.29629 c 0.44444,0 0.81482,-0.37037 0.81482,-0.81481 0.0741,-0.44445 -0.2963,-0.81482 -0.74074,-0.81482 z m -33.03704,12.51852 c 0.2963,0 0.5926,0.2963 0.5926,0.5926 0,0.29629 -0.22223,0.59259 -0.5926,0.59259 -0.29629,0 -0.59259,-0.22222 -0.59259,-0.59259 0,-0.37038 0.2963,-0.5926 0.59259,-0.5926 z m -2.44444,3.18519 c -0.88889,0 -1.55556,-0.74074 -1.55556,-1.55556 0,-0.88889 0.74074,-1.55555 1.55556,-1.55555 0.88889,0 1.55555,0.74074 1.55555,1.55555 0,0.81482 -0.74074,1.55556 -1.55555,1.55556 z"
     id="path4527-7"
     style="fill:#fa6900;fill-opacity:1" />
</svg>
