%!PS-Adobe-3.0 EPSF-3.0
%%Creator: cairo 1.14.2 (http://cairographics.org)
%%CreationDate: Wed Apr 29 14:15:04 2015
%%Pages: 1
%%DocumentData: Clean7Bit
%%LanguageLevel: 2
%%BoundingBox: 13 26 67 54
%%EndComments
%%BeginProlog
save
50 dict begin
/q { gsave } bind def
/Q { grestore } bind def
/cm { 6 array astore concat } bind def
/w { setlinewidth } bind def
/J { setlinecap } bind def
/j { setlinejoin } bind def
/M { setmiterlimit } bind def
/d { setdash } bind def
/m { moveto } bind def
/l { lineto } bind def
/c { curveto } bind def
/h { closepath } bind def
/re { exch dup neg 3 1 roll 5 3 roll moveto 0 rlineto
      0 exch rlineto 0 rlineto closepath } bind def
/S { stroke } bind def
/f { fill } bind def
/f* { eofill } bind def
/n { newpath } bind def
/W { clip } bind def
/W* { eoclip } bind def
/BT { } bind def
/ET { } bind def
/pdfmark where { pop globaldict /?pdfmark /exec load put }
    { globaldict begin /?pdfmark /pop load def /pdfmark
    /cleartomark load def end } ifelse
/BDC { mark 3 1 roll /BDC pdfmark } bind def
/EMC { mark /EMC pdfmark } bind def
/cairo_store_point { /cairo_point_y exch def /cairo_point_x exch def } def
/Tj { show currentpoint cairo_store_point } bind def
/TJ {
  {
    dup
    type /stringtype eq
    { show } { -0.001 mul 0 cairo_font_matrix dtransform rmoveto } ifelse
  } forall
  currentpoint cairo_store_point
} bind def
/cairo_selectfont { cairo_font_matrix aload pop pop pop 0 0 6 array astore
    cairo_font exch selectfont cairo_point_x cairo_point_y moveto } bind def
/Tf { pop /cairo_font exch def /cairo_font_matrix where
      { pop cairo_selectfont } if } bind def
/Td { matrix translate cairo_font_matrix matrix concatmatrix dup
      /cairo_font_matrix exch def dup 4 get exch 5 get cairo_store_point
      /cairo_font where { pop cairo_selectfont } if } bind def
/Tm { 2 copy 8 2 roll 6 array astore /cairo_font_matrix exch def
      cairo_store_point /cairo_font where { pop cairo_selectfont } if } bind def
/g { setgray } bind def
/rg { setrgbcolor } bind def
/d1 { setcachedevice } bind def
%%EndProlog
%%BeginSetup
%%EndSetup
%%Page: 1 1
%%BeginPageSetup
%%PageBoundingBox: 13 26 67 54
%%EndPageSetup
q 13 26 54 28 rectclip q
0 g
34.547 35.734 m 34.371 35.555 l 33.363 34.547 32.77 33.125 32.77 31.645
 c 32.77 28.562 35.32 26.016 38.398 26.016 c 39.941 26.016 41.305 26.605
 42.312 27.613 c 42.488 27.852 l 60.742 53.984 l h
38.34 28.918 m 36.742 28.918 35.438 30.223 35.438 31.82 c 35.438 33.422
 36.742 34.727 38.34 34.727 c 39.941 34.727 41.246 33.422 41.246 31.82 c
 41.246 30.223 39.941 28.918 38.34 28.918 c h
38.34 28.918 m f
57.363 47.348 m 53.512 41.836 l 57.48 38.164 59.969 32.949 59.969 27.199
 c 66.605 27.199 l 66.605 35.258 62.992 42.43 57.363 47.348 c h
57.363 47.348 m f
40 53.809 m 25.305 53.809 13.395 41.895 13.395 27.199 c 20.031 27.199 l
 20.031 38.164 28.977 47.109 40 47.109 c 42.605 47.109 45.035 46.637 47.348
 45.688 c 53.57 50.074 l 49.602 52.445 44.977 53.809 40 53.809 c h
40 53.809 m f
Q Q
showpage
%%Trailer
end restore
%%EOF
