%!PS-Adobe-3.0 EPSF-3.0
%%Creator: cairo 1.14.6 (http://cairographics.org)
%%CreationDate: Wed Mar 16 11:21:13 2016
%%Pages: 1
%%DocumentData: Clean7Bit
%%LanguageLevel: 2
%%BoundingBox: 0 -1 54 39
%%EndComments
%%BeginProlog
save
50 dict begin
/q { gsave } bind def
/Q { grestore } bind def
/cm { 6 array astore concat } bind def
/w { setlinewidth } bind def
/J { setlinecap } bind def
/j { setlinejoin } bind def
/M { setmiterlimit } bind def
/d { setdash } bind def
/m { moveto } bind def
/l { lineto } bind def
/c { curveto } bind def
/h { closepath } bind def
/re { exch dup neg 3 1 roll 5 3 roll moveto 0 rlineto
      0 exch rlineto 0 rlineto closepath } bind def
/S { stroke } bind def
/f { fill } bind def
/f* { eofill } bind def
/n { newpath } bind def
/W { clip } bind def
/W* { eoclip } bind def
/BT { } bind def
/ET { } bind def
/pdfmark where { pop globaldict /?pdfmark /exec load put }
    { globaldict begin /?pdfmark /pop load def /pdfmark
    /cleartomark load def end } ifelse
/BDC { mark 3 1 roll /BDC pdfmark } bind def
/EMC { mark /EMC pdfmark } bind def
/cairo_store_point { /cairo_point_y exch def /cairo_point_x exch def } def
/Tj { show currentpoint cairo_store_point } bind def
/TJ {
  {
    dup
    type /stringtype eq
    { show } { -0.001 mul 0 cairo_font_matrix dtransform rmoveto } ifelse
  } forall
  currentpoint cairo_store_point
} bind def
/cairo_selectfont { cairo_font_matrix aload pop pop pop 0 0 6 array astore
    cairo_font exch selectfont cairo_point_x cairo_point_y moveto } bind def
/Tf { pop /cairo_font exch def /cairo_font_matrix where
      { pop cairo_selectfont } if } bind def
/Td { matrix translate cairo_font_matrix matrix concatmatrix dup
      /cairo_font_matrix exch def dup 4 get exch 5 get cairo_store_point
      /cairo_font where { pop cairo_selectfont } if } bind def
/Tm { 2 copy 8 2 roll 6 array astore /cairo_font_matrix exch def
      cairo_store_point /cairo_font where { pop cairo_selectfont } if } bind def
/g { setgray } bind def
/rg { setrgbcolor } bind def
/d1 { setcachedevice } bind def
%%EndProlog
%%BeginSetup
%%EndSetup
%%Page: 1 1
%%BeginPageSetup
%%PageBoundingBox: 0 -1 54 39
%%EndPageSetup
q 0 -1 54 40 rectclip q
0 g
50.371 -0.001 m 5.926 -0.001 l 5.273 -0.001 4.742 0.534 4.742 1.186 c 4.742
 1.776 l 4.742 2.429 5.273 2.964 5.926 2.964 c 6.34 2.964 6.754 2.726 6.934
 2.37 c 49.836 2.37 l 50.902 3.436 l 50.902 26.784 l 49.48 28.206 l 49.305
 28.444 49.184 28.741 49.184 29.038 c 49.184 36.147 l 7.109 36.147 l 7.109
 32.593 l 7.109 31.94 6.578 31.409 5.926 31.409 c 5.273 31.409 4.742 31.94
 4.742 32.593 c 4.742 37.335 l 4.742 37.983 5.273 38.519 5.926 38.519 c 
50.371 38.519 l 51.023 38.519 51.555 37.983 51.555 37.335 c 51.555 29.511
 l 52.977 28.089 l 53.215 27.851 53.332 27.554 53.332 27.261 c 53.332 2.964
 l 53.332 2.667 53.215 2.37 52.977 2.132 c 51.199 0.354 l 50.965 0.12 50.668
 -0.001 50.371 -0.001 c h
50.371 -0.001 m f
5.926 10.667 m 5.273 10.667 4.742 11.198 4.742 11.851 c 4.742 20.741 l 
4.742 21.394 5.273 21.925 5.926 21.925 c 6.578 21.925 7.109 21.394 7.109
 20.741 c 7.109 11.851 l 7.109 11.198 6.578 10.667 5.926 10.667 c h
5.926 10.667 m f
10.371 22.519 m 0.891 22.519 l 0.414 22.519 0 22.933 0 23.409 c 0 29.925
 l 0 30.401 0.414 30.815 0.891 30.815 c 10.371 30.815 l 10.844 30.815 11.258
 30.401 11.258 29.925 c 11.258 23.409 l 11.258 22.933 10.844 22.519 10.371
 22.519 c h
10.371 22.519 m f
12.148 3.554 m 3.852 3.554 l 3.379 3.554 2.965 3.972 2.965 4.444 c 2.965
 9.186 l 2.965 9.659 3.379 10.073 3.852 10.073 c 12.148 10.073 l 12.621 
10.073 13.035 9.659 13.035 9.186 c 13.035 4.444 l 13.035 3.972 12.621 3.554
 12.148 3.554 c h
12.148 3.554 m f
26.074 15.999 m 25.719 15.999 25.48 15.765 25.48 15.409 c 25.48 14.815 
l 26.668 14.815 l 26.668 15.409 l 26.668 15.765 26.43 15.999 26.074 15.999
 c h
26.074 15.999 m f
24.297 15.999 m 23.941 15.999 23.703 15.765 23.703 15.409 c 23.703 14.815
 l 24.891 14.815 l 24.891 15.409 l 24.891 15.765 24.652 15.999 24.297 15.999
 c h
24.297 15.999 m f
27.852 15.999 m 27.496 15.999 27.258 15.765 27.258 15.409 c 27.258 14.815
 l 28.445 14.815 l 28.445 15.409 l 28.445 15.765 28.207 15.999 27.852 15.999
 c h
27.852 15.999 m f
29.629 15.999 m 29.273 15.999 29.035 15.765 29.035 15.409 c 29.035 14.815
 l 30.223 14.815 l 30.223 15.409 l 30.223 15.765 29.984 15.999 29.629 15.999
 c h
29.629 15.999 m f
31.406 15.999 m 31.051 15.999 30.816 15.765 30.816 15.409 c 30.816 14.815
 l 32 14.815 l 32 15.409 l 32 15.765 31.762 15.999 31.406 15.999 c h
31.406 15.999 m f
33.184 15.999 m 32.828 15.999 32.594 15.765 32.594 15.409 c 32.594 14.815
 l 33.777 14.815 l 33.777 15.409 l 33.777 15.765 33.539 15.999 33.184 15.999
 c h
33.184 15.999 m f
34.965 15.999 m 34.605 15.999 34.371 15.765 34.371 15.409 c 34.371 14.815
 l 35.555 14.815 l 35.555 15.409 l 35.555 15.765 35.32 15.999 34.965 15.999
 c h
34.965 15.999 m f
36.742 15.999 m 36.387 15.999 36.148 15.765 36.148 15.409 c 36.148 14.815
 l 37.332 14.815 l 37.332 15.409 l 37.332 15.765 37.098 15.999 36.742 15.999
 c h
36.742 15.999 m f
0 0.678431 0 rg
38.52 15.999 m 38.164 15.999 37.926 15.765 37.926 15.409 c 37.926 14.815
 l 39.109 14.815 l 39.109 15.409 l 39.109 15.765 38.875 15.999 38.52 15.999
 c h
38.52 15.999 m f
40.297 15.999 m 39.941 15.999 39.703 15.765 39.703 15.409 c 39.703 14.815
 l 40.891 14.815 l 40.891 15.409 l 40.891 15.765 40.652 15.999 40.297 15.999
 c h
40.297 15.999 m f
42.074 15.999 m 41.719 15.999 41.48 15.765 41.48 15.409 c 41.48 14.815 
l 42.668 14.815 l 42.668 15.409 l 42.668 15.765 42.43 15.999 42.074 15.999
 c h
42.074 15.999 m f
43.852 15.999 m 43.496 15.999 43.258 15.765 43.258 15.409 c 43.258 14.815
 l 44.445 14.815 l 44.445 15.409 l 44.445 15.765 44.207 15.999 43.852 15.999
 c h
43.852 15.999 m f
45.629 15.999 m 45.273 15.999 45.035 15.765 45.035 15.409 c 45.035 14.815
 l 46.223 14.815 l 46.223 15.409 l 46.223 15.765 45.984 15.999 45.629 15.999
 c h
45.629 15.999 m f
0 g
47.406 15.999 m 47.051 15.999 46.816 15.765 46.816 15.409 c 46.816 14.815
 l 48 14.815 l 48 15.409 l 48 15.765 47.762 15.999 47.406 15.999 c h
47.406 15.999 m f
45.629 7.112 m 45.984 7.112 46.223 7.347 46.223 7.702 c 46.223 8.296 l 
45.035 8.296 l 45.035 7.702 l 45.035 7.347 45.273 7.112 45.629 7.112 c h
45.629 7.112 m f
47.406 7.112 m 47.762 7.112 48 7.347 48 7.702 c 48 8.296 l 46.816 8.296
 l 46.816 7.702 l 46.816 7.347 47.051 7.112 47.406 7.112 c h
47.406 7.112 m f
43.852 7.112 m 44.207 7.112 44.445 7.347 44.445 7.702 c 44.445 8.296 l 
43.258 8.296 l 43.258 7.702 l 43.258 7.347 43.496 7.112 43.852 7.112 c h
43.852 7.112 m f
42.074 7.112 m 42.43 7.112 42.668 7.347 42.668 7.702 c 42.668 8.296 l 41.48
 8.296 l 41.48 7.702 l 41.48 7.347 41.719 7.112 42.074 7.112 c h
42.074 7.112 m f
40.297 7.112 m 40.652 7.112 40.891 7.347 40.891 7.702 c 40.891 8.296 l 
39.703 8.296 l 39.703 7.702 l 39.703 7.347 39.941 7.112 40.297 7.112 c h
40.297 7.112 m f
38.52 7.112 m 38.875 7.112 39.109 7.347 39.109 7.702 c 39.109 8.296 l 37.926
 8.296 l 37.926 7.702 l 37.926 7.347 38.164 7.112 38.52 7.112 c h
38.52 7.112 m f
0 0.678431 0 rg
36.742 7.112 m 37.098 7.112 37.332 7.347 37.332 7.702 c 37.332 8.296 l 
36.148 8.296 l 36.148 7.702 l 36.148 7.347 36.387 7.112 36.742 7.112 c h
36.742 7.112 m f
34.965 7.112 m 35.32 7.112 35.555 7.347 35.555 7.702 c 35.555 8.296 l 34.371
 8.296 l 34.371 7.702 l 34.371 7.347 34.605 7.112 34.965 7.112 c h
34.965 7.112 m f
33.184 7.112 m 33.539 7.112 33.777 7.347 33.777 7.702 c 33.777 8.296 l 
32.594 8.296 l 32.594 7.702 l 32.594 7.347 32.828 7.112 33.184 7.112 c h
33.184 7.112 m f
31.406 7.112 m 31.762 7.112 32 7.347 32 7.702 c 32 8.296 l 30.816 8.296
 l 30.816 7.702 l 30.816 7.347 31.051 7.112 31.406 7.112 c h
31.406 7.112 m f
29.629 7.112 m 29.984 7.112 30.223 7.347 30.223 7.702 c 30.223 8.296 l 
29.035 8.296 l 29.035 7.702 l 29.035 7.347 29.273 7.112 29.629 7.112 c h
29.629 7.112 m f
27.852 7.112 m 28.207 7.112 28.445 7.347 28.445 7.702 c 28.445 8.296 l 
27.258 8.296 l 27.258 7.702 l 27.258 7.347 27.496 7.112 27.852 7.112 c h
27.852 7.112 m f
26.074 7.112 m 26.43 7.112 26.668 7.347 26.668 7.702 c 26.668 8.296 l 25.48
 8.296 l 25.48 7.702 l 25.48 7.347 25.719 7.112 26.074 7.112 c h
26.074 7.112 m f
24.297 7.112 m 24.652 7.112 24.891 7.347 24.891 7.702 c 24.891 8.296 l 
23.703 8.296 l 23.703 7.702 l 23.703 7.347 23.941 7.112 24.297 7.112 c h
24.297 7.112 m f
0 g
48.594 14.222 m 23.109 14.222 l 22.754 14.222 22.52 13.983 22.52 13.628
 c 22.52 9.483 l 22.52 9.124 22.754 8.89 23.109 8.89 c 48.594 8.89 l 48.949
 8.89 49.184 9.124 49.184 9.483 c 49.184 13.628 l 49.184 13.983 48.949 14.222
 48.594 14.222 c h
48.594 10.37 m 47.941 10.37 47.406 10.905 47.406 11.554 c 47.406 12.206
 47.941 12.741 48.594 12.741 c h
48.594 10.37 m f
0 0.678431 0 rg
17.895 26.608 m 17.895 21.452 25.008 19.495 28.504 24.769 c 32.117 19.319
 38.934 21.628 38.934 26.608 c 38.934 31.585 32.18 34.015 28.504 28.444 
c 25.066 33.956 17.895 31.765 17.895 26.608 c h
19.793 26.608 m 19.793 30.339 25.066 31.526 27.496 26.608 c 25.008 21.925
 19.793 22.874 19.793 26.608 c h
29.57 26.608 m 31.762 31.585 37.215 30.222 37.156 26.608 c 37.156 22.991
 31.703 21.866 29.57 26.608 c h
29.57 26.608 m f*
0 g
21.75 27.14 3.141 -1.008 re f*
32.059 27.198 m 33.125 27.198 l 33.125 28.269 l 34.191 28.269 l 34.191 
27.198 l 35.199 27.198 l 35.199 26.132 l 34.191 26.132 l 34.191 25.124 l
 33.125 25.124 l 33.125 26.132 l 32.059 26.132 l h
32.059 27.198 m f*
Q Q
showpage
%%Trailer
end restore
%%EOF
