%!PS-Adobe-3.0 EPSF-3.0
%%Creator: cairo 1.14.2 (http://cairographics.org)
%%CreationDate: Wed Apr 29 14:15:22 2015
%%Pages: 1
%%DocumentData: Clean7Bit
%%LanguageLevel: 2
%%BoundingBox: 15 11 65 69
%%EndComments
%%BeginProlog
save
50 dict begin
/q { gsave } bind def
/Q { grestore } bind def
/cm { 6 array astore concat } bind def
/w { setlinewidth } bind def
/J { setlinecap } bind def
/j { setlinejoin } bind def
/M { setmiterlimit } bind def
/d { setdash } bind def
/m { moveto } bind def
/l { lineto } bind def
/c { curveto } bind def
/h { closepath } bind def
/re { exch dup neg 3 1 roll 5 3 roll moveto 0 rlineto
      0 exch rlineto 0 rlineto closepath } bind def
/S { stroke } bind def
/f { fill } bind def
/f* { eofill } bind def
/n { newpath } bind def
/W { clip } bind def
/W* { eoclip } bind def
/BT { } bind def
/ET { } bind def
/pdfmark where { pop globaldict /?pdfmark /exec load put }
    { globaldict begin /?pdfmark /pop load def /pdfmark
    /cleartomark load def end } ifelse
/BDC { mark 3 1 roll /BDC pdfmark } bind def
/EMC { mark /EMC pdfmark } bind def
/cairo_store_point { /cairo_point_y exch def /cairo_point_x exch def } def
/Tj { show currentpoint cairo_store_point } bind def
/TJ {
  {
    dup
    type /stringtype eq
    { show } { -0.001 mul 0 cairo_font_matrix dtransform rmoveto } ifelse
  } forall
  currentpoint cairo_store_point
} bind def
/cairo_selectfont { cairo_font_matrix aload pop pop pop 0 0 6 array astore
    cairo_font exch selectfont cairo_point_x cairo_point_y moveto } bind def
/Tf { pop /cairo_font exch def /cairo_font_matrix where
      { pop cairo_selectfont } if } bind def
/Td { matrix translate cairo_font_matrix matrix concatmatrix dup
      /cairo_font_matrix exch def dup 4 get exch 5 get cairo_store_point
      /cairo_font where { pop cairo_selectfont } if } bind def
/Tm { 2 copy 8 2 roll 6 array astore /cairo_font_matrix exch def
      cairo_store_point /cairo_font where { pop cairo_selectfont } if } bind def
/g { setgray } bind def
/rg { setrgbcolor } bind def
/d1 { setcachedevice } bind def
%%EndProlog
%%BeginSetup
%%EndSetup
%%Page: 1 1
%%BeginPageSetup
%%PageBoundingBox: 15 11 65 69
%%EndPageSetup
q 15 11 50 58 rectclip q
0 g
64.105 21.789 m 56.703 21.789 l 58.062 23.148 l 59.672 22.941 61.336 22.836
 63.059 22.836 c 63.059 24.926 l 54.453 24.926 47.383 27.695 42.047 33.156
 c 34.914 40.461 32.25 51.172 31.258 58.512 c 31.41 58.664 l 31.211 58.863
 l 30.617 63.43 30.668 66.609 30.672 66.691 c 28.582 66.742 l 28.574 66.418
 28.523 63.465 29.023 59.23 c 27.535 57.746 l 27.535 68.805 l 25.445 68.805
 l 25.445 21.789 l 15.895 21.789 l 15.895 19.703 l 25.445 19.703 l 25.445
 11.195 l 27.535 11.195 l 27.535 19.703 l 64.105 19.703 l h
53.746 21.789 m 50.434 21.789 l 52.891 24.25 l 53.754 23.992 54.637 23.77
 55.539 23.582 c h
48.734 25.84 m 49.371 25.539 50.02 25.254 50.688 25 c 47.695 22.008 l 47.91
 21.789 l 44.688 21.789 l h
41.73 21.789 m 38.418 21.789 l 44.766 28.141 l 45.426 27.68 46.102 27.254
 46.797 26.855 c h
43.078 29.406 m 35.68 22.008 l 35.895 21.789 l 32.148 21.789 l 41.316 30.957
 l 41.887 30.41 42.473 29.895 43.078 29.406 c h
32.73 44.133 m 27.539 38.941 l 27.539 42.688 l 27.754 42.469 l 31.832 46.547
 l 32.105 45.746 32.406 44.938 32.73 44.133 c h
27.539 45.211 m 27.539 48.523 l 30.422 51.406 l 30.633 50.551 30.863 49.676
 31.125 48.793 c h
27.539 36.418 m 27.754 36.203 l 33.613 42.062 l 33.957 41.316 34.32 40.574
 34.707 39.84 c 27.539 32.672 l h
27.539 29.715 m 35.773 37.953 l 36.184 37.27 36.617 36.602 37.074 35.941
 c 27.539 26.402 l h
29.379 56.633 m 29.523 55.73 29.688 54.793 29.883 53.824 c 27.539 51.477
 l 27.539 54.793 l h
27.539 23.449 m 38.328 34.238 l 38.809 33.625 39.324 33.031 39.855 32.449
 c 29.195 21.789 l 27.539 21.789 l h
27.539 23.449 m f
42.164 38.602 m 42.457 38.746 42.758 38.969 43.066 39.273 c 43.375 39.574
 43.664 39.969 43.934 40.461 c 44.207 40.949 44.398 41.562 44.516 42.305
 c 45.52 48.66 l 47.258 48.66 l 47.414 48.934 47.469 49.207 47.414 49.477
 c 45.676 49.477 l 45.832 50.262 l 45.945 50.805 46.066 51.23 46.191 51.547
 c 46.316 51.859 46.453 52.102 46.594 52.273 c 46.734 52.445 46.883 52.562
 47.039 52.629 c 47.195 52.691 47.367 52.746 47.555 52.801 c 48.746 51.828
 l 48.957 52.004 49.105 52.215 49.195 52.461 c 49.285 52.707 49.34 52.945
 49.359 53.176 c 49.191 53.258 48.984 53.32 48.738 53.363 c 48.496 53.406
 48.281 53.426 48.105 53.426 c 47.676 53.426 47.273 53.379 46.898 53.285
 c 46.523 53.191 46.176 53.023 45.863 52.777 c 45.551 52.531 45.277 52.195
 45.043 51.773 c 44.805 51.352 44.621 50.816 44.484 50.168 c 44.375 49.617
 l 44.168 49.562 43.945 49.492 43.711 49.398 c 43.473 49.309 43.254 49.203
 43.043 49.082 c 43.043 48.66 l 44.188 48.66 l 43.168 42.008 l 43.086 41.484
 42.969 41.031 42.816 40.641 c 42.664 40.246 42.504 39.918 42.332 39.645
 c 42.156 39.375 41.984 39.16 41.805 39 c 41.629 38.836 41.477 38.727 41.352
 38.664 c 41.492 38.32 l 41.648 38.359 41.871 38.453 42.164 38.602 c h
42.164 38.602 m f
47.773 43.477 m 47.773 42.516 47.965 41.613 48.348 40.773 c 48.727 39.93
 49.367 39.125 50.266 38.352 c 50.723 38.664 l 50.105 39.418 49.684 40.203
 49.453 41.023 c 49.223 41.844 49.113 42.723 49.125 43.664 c 49.113 44.645
 49.246 45.57 49.523 46.438 c 49.801 47.305 50.156 48.102 50.598 48.828 
c 51.035 49.551 51.52 50.215 52.055 50.809 c 52.586 51.402 53.109 51.922
 53.621 52.359 c 53.355 52.645 l 52.727 52.246 52.086 51.762 51.426 51.191
 c 50.77 50.625 50.168 49.961 49.633 49.211 c 49.094 48.457 48.648 47.605
 48.301 46.656 c 47.949 45.707 47.773 44.645 47.773 43.477 c h
47.773 43.477 m f
53.086 48.992 m 53.086 48.602 l 54.09 48.477 l 55.156 45.59 l 54.988 45.445
 54.738 45.223 54.402 44.926 c 54.07 44.625 53.723 44.293 53.371 43.93 c
 53.016 43.562 52.688 43.188 52.398 42.801 c 52.105 42.414 51.91 42.066 
51.816 41.75 c 52.047 41.617 52.336 41.547 52.68 41.547 c 52.848 41.547 
53.02 41.562 53.203 41.594 c 53.387 41.625 53.566 41.68 53.746 41.754 c 
53.734 41.812 53.73 41.91 53.73 42.043 c 53.73 42.172 53.73 42.312 53.738
 42.465 c 53.742 42.617 53.746 42.758 53.754 42.895 c 53.758 43.031 53.77
 43.137 53.793 43.211 c 53.863 43.344 53.965 43.492 54.09 43.648 c 54.215
 43.805 54.352 43.961 54.496 44.117 c 54.645 44.273 54.793 44.426 54.945
 44.57 c 55.094 44.719 55.23 44.855 55.344 44.98 c 56.207 42.145 l 56.258
 41.977 56.344 41.836 56.461 41.719 c 56.574 41.605 56.746 41.547 56.969
 41.547 c 57.105 41.547 57.258 41.566 57.422 41.609 c 57.586 41.652 57.738
 41.703 57.883 41.766 c 58.023 41.828 58.156 41.891 58.277 41.957 c 58.402
 42.02 58.492 42.07 58.555 42.113 c 58.555 42.504 l 57.539 42.629 l 56.41
 45.688 l 56.516 45.781 56.656 45.906 56.84 46.07 c 57.023 46.23 57.219 
46.414 57.43 46.617 c 57.637 46.82 57.855 47.043 58.078 47.277 c 58.305 
47.512 58.516 47.75 58.715 47.992 c 58.91 48.23 59.082 48.473 59.23 48.711
 c 59.375 48.953 59.48 49.176 59.543 49.387 c 59.293 49.52 59 49.59 58.664
 49.59 c 58.484 49.59 58.309 49.57 58.137 49.535 c 57.965 49.496 57.789 
49.445 57.613 49.383 c 57.621 49.32 57.633 49.227 57.645 49.094 c 57.652
 48.965 57.664 48.824 57.676 48.672 c 57.684 48.52 57.691 48.379 57.691 
48.242 c 57.691 48.105 57.684 48 57.676 47.926 c 57.527 47.656 57.312 47.367
 57.023 47.066 c 56.734 46.762 56.473 46.492 56.234 46.25 c 55.465 48.977
 l 55.402 49.133 55.316 49.273 55.211 49.395 c 55.105 49.512 54.938 49.574
 54.703 49.574 c 54.555 49.574 54.402 49.555 54.246 49.512 c 54.086 49.469
 53.93 49.418 53.777 49.355 c 53.625 49.293 53.484 49.227 53.363 49.156 
c 53.242 49.09 53.148 49.035 53.086 48.992 c h
53.086 48.992 m f
62.234 49.98 m 62.352 49.605 62.438 49.223 62.484 48.836 c 62.531 48.449
 62.555 48.031 62.555 47.582 c 62.555 46.535 62.406 45.555 62.105 44.637
 c 61.809 43.715 61.438 42.879 60.992 42.121 c 60.551 41.363 60.062 40.691
 59.539 40.109 c 59.008 39.523 58.516 39.043 58.055 38.664 c 58.371 38.352
 l 59.039 38.738 59.699 39.227 60.352 39.816 c 61.004 40.406 61.59 41.086
 62.113 41.848 c 62.637 42.609 63.059 43.457 63.387 44.395 c 63.707 45.328
 63.871 46.34 63.871 47.426 c 63.871 48.406 63.676 49.32 63.285 50.16 c 
62.891 51 62.246 51.828 61.348 52.645 c 60.938 52.359 l 61.266 51.922 61.531
 51.512 61.738 51.125 c 61.949 50.738 62.113 50.355 62.234 49.98 c h
62.234 49.98 m f
Q Q
showpage
%%Trailer
end restore
%%EOF
