<?xml version="1.0" encoding="UTF-8" standalone="no"?>
<!-- Created with Inkscape (http://www.inkscape.org/) -->

<svg
   xmlns:dc="http://purl.org/dc/elements/1.1/"
   xmlns:cc="http://creativecommons.org/ns#"
   xmlns:rdf="http://www.w3.org/1999/02/22-rdf-syntax-ns#"
   xmlns:svg="http://www.w3.org/2000/svg"
   xmlns="http://www.w3.org/2000/svg"
   xmlns:sodipodi="http://sodipodi.sourceforge.net/DTD/sodipodi-0.dtd"
   xmlns:inkscape="http://www.inkscape.org/namespaces/inkscape"
   width="297mm"
   height="210mm"
   viewBox="0 0 1052.3622 744.09448"
   id="svg4900"
   version="1.1"
   inkscape:version="0.91 r13725"
   sodipodi:docname="problem_and_soa_02.svg">
  <defs
     id="defs4902" />
  <sodipodi:namedview
     id="base"
     pagecolor="#ffffff"
     bordercolor="#666666"
     borderopacity="1.0"
     inkscape:pageopacity="0.0"
     inkscape:pageshadow="2"
     inkscape:zoom="1.3439153"
     inkscape:cx="526.1811"
     inkscape:cy="372.04724"
     inkscape:document-units="px"
     inkscape:current-layer="layer1"
     showgrid="false"
     inkscape:window-width="1916"
     inkscape:window-height="1177"
     inkscape:window-x="1920"
     inkscape:window-y="19"
     inkscape:window-maximized="1" />
  <metadata
     id="metadata4905">
    <rdf:RDF>
      <cc:Work
         rdf:about="">
        <dc:format>image/svg+xml</dc:format>
        <dc:type
           rdf:resource="http://purl.org/dc/dcmitype/StillImage" />
        <dc:title></dc:title>
      </cc:Work>
    </rdf:RDF>
  </metadata>
  <g
     inkscape:label="Calque 1"
     inkscape:groupmode="layer"
     id="layer1"
     transform="translate(0,-308.26772)">
    <g
       id="g5464"
       transform="matrix(0.98493181,0,0,0.98493181,-46.738465,408.33605)"
       style="fill:#c8c8c8;fill-opacity:1;stroke:none;stroke-width:0.10152987;stroke-miterlimit:4;stroke-dasharray:none;stroke-opacity:1">
      <g
         id="g4864"
         transform="matrix(6.9912355,0,0,6.9912355,70.768574,-6.4469131)"
         style="fill:#c8c8c8;fill-opacity:1;stroke:none;stroke-width:0.01452245;stroke-miterlimit:4;stroke-dasharray:none;stroke-opacity:1">
        <path
           id="path4866"
           d="m 49.304,26.139 c -6.371,0 -12.637,0 -19.004,0 0,0.312 0,0.625 0,0.938 0,4.377 -0.02,8.755 0.016,13.132 0.004,0.778 -0.229,1.046 -1.004,0.997 -0.938,-0.06 -1.879,-0.031 -2.818,-0.011 -0.516,0.011 -0.699,-0.188 -0.697,-0.712 0.007,-2.828 -0.001,-5.656 -0.001,-8.484 l -3.401,0 c 0,3.848 0,7.696 0,11.543 0,0.318 0,0.636 0,1.006 3.82,0 7.516,0 11.312,0 0,-0.359 0,-0.675 0,-0.988 0,-4.379 0.014,-8.758 -0.016,-13.137 -0.006,-0.705 0.191,-0.916 0.904,-0.909 3.439,0.035 6.877,0.015 10.316,0.018 0.283,0.001 0.564,0.038 0.945,0.064 0,10.462 0,20.839 0,31.219 1.176,0 2.242,0 3.428,0 0,-2.616 0,-5.204 0,-7.885 1.362,0 2.705,0 4.056,0 l 0,-3.667 c -1.34,0 -2.676,0 -4.036,0 0,-7.688 0,-15.377 0,-23.124 z"
           inkscape:connector-curvature="0"
           style="fill:#c8c8c8;fill-opacity:1;stroke:none;stroke-width:0.01452245;stroke-miterlimit:4;stroke-dasharray:none;stroke-opacity:1" />
        <path
           id="path4868"
           d="m 83.815,33.996 c -4.539,-0.03 -9.08,-0.016 -13.619,-0.016 -0.309,0 -0.619,0 -0.943,0 0,1.197 0,2.264 0,3.391 6.303,0 12.574,0 18.863,0 0,-6.359 0,-12.678 0,-18.964 -27.131,0 -54.189,0 -81.232,0 0,6.923 0,13.763 0,20.719 2.361,0 4.678,0 7.072,0 0,6.979 0,13.842 0,20.709 1.121,0 2.158,0 3.221,0 0,-11.411 0,-20.781 0,-32.166 -1.096,0 -2.131,0 -3.289,0 0,3.373 0,4.708 0,8.098 -1.057,0 -1.996,-0.035 -2.93,0.013 -0.639,0.033 -0.824,-0.177 -0.82,-0.816 0.027,-4.083 0.029,-8.166 0,-12.25 -0.004,-0.672 0.199,-0.869 0.865,-0.864 3.41,0.029 6.822,0.013 10.234,0.014 1.152,0 1.156,10e-4 1.156,1.129 0,1.337 0,2.673 0,4.01 l 3.4,0 c -0.002,-1.468 0.004,-2.936 0,-4.404 0,-0.561 0.186,-0.744 0.744,-0.743 8.701,0.014 17.402,0.009 26.104,0.014 0.18,0 0.359,0.047 0.625,0.084 0,7.587 0,15.145 0,22.747 1.178,0 2.268,0 3.453,0 0,-5.022 0,-10.026 0,-15.101 1.5,0 2.906,0 4.385,0 0,6.524 0,13.061 0,19.665 -1.14,0 -2.287,0 -3.432,0 l 0,3.667 c 2.326,0 4.65,0 6.992,0 0,-2.66 0,-5.227 0,-7.884 0.828,0 1.572,0 2.318,0 2.955,10e-4 5.91,-0.009 8.865,0.017 0.248,0.002 0.707,0.225 0.711,0.359 0.055,1.328 0.033,2.661 0.033,4.067 -2.566,0 -1.998,0 -4.447,0 0,1.24 0,2.4 0,3.555 3.633,0 4.197,0 7.811,0 0,-3.842 0,-7.634 0,-11.515 -5.125,0 -10.186,0 -15.27,0 0,-4.022 0,-7.958 0,-12.004 5.164,0 7.277,0 12.398,0 0,-1.197 0,-2.283 0,-3.444 -0.482,0 -0.906,0 -1.332,0 -7.039,0 -11.076,-0.005 -18.115,0.009 -0.592,0.001 -0.975,-0.047 -0.916,-0.805 0.064,-0.828 0.064,-1.669 0,-2.497 -0.061,-0.761 0.223,-0.942 0.951,-0.94 8.73,0.022 17.459,0.022 26.191,0 0.699,-0.002 0.932,0.188 0.926,0.902 -0.029,3.438 -0.033,6.876 0.002,10.314 0.01,0.758 -0.256,0.934 -0.975,0.93 z"
           inkscape:connector-curvature="0"
           style="fill:#c8c8c8;fill-opacity:1;stroke:none;stroke-width:0.01452245;stroke-miterlimit:4;stroke-dasharray:none;stroke-opacity:1" />
      </g>
      <path
         id="path4870"
         d="m 252.23311,367.33257 c -0.009,-4.86594 1.84563,-5.85167 6.29214,-5.83071 32.11771,0.16045 64.23542,0.0982 96.34614,0.0982 2.19532,0 4.39753,0 6.80246,0 0,-44.48521 0,-67.33964 0,-111.15369 -8.10974,0 -15.87009,0 -24.11272,0 0,36.07475 0,50.72845 0,87.13873 -36.24256,0 -71.97481,0 -108.1614,0 0,3.23701 0,5.66989 0,8.08191 0,22.07135 0,44.1357 0,66.21403 l 22.8683,0 c -0.007,-14.85643 0.0188,-29.6988 -0.0378,-44.54815 z"
         inkscape:connector-curvature="0"
         style="fill:#c8c8c8;fill-opacity:1;stroke:none;stroke-width:0.10152987;stroke-miterlimit:4;stroke-dasharray:none;stroke-opacity:1" />
      <path
         id="path4872"
         d="m 447.54024,393.57069 c 0,27.25876 0,53.65069 0,80.15449 24.58124,0 34.85836,0 59.08292,0 0,-8.07492 0,-15.69529 0,-23.95897 -16.75094,0 -19.18392,0 -36.22858,0 0,-9.40326 0.24443,-18.2052 -0.0982,-26.96524 -0.16044,-4.64913 1.27247,-6.10329 5.99154,-6.06835 10.33301,0.0982 20.65912,-0.0188 30.9991,0 l 0,-23.15496 c -19.91104,-0.007 -39.83605,-0.007 -59.7471,-0.007 z"
         inkscape:connector-curvature="0"
         style="fill:#c8c8c8;fill-opacity:1;stroke:none;stroke-width:0.10152987;stroke-miterlimit:4;stroke-dasharray:none;stroke-opacity:1" />
      <path
         id="path4874"
         d="m 663.26882,286.72363 c 0,72.90456 0,145.45963 0,218.14749 -28.6641,0 -56.5871,0 -84.53805,0 -0.28691,-0.98582 -0.65689,-1.69887 -0.65689,-2.41899 -0.0566,-27.2378 -0.0661,-54.46173 -0.13969,-81.69953 0,-3.34186 1.77579,-4.00603 4.65613,-3.95704 7.33383,0.11232 14.66767,0.26616 21.98744,-0.0566 4.48143,-0.19538 5.87271,1.36325 5.78881,5.7957 -0.21708,13.88457 -0.0849,13.81464 -0.0566,27.7063 0,2.16729 0.20293,4.3275 0.30108,6.33405 8.16572,0 15.58346,0 22.96618,0 0,-26.08436 0,-37.7038 0,-63.01205 -30.54474,0 -60.97056,0 -91.3475,0 l 0,23.15495 c 2.05545,-0.009 4.11788,0.0188 6.17332,0 5.09662,-0.0566 6.81643,1.30738 6.77443,6.57878 -0.2586,25.16847 -0.2586,50.32988 0,75.49837 0.0566,5.36927 -1.78975,6.48788 -6.7884,6.47392 -41.87753,-0.18216 -83.75506,-0.11138 -125.65354,-0.12554 -1.99249,0 -3.98499,-0.16044 -6.62069,-0.27936 0,-19.156 0,-37.80865 0,-57.0205 -36.662,0 -72.64596,0 -109.32192,0 0,-9.17259 0.21708,-17.75783 -0.0982,-26.33608 -0.14724,-4.43235 1.25839,-5.86563 5.70481,-5.78871 14.44389,0.23029 14.94024,0.0982 29.39819,0.0661 1.97852,-0.009 3.95705,-0.22368 5.99145,-0.35676 0,-7.70438 0,-14.77243 0,-22.29503 -26.41989,0 -38.62656,0 -64.85768,0 0,26.36392 0,52.37834 0,79.1548 36.08872,0 71.83493,0 107.70696,0 0,11.21386 0,21.65881 0,32.6001 -46.28893,0 -91.87179,0 -137.83218,0 -0.17461,-1.86669 -0.46152,-3.5026 -0.46152,-5.15259 -0.009,-17.63889 -0.0472,-35.28468 -0.0472,-52.92357 l -22.89634,0 c 0,15.29681 0,30.60061 0,45.89743 0,12.44441 0,12.44441 -12.39542,12.44441 -7.79527,0 -15.59045,0 -23.91,0 0,-20.06489 0,-39.15094 0,-58.41876 -7.92108,0 -15.29681,0 -23.37872,0 0,19.63837 0,38.85023 0,58.15308 -9.48715,0 -18.26814,0 -27.82513,0 0,-66.45868 0,-132.63769 0,-198.88666 -8.35448,0 -15.93304,0 -23.45555,0 0,74.63845 0,148.87134 0,223.02042 189.90991,0 379.33046,0 568.84179,0 0,-81.00751 0,-161.65835 0,-242.3093 -8.04689,0.007 -15.6533,0.007 -24.00787,0.007 z"
         inkscape:connector-curvature="0"
         style="fill:#c8c8c8;fill-opacity:1;stroke:none;stroke-width:0.10152987;stroke-miterlimit:4;stroke-dasharray:none;stroke-opacity:1" />
    </g>
    <g
       id="g8888"
       transform="translate(-5.2618111,128.38818)">
      <path
         id="path5762"
         d="m 63.43873,566.8915 -0.32922,-0.57613 -27.48971,0 -0.32922,0.57613 c 0,0 0,0.0823 -0.0823,0.0823 l -5.92593,9.30041 40,0 -5.92592,-9.30041 c 0.0823,0 0.0823,0 0.0823,-0.0823 z m -10.28807,6.00823 -7.65432,0 c -0.65844,0 -1.23457,-0.57613 -1.23457,-1.23457 0,-0.65843 0.57613,-1.23456 1.23457,-1.23456 l 7.65432,0 c 0.65844,0 1.23457,0.57613 1.23457,1.23456 0,0.65844 -0.49383,1.23457 -1.23457,1.23457 z"
         style="fill:none"
         inkscape:connector-curvature="0" />
      <path
         id="path5764"
         d="m 62.78029,563.92854 c 0,-4.69136 0.0823,-19.50617 0.0823,-19.50617 l -26.91358,0 c 0,0 0.0823,14.81481 0.0823,19.50617 l 26.74897,0 z"
         style="fill:none"
         inkscape:connector-curvature="0" />
      <path
         id="path5766"
         d="m 53.15066,570.4306 -7.65432,0 c -0.65844,0 -1.23457,0.57613 -1.23457,1.23456 0,0.65844 0.57613,1.23457 1.23457,1.23457 l 7.65432,0 c 0.65844,0 1.23457,-0.57613 1.23457,-1.23457 0,-0.65843 -0.49383,-1.23456 -1.23457,-1.23456 z"
         inkscape:connector-curvature="0" />
      <path
         id="path5768"
         d="m 74.05601,574.46352 -6.33745,-9.95885 c 0,-3.95062 0.0823,-20.0823 0.0823,-20.0823 0,-2.71605 -2.22222,-4.93827 -4.93827,-4.93827 l -26.91358,0 c -2.71605,0 -4.93827,2.22222 -4.93827,4.93827 0,0 0.0823,16.13168 0.0823,20.0823 l -6.41975,9.95885 c -0.98765,1.15226 -1.23457,2.79835 -0.65843,4.27983 0.65843,1.56379 2.13991,2.55144 3.786,2.55144 l 43.12757,0 c 1.64609,0 3.12758,-0.98765 3.78601,-2.55144 0.57613,-1.48148 0.32922,-3.12757 -0.65843,-4.27983 z M 62.86259,544.42237 c 0,0 -0.0823,14.81481 -0.0823,19.50617 l -26.83127,0 c 0,-4.69136 -0.0823,-19.50617 -0.0823,-19.50617 l 26.99588,0 z m -33.49794,31.85185 5.92593,-9.30041 c 0,0 0.0823,-0.0823 0.0823,-0.0823 l 0.32922,-0.57614 27.48971,0 0.32922,0.57614 c 0,0 0,0.0823 0.0823,0.0823 l 5.92592,9.30041 -40.1646,0 z"
         inkscape:connector-curvature="0" />
    </g>
    <g
       id="g8898"
       transform="translate(-461.98701,-192.58229)">
      <circle
         r="38.171501"
         cy="799.53339"
         cx="622.91663"
         id="path8736"
         style="opacity:1;fill:none;fill-opacity:1;stroke:#f38630;stroke-width:4;stroke-linecap:round;stroke-linejoin:round;stroke-miterlimit:4;stroke-dasharray:none;stroke-dashoffset:0;stroke-opacity:1" />
      <path
         inkscape:connector-curvature="0"
         d="m 622.82855,803.35037 m 0.0881,-6.69442 c -0.0294,0 -0.0587,0 -0.0881,0 -1.70297,0 -4.87401,-2.75998 -6.13655,-3.93444 -0.29361,-0.26425 -0.52851,-0.55787 -0.64595,-0.93957 -0.14681,-0.35233 -0.35234,-0.58723 -0.52851,-0.76339 0.29362,-0.3817 0.7634,-0.85149 1.49744,-1.32127 1.73232,-1.11574 2.75997,-2.2902 3.08295,-2.90679 0.35234,-0.61659 0.32298,-0.9102 -0.29361,-0.93956 -0.6166,-0.0294 -1.99658,1.05701 -1.99658,1.05701 0,0 -1.84978,1.55616 -3.08296,3.67018 -0.35234,-0.0587 -0.85148,-0.0587 -1.26254,0.29362 -0.67532,0.55787 -0.52851,1.40935 -0.29362,1.82041 -0.20553,0.17617 -0.44042,0.35234 -0.73403,0.52851 -1.76169,1.20382 -2.75998,2.37828 -3.11232,2.96551 -0.35234,0.61659 -0.32298,0.9102 0.29362,0.93956 0.61659,0.0294 1.99658,-1.05701 1.99658,-1.05701 0,0 1.23318,-1.05701 2.37828,-2.58381 0.23489,0.11745 0.58722,0.29361 1.02765,0.49914 0.11744,0.0587 0.20553,0.11745 0.32297,0.17617 0.91021,0.7634 2.02595,2.52509 2.84807,3.9638 0.64595,1.11574 0.64595,2.52509 0,3.64083 -0.82212,1.46807 -1.99658,3.31784 -2.90679,4.08124 -0.0881,0.0881 -0.20553,0.14681 -0.29361,0.17617 -0.20553,0.0881 -0.35234,0.17617 -0.49915,0.23489 -1.23318,-1.87913 -2.8187,-3.22976 -2.8187,-3.22976 0,0 -1.37999,-1.08638 -1.99658,-1.05701 -0.61659,0.0294 -0.64595,0.32297 -0.29362,0.93956 0.35234,0.61659 1.35063,1.79105 3.08296,2.90679 0.49914,0.32298 0.88084,0.64595 1.17446,0.93957 -0.17617,0.11744 -0.29362,0.20553 -0.3817,0.32297 -0.26425,0.29362 -0.61659,1.35063 0.17617,1.99658 0.55787,0.46979 1.20382,0.35234 1.55616,0.23489 0.0881,-0.0294 0.17616,-0.0587 0.23489,-0.11744 1.20382,1.73233 2.61317,2.93615 2.61317,2.93615 0,0 1.37999,1.08637 1.99658,1.05701 0.61659,-0.0294 0.64595,-0.32298 0.29361,-0.93957 -0.35234,-0.61659 -1.35063,-1.79105 -3.08295,-2.90678 -0.49915,-0.32298 -0.85148,-0.64596 -1.1451,-0.91021 0.0294,-0.0587 0.0587,-0.11745 0.0881,-0.20553 0.14681,-0.3817 0.3817,-0.70468 0.67532,-0.96893 1.26254,-1.17446 4.40422,-3.93444 6.13655,-3.93444 m -0.0294,0.0294 c 1.70297,0 5.02082,2.75997 6.31272,3.93443 0.29362,0.26426 0.52851,0.61659 0.67532,0.96893 0.0587,0.11745 0.0881,0.20553 0.1468,0.29362 -0.26425,0.26425 -0.61659,0.55786 -1.05701,0.82212 -1.73233,1.11573 -2.75998,2.29019 -3.08295,2.90678 -0.35234,0.61659 -0.32298,0.91021 0.29361,0.93957 0.61659,0.0294 1.99658,-1.05701 1.99658,-1.05701 0,0 1.40935,-1.20382 2.58381,-2.90679 0.0294,0.0294 0.0881,0.0294 0.11745,0.0587 0.35233,0.11745 0.99829,0.2349 1.55615,-0.23489 0.79276,-0.64595 0.44043,-1.70296 0.17617,-1.99658 -0.0881,-0.0881 -0.17617,-0.17617 -0.29361,-0.26425 0.29361,-0.32298 0.67531,-0.64595 1.23318,-0.99829 1.73233,-1.11574 2.75998,-2.2902 3.08296,-2.90679 0.35233,-0.61659 0.32297,-0.9102 -0.29362,-0.93956 -0.61659,-0.0294 -1.99658,1.05701 -1.99658,1.05701 0,0 -1.61488,1.37999 -2.84806,3.28848 -0.17617,-0.0881 -0.3817,-0.17616 -0.61659,-0.29361 -0.11745,-0.0587 -0.20553,-0.11745 -0.32298,-0.17617 -0.91021,-0.7634 -2.02594,-2.52509 -2.84806,-3.9638 -0.64596,-1.11573 -0.64596,-2.52509 0,-3.64082 0.82212,-1.46808 1.99658,-3.31785 2.90678,-4.08125 0.0881,-0.0881 0.20553,-0.1468 0.32298,-0.17617 0.46978,-0.20553 0.79276,-0.35233 1.02765,-0.49914 1.1451,1.55616 2.37828,2.58381 2.37828,2.58381 0,0 1.37999,1.08637 1.99658,1.05701 0.61659,-0.0294 0.64595,-0.32297 0.29362,-0.93956 -0.35234,-0.6166 -1.35063,-1.79105 -3.08296,-2.90679 -0.29361,-0.17617 -0.52851,-0.3817 -0.73404,-0.55787 0.20553,-0.44042 0.35234,-1.26254 -0.29361,-1.82041 -0.41106,-0.35234 -0.88085,-0.35234 -1.23318,-0.29362 -1.29191,-2.08466 -3.14168,-3.64082 -3.14168,-3.64082 0,0 -1.37999,-1.08637 -1.99658,-1.05701 -0.61659,0.0294 -0.64595,0.32298 -0.29362,0.93957 0.35234,0.61659 1.35063,1.79105 3.08296,2.90678 0.70467,0.46979 1.17446,0.91021 1.49743,1.29191 -0.17616,0.1468 -0.3817,0.41106 -0.5285,0.73403 -0.14681,0.3817 -0.3817,0.70468 -0.67532,0.96893 -1.26254,1.17446 -4.4923,3.93444 -6.22463,3.93444 m 8.39738,-5.40251 c 0.52851,-0.11745 0.99829,0.35234 0.88085,0.88084 -0.0587,0.26426 -0.26426,0.46979 -0.52851,0.52851 -0.52851,0.11745 -0.99829,-0.35234 -0.88084,-0.88084 0.0587,-0.26426 0.26425,-0.46979 0.5285,-0.52851 z m -16.79476,1.32127 c -0.52851,0.11744 -0.99829,-0.35234 -0.88085,-0.88085 0.0587,-0.26425 0.26426,-0.46978 0.52851,-0.52851 0.52851,-0.11744 0.99829,0.35234 0.88084,0.88085 -0.0587,0.26425 -0.26425,0.46978 -0.5285,0.52851 z m 0.0587,16.06072 c -0.52851,0.11745 -0.99829,-0.35234 -0.88085,-0.88084 0.0587,-0.26426 0.26426,-0.46979 0.52851,-0.52851 0.52851,-0.11744 0.99829,0.35234 0.88084,0.88085 -0.0587,0.26425 -0.26425,0.46978 -0.5285,0.5285 z m 16.94156,-0.0881 c -0.5285,0.11744 -0.99829,-0.35234 -0.88084,-0.88085 0.0587,-0.26425 0.26425,-0.46978 0.52851,-0.5285 0.5285,-0.11745 0.99829,0.35233 0.88084,0.88084 -0.0587,0.26425 -0.26425,0.46978 -0.52851,0.52851 z"
         id="path6863-6-7"
         style="fill:#fa6900;fill-opacity:1;stroke:#fa6900;stroke-width:0.29361475;stroke-opacity:1" />
      <circle
         r="48.292896"
         cy="799.53339"
         cx="622.91663"
         id="path8780"
         style="opacity:1;fill:none;fill-opacity:1;stroke:#f38630;stroke-width:4;stroke-linecap:round;stroke-linejoin:round;stroke-miterlimit:4;stroke-dasharray:none;stroke-dashoffset:0;stroke-opacity:1" />
      <ellipse
         ry="27.875765"
         rx="27.875763"
         cy="799.53339"
         cx="622.91663"
         id="path8782"
         style="opacity:1;fill:none;fill-opacity:1;stroke:#f38630;stroke-width:4;stroke-linecap:round;stroke-linejoin:round;stroke-miterlimit:4;stroke-dasharray:none;stroke-dashoffset:0;stroke-opacity:1" />
    </g>
    <g
       id="g8898-9"
       transform="translate(-305.10324,-16.575916)">
      <circle
         r="38.171501"
         cy="799.53339"
         cx="622.91663"
         id="path8736-47"
         style="opacity:1;fill:none;fill-opacity:1;stroke:#f38630;stroke-width:4;stroke-linecap:round;stroke-linejoin:round;stroke-miterlimit:4;stroke-dasharray:none;stroke-dashoffset:0;stroke-opacity:1" />
      <path
         inkscape:connector-curvature="0"
         d="m 622.82855,803.35037 m 0.0881,-6.69442 c -0.0294,0 -0.0587,0 -0.0881,0 -1.70297,0 -4.87401,-2.75998 -6.13655,-3.93444 -0.29361,-0.26425 -0.52851,-0.55787 -0.64595,-0.93957 -0.14681,-0.35233 -0.35234,-0.58723 -0.52851,-0.76339 0.29362,-0.3817 0.7634,-0.85149 1.49744,-1.32127 1.73232,-1.11574 2.75997,-2.2902 3.08295,-2.90679 0.35234,-0.61659 0.32298,-0.9102 -0.29361,-0.93956 -0.6166,-0.0294 -1.99658,1.05701 -1.99658,1.05701 0,0 -1.84978,1.55616 -3.08296,3.67018 -0.35234,-0.0587 -0.85148,-0.0587 -1.26254,0.29362 -0.67532,0.55787 -0.52851,1.40935 -0.29362,1.82041 -0.20553,0.17617 -0.44042,0.35234 -0.73403,0.52851 -1.76169,1.20382 -2.75998,2.37828 -3.11232,2.96551 -0.35234,0.61659 -0.32298,0.9102 0.29362,0.93956 0.61659,0.0294 1.99658,-1.05701 1.99658,-1.05701 0,0 1.23318,-1.05701 2.37828,-2.58381 0.23489,0.11745 0.58722,0.29361 1.02765,0.49914 0.11744,0.0587 0.20553,0.11745 0.32297,0.17617 0.91021,0.7634 2.02595,2.52509 2.84807,3.9638 0.64595,1.11574 0.64595,2.52509 0,3.64083 -0.82212,1.46807 -1.99658,3.31784 -2.90679,4.08124 -0.0881,0.0881 -0.20553,0.14681 -0.29361,0.17617 -0.20553,0.0881 -0.35234,0.17617 -0.49915,0.23489 -1.23318,-1.87913 -2.8187,-3.22976 -2.8187,-3.22976 0,0 -1.37999,-1.08638 -1.99658,-1.05701 -0.61659,0.0294 -0.64595,0.32297 -0.29362,0.93956 0.35234,0.61659 1.35063,1.79105 3.08296,2.90679 0.49914,0.32298 0.88084,0.64595 1.17446,0.93957 -0.17617,0.11744 -0.29362,0.20553 -0.3817,0.32297 -0.26425,0.29362 -0.61659,1.35063 0.17617,1.99658 0.55787,0.46979 1.20382,0.35234 1.55616,0.23489 0.0881,-0.0294 0.17616,-0.0587 0.23489,-0.11744 1.20382,1.73233 2.61317,2.93615 2.61317,2.93615 0,0 1.37999,1.08637 1.99658,1.05701 0.61659,-0.0294 0.64595,-0.32298 0.29361,-0.93957 -0.35234,-0.61659 -1.35063,-1.79105 -3.08295,-2.90678 -0.49915,-0.32298 -0.85148,-0.64596 -1.1451,-0.91021 0.0294,-0.0587 0.0587,-0.11745 0.0881,-0.20553 0.14681,-0.3817 0.3817,-0.70468 0.67532,-0.96893 1.26254,-1.17446 4.40422,-3.93444 6.13655,-3.93444 m -0.0294,0.0294 c 1.70297,0 5.02082,2.75997 6.31272,3.93443 0.29362,0.26426 0.52851,0.61659 0.67532,0.96893 0.0587,0.11745 0.0881,0.20553 0.1468,0.29362 -0.26425,0.26425 -0.61659,0.55786 -1.05701,0.82212 -1.73233,1.11573 -2.75998,2.29019 -3.08295,2.90678 -0.35234,0.61659 -0.32298,0.91021 0.29361,0.93957 0.61659,0.0294 1.99658,-1.05701 1.99658,-1.05701 0,0 1.40935,-1.20382 2.58381,-2.90679 0.0294,0.0294 0.0881,0.0294 0.11745,0.0587 0.35233,0.11745 0.99829,0.2349 1.55615,-0.23489 0.79276,-0.64595 0.44043,-1.70296 0.17617,-1.99658 -0.0881,-0.0881 -0.17617,-0.17617 -0.29361,-0.26425 0.29361,-0.32298 0.67531,-0.64595 1.23318,-0.99829 1.73233,-1.11574 2.75998,-2.2902 3.08296,-2.90679 0.35233,-0.61659 0.32297,-0.9102 -0.29362,-0.93956 -0.61659,-0.0294 -1.99658,1.05701 -1.99658,1.05701 0,0 -1.61488,1.37999 -2.84806,3.28848 -0.17617,-0.0881 -0.3817,-0.17616 -0.61659,-0.29361 -0.11745,-0.0587 -0.20553,-0.11745 -0.32298,-0.17617 -0.91021,-0.7634 -2.02594,-2.52509 -2.84806,-3.9638 -0.64596,-1.11573 -0.64596,-2.52509 0,-3.64082 0.82212,-1.46808 1.99658,-3.31785 2.90678,-4.08125 0.0881,-0.0881 0.20553,-0.1468 0.32298,-0.17617 0.46978,-0.20553 0.79276,-0.35233 1.02765,-0.49914 1.1451,1.55616 2.37828,2.58381 2.37828,2.58381 0,0 1.37999,1.08637 1.99658,1.05701 0.61659,-0.0294 0.64595,-0.32297 0.29362,-0.93956 -0.35234,-0.6166 -1.35063,-1.79105 -3.08296,-2.90679 -0.29361,-0.17617 -0.52851,-0.3817 -0.73404,-0.55787 0.20553,-0.44042 0.35234,-1.26254 -0.29361,-1.82041 -0.41106,-0.35234 -0.88085,-0.35234 -1.23318,-0.29362 -1.29191,-2.08466 -3.14168,-3.64082 -3.14168,-3.64082 0,0 -1.37999,-1.08637 -1.99658,-1.05701 -0.61659,0.0294 -0.64595,0.32298 -0.29362,0.93957 0.35234,0.61659 1.35063,1.79105 3.08296,2.90678 0.70467,0.46979 1.17446,0.91021 1.49743,1.29191 -0.17616,0.1468 -0.3817,0.41106 -0.5285,0.73403 -0.14681,0.3817 -0.3817,0.70468 -0.67532,0.96893 -1.26254,1.17446 -4.4923,3.93444 -6.22463,3.93444 m 8.39738,-5.40251 c 0.52851,-0.11745 0.99829,0.35234 0.88085,0.88084 -0.0587,0.26426 -0.26426,0.46979 -0.52851,0.52851 -0.52851,0.11745 -0.99829,-0.35234 -0.88084,-0.88084 0.0587,-0.26426 0.26425,-0.46979 0.5285,-0.52851 z m -16.79476,1.32127 c -0.52851,0.11744 -0.99829,-0.35234 -0.88085,-0.88085 0.0587,-0.26425 0.26426,-0.46978 0.52851,-0.52851 0.52851,-0.11744 0.99829,0.35234 0.88084,0.88085 -0.0587,0.26425 -0.26425,0.46978 -0.5285,0.52851 z m 0.0587,16.06072 c -0.52851,0.11745 -0.99829,-0.35234 -0.88085,-0.88084 0.0587,-0.26426 0.26426,-0.46979 0.52851,-0.52851 0.52851,-0.11744 0.99829,0.35234 0.88084,0.88085 -0.0587,0.26425 -0.26425,0.46978 -0.5285,0.5285 z m 16.94156,-0.0881 c -0.5285,0.11744 -0.99829,-0.35234 -0.88084,-0.88085 0.0587,-0.26425 0.26425,-0.46978 0.52851,-0.5285 0.5285,-0.11745 0.99829,0.35233 0.88084,0.88084 -0.0587,0.26425 -0.26425,0.46978 -0.52851,0.52851 z"
         id="path6863-6-7-9"
         style="fill:#fa6900;fill-opacity:1;stroke:#fa6900;stroke-width:0.29361475;stroke-opacity:1" />
      <circle
         r="48.292896"
         cy="799.53339"
         cx="622.91663"
         id="path8780-3"
         style="opacity:1;fill:none;fill-opacity:1;stroke:#f38630;stroke-width:4;stroke-linecap:round;stroke-linejoin:round;stroke-miterlimit:4;stroke-dasharray:none;stroke-dashoffset:0;stroke-opacity:1" />
      <ellipse
         ry="27.875765"
         rx="27.875763"
         cy="799.53339"
         cx="622.91663"
         id="path8782-0"
         style="opacity:1;fill:none;fill-opacity:1;stroke:#f38630;stroke-width:4;stroke-linecap:round;stroke-linejoin:round;stroke-miterlimit:4;stroke-dasharray:none;stroke-dashoffset:0;stroke-opacity:1" />
    </g>
    <g
       id="g8898-0"
       transform="translate(-136.72529,-176.53497)">
      <circle
         r="38.171501"
         cy="799.53339"
         cx="622.91663"
         id="path8736-3"
         style="opacity:1;fill:none;fill-opacity:1;stroke:#f38630;stroke-width:4;stroke-linecap:round;stroke-linejoin:round;stroke-miterlimit:4;stroke-dasharray:none;stroke-dashoffset:0;stroke-opacity:1" />
      <path
         inkscape:connector-curvature="0"
         d="m 622.82855,803.35037 m 0.0881,-6.69442 c -0.0294,0 -0.0587,0 -0.0881,0 -1.70297,0 -4.87401,-2.75998 -6.13655,-3.93444 -0.29361,-0.26425 -0.52851,-0.55787 -0.64595,-0.93957 -0.14681,-0.35233 -0.35234,-0.58723 -0.52851,-0.76339 0.29362,-0.3817 0.7634,-0.85149 1.49744,-1.32127 1.73232,-1.11574 2.75997,-2.2902 3.08295,-2.90679 0.35234,-0.61659 0.32298,-0.9102 -0.29361,-0.93956 -0.6166,-0.0294 -1.99658,1.05701 -1.99658,1.05701 0,0 -1.84978,1.55616 -3.08296,3.67018 -0.35234,-0.0587 -0.85148,-0.0587 -1.26254,0.29362 -0.67532,0.55787 -0.52851,1.40935 -0.29362,1.82041 -0.20553,0.17617 -0.44042,0.35234 -0.73403,0.52851 -1.76169,1.20382 -2.75998,2.37828 -3.11232,2.96551 -0.35234,0.61659 -0.32298,0.9102 0.29362,0.93956 0.61659,0.0294 1.99658,-1.05701 1.99658,-1.05701 0,0 1.23318,-1.05701 2.37828,-2.58381 0.23489,0.11745 0.58722,0.29361 1.02765,0.49914 0.11744,0.0587 0.20553,0.11745 0.32297,0.17617 0.91021,0.7634 2.02595,2.52509 2.84807,3.9638 0.64595,1.11574 0.64595,2.52509 0,3.64083 -0.82212,1.46807 -1.99658,3.31784 -2.90679,4.08124 -0.0881,0.0881 -0.20553,0.14681 -0.29361,0.17617 -0.20553,0.0881 -0.35234,0.17617 -0.49915,0.23489 -1.23318,-1.87913 -2.8187,-3.22976 -2.8187,-3.22976 0,0 -1.37999,-1.08638 -1.99658,-1.05701 -0.61659,0.0294 -0.64595,0.32297 -0.29362,0.93956 0.35234,0.61659 1.35063,1.79105 3.08296,2.90679 0.49914,0.32298 0.88084,0.64595 1.17446,0.93957 -0.17617,0.11744 -0.29362,0.20553 -0.3817,0.32297 -0.26425,0.29362 -0.61659,1.35063 0.17617,1.99658 0.55787,0.46979 1.20382,0.35234 1.55616,0.23489 0.0881,-0.0294 0.17616,-0.0587 0.23489,-0.11744 1.20382,1.73233 2.61317,2.93615 2.61317,2.93615 0,0 1.37999,1.08637 1.99658,1.05701 0.61659,-0.0294 0.64595,-0.32298 0.29361,-0.93957 -0.35234,-0.61659 -1.35063,-1.79105 -3.08295,-2.90678 -0.49915,-0.32298 -0.85148,-0.64596 -1.1451,-0.91021 0.0294,-0.0587 0.0587,-0.11745 0.0881,-0.20553 0.14681,-0.3817 0.3817,-0.70468 0.67532,-0.96893 1.26254,-1.17446 4.40422,-3.93444 6.13655,-3.93444 m -0.0294,0.0294 c 1.70297,0 5.02082,2.75997 6.31272,3.93443 0.29362,0.26426 0.52851,0.61659 0.67532,0.96893 0.0587,0.11745 0.0881,0.20553 0.1468,0.29362 -0.26425,0.26425 -0.61659,0.55786 -1.05701,0.82212 -1.73233,1.11573 -2.75998,2.29019 -3.08295,2.90678 -0.35234,0.61659 -0.32298,0.91021 0.29361,0.93957 0.61659,0.0294 1.99658,-1.05701 1.99658,-1.05701 0,0 1.40935,-1.20382 2.58381,-2.90679 0.0294,0.0294 0.0881,0.0294 0.11745,0.0587 0.35233,0.11745 0.99829,0.2349 1.55615,-0.23489 0.79276,-0.64595 0.44043,-1.70296 0.17617,-1.99658 -0.0881,-0.0881 -0.17617,-0.17617 -0.29361,-0.26425 0.29361,-0.32298 0.67531,-0.64595 1.23318,-0.99829 1.73233,-1.11574 2.75998,-2.2902 3.08296,-2.90679 0.35233,-0.61659 0.32297,-0.9102 -0.29362,-0.93956 -0.61659,-0.0294 -1.99658,1.05701 -1.99658,1.05701 0,0 -1.61488,1.37999 -2.84806,3.28848 -0.17617,-0.0881 -0.3817,-0.17616 -0.61659,-0.29361 -0.11745,-0.0587 -0.20553,-0.11745 -0.32298,-0.17617 -0.91021,-0.7634 -2.02594,-2.52509 -2.84806,-3.9638 -0.64596,-1.11573 -0.64596,-2.52509 0,-3.64082 0.82212,-1.46808 1.99658,-3.31785 2.90678,-4.08125 0.0881,-0.0881 0.20553,-0.1468 0.32298,-0.17617 0.46978,-0.20553 0.79276,-0.35233 1.02765,-0.49914 1.1451,1.55616 2.37828,2.58381 2.37828,2.58381 0,0 1.37999,1.08637 1.99658,1.05701 0.61659,-0.0294 0.64595,-0.32297 0.29362,-0.93956 -0.35234,-0.6166 -1.35063,-1.79105 -3.08296,-2.90679 -0.29361,-0.17617 -0.52851,-0.3817 -0.73404,-0.55787 0.20553,-0.44042 0.35234,-1.26254 -0.29361,-1.82041 -0.41106,-0.35234 -0.88085,-0.35234 -1.23318,-0.29362 -1.29191,-2.08466 -3.14168,-3.64082 -3.14168,-3.64082 0,0 -1.37999,-1.08637 -1.99658,-1.05701 -0.61659,0.0294 -0.64595,0.32298 -0.29362,0.93957 0.35234,0.61659 1.35063,1.79105 3.08296,2.90678 0.70467,0.46979 1.17446,0.91021 1.49743,1.29191 -0.17616,0.1468 -0.3817,0.41106 -0.5285,0.73403 -0.14681,0.3817 -0.3817,0.70468 -0.67532,0.96893 -1.26254,1.17446 -4.4923,3.93444 -6.22463,3.93444 m 8.39738,-5.40251 c 0.52851,-0.11745 0.99829,0.35234 0.88085,0.88084 -0.0587,0.26426 -0.26426,0.46979 -0.52851,0.52851 -0.52851,0.11745 -0.99829,-0.35234 -0.88084,-0.88084 0.0587,-0.26426 0.26425,-0.46979 0.5285,-0.52851 z m -16.79476,1.32127 c -0.52851,0.11744 -0.99829,-0.35234 -0.88085,-0.88085 0.0587,-0.26425 0.26426,-0.46978 0.52851,-0.52851 0.52851,-0.11744 0.99829,0.35234 0.88084,0.88085 -0.0587,0.26425 -0.26425,0.46978 -0.5285,0.52851 z m 0.0587,16.06072 c -0.52851,0.11745 -0.99829,-0.35234 -0.88085,-0.88084 0.0587,-0.26426 0.26426,-0.46979 0.52851,-0.52851 0.52851,-0.11744 0.99829,0.35234 0.88084,0.88085 -0.0587,0.26425 -0.26425,0.46978 -0.5285,0.5285 z m 16.94156,-0.0881 c -0.5285,0.11744 -0.99829,-0.35234 -0.88084,-0.88085 0.0587,-0.26425 0.26425,-0.46978 0.52851,-0.5285 0.5285,-0.11745 0.99829,0.35233 0.88084,0.88084 -0.0587,0.26425 -0.26425,0.46978 -0.52851,0.52851 z"
         id="path6863-6-7-3"
         style="fill:#fa6900;fill-opacity:1;stroke:#fa6900;stroke-width:0.29361475;stroke-opacity:1" />
      <circle
         r="48.292896"
         cy="799.53339"
         cx="622.91663"
         id="path8780-7"
         style="opacity:1;fill:none;fill-opacity:1;stroke:#f38630;stroke-width:4;stroke-linecap:round;stroke-linejoin:round;stroke-miterlimit:4;stroke-dasharray:none;stroke-dashoffset:0;stroke-opacity:1" />
      <ellipse
         ry="27.875765"
         rx="27.875763"
         cy="799.53339"
         cx="622.91663"
         id="path8782-9"
         style="opacity:1;fill:none;fill-opacity:1;stroke:#f38630;stroke-width:4;stroke-linecap:round;stroke-linejoin:round;stroke-miterlimit:4;stroke-dasharray:none;stroke-dashoffset:0;stroke-opacity:1" />
    </g>
    <g
       id="g8898-6"
       transform="translate(-84.107177,38.146924)">
      <circle
         r="38.171501"
         cy="799.53339"
         cx="622.91663"
         id="path8736-39"
         style="opacity:1;fill:none;fill-opacity:1;stroke:#f38630;stroke-width:4;stroke-linecap:round;stroke-linejoin:round;stroke-miterlimit:4;stroke-dasharray:none;stroke-dashoffset:0;stroke-opacity:1" />
      <path
         inkscape:connector-curvature="0"
         d="m 622.82855,803.35037 m 0.0881,-6.69442 c -0.0294,0 -0.0587,0 -0.0881,0 -1.70297,0 -4.87401,-2.75998 -6.13655,-3.93444 -0.29361,-0.26425 -0.52851,-0.55787 -0.64595,-0.93957 -0.14681,-0.35233 -0.35234,-0.58723 -0.52851,-0.76339 0.29362,-0.3817 0.7634,-0.85149 1.49744,-1.32127 1.73232,-1.11574 2.75997,-2.2902 3.08295,-2.90679 0.35234,-0.61659 0.32298,-0.9102 -0.29361,-0.93956 -0.6166,-0.0294 -1.99658,1.05701 -1.99658,1.05701 0,0 -1.84978,1.55616 -3.08296,3.67018 -0.35234,-0.0587 -0.85148,-0.0587 -1.26254,0.29362 -0.67532,0.55787 -0.52851,1.40935 -0.29362,1.82041 -0.20553,0.17617 -0.44042,0.35234 -0.73403,0.52851 -1.76169,1.20382 -2.75998,2.37828 -3.11232,2.96551 -0.35234,0.61659 -0.32298,0.9102 0.29362,0.93956 0.61659,0.0294 1.99658,-1.05701 1.99658,-1.05701 0,0 1.23318,-1.05701 2.37828,-2.58381 0.23489,0.11745 0.58722,0.29361 1.02765,0.49914 0.11744,0.0587 0.20553,0.11745 0.32297,0.17617 0.91021,0.7634 2.02595,2.52509 2.84807,3.9638 0.64595,1.11574 0.64595,2.52509 0,3.64083 -0.82212,1.46807 -1.99658,3.31784 -2.90679,4.08124 -0.0881,0.0881 -0.20553,0.14681 -0.29361,0.17617 -0.20553,0.0881 -0.35234,0.17617 -0.49915,0.23489 -1.23318,-1.87913 -2.8187,-3.22976 -2.8187,-3.22976 0,0 -1.37999,-1.08638 -1.99658,-1.05701 -0.61659,0.0294 -0.64595,0.32297 -0.29362,0.93956 0.35234,0.61659 1.35063,1.79105 3.08296,2.90679 0.49914,0.32298 0.88084,0.64595 1.17446,0.93957 -0.17617,0.11744 -0.29362,0.20553 -0.3817,0.32297 -0.26425,0.29362 -0.61659,1.35063 0.17617,1.99658 0.55787,0.46979 1.20382,0.35234 1.55616,0.23489 0.0881,-0.0294 0.17616,-0.0587 0.23489,-0.11744 1.20382,1.73233 2.61317,2.93615 2.61317,2.93615 0,0 1.37999,1.08637 1.99658,1.05701 0.61659,-0.0294 0.64595,-0.32298 0.29361,-0.93957 -0.35234,-0.61659 -1.35063,-1.79105 -3.08295,-2.90678 -0.49915,-0.32298 -0.85148,-0.64596 -1.1451,-0.91021 0.0294,-0.0587 0.0587,-0.11745 0.0881,-0.20553 0.14681,-0.3817 0.3817,-0.70468 0.67532,-0.96893 1.26254,-1.17446 4.40422,-3.93444 6.13655,-3.93444 m -0.0294,0.0294 c 1.70297,0 5.02082,2.75997 6.31272,3.93443 0.29362,0.26426 0.52851,0.61659 0.67532,0.96893 0.0587,0.11745 0.0881,0.20553 0.1468,0.29362 -0.26425,0.26425 -0.61659,0.55786 -1.05701,0.82212 -1.73233,1.11573 -2.75998,2.29019 -3.08295,2.90678 -0.35234,0.61659 -0.32298,0.91021 0.29361,0.93957 0.61659,0.0294 1.99658,-1.05701 1.99658,-1.05701 0,0 1.40935,-1.20382 2.58381,-2.90679 0.0294,0.0294 0.0881,0.0294 0.11745,0.0587 0.35233,0.11745 0.99829,0.2349 1.55615,-0.23489 0.79276,-0.64595 0.44043,-1.70296 0.17617,-1.99658 -0.0881,-0.0881 -0.17617,-0.17617 -0.29361,-0.26425 0.29361,-0.32298 0.67531,-0.64595 1.23318,-0.99829 1.73233,-1.11574 2.75998,-2.2902 3.08296,-2.90679 0.35233,-0.61659 0.32297,-0.9102 -0.29362,-0.93956 -0.61659,-0.0294 -1.99658,1.05701 -1.99658,1.05701 0,0 -1.61488,1.37999 -2.84806,3.28848 -0.17617,-0.0881 -0.3817,-0.17616 -0.61659,-0.29361 -0.11745,-0.0587 -0.20553,-0.11745 -0.32298,-0.17617 -0.91021,-0.7634 -2.02594,-2.52509 -2.84806,-3.9638 -0.64596,-1.11573 -0.64596,-2.52509 0,-3.64082 0.82212,-1.46808 1.99658,-3.31785 2.90678,-4.08125 0.0881,-0.0881 0.20553,-0.1468 0.32298,-0.17617 0.46978,-0.20553 0.79276,-0.35233 1.02765,-0.49914 1.1451,1.55616 2.37828,2.58381 2.37828,2.58381 0,0 1.37999,1.08637 1.99658,1.05701 0.61659,-0.0294 0.64595,-0.32297 0.29362,-0.93956 -0.35234,-0.6166 -1.35063,-1.79105 -3.08296,-2.90679 -0.29361,-0.17617 -0.52851,-0.3817 -0.73404,-0.55787 0.20553,-0.44042 0.35234,-1.26254 -0.29361,-1.82041 -0.41106,-0.35234 -0.88085,-0.35234 -1.23318,-0.29362 -1.29191,-2.08466 -3.14168,-3.64082 -3.14168,-3.64082 0,0 -1.37999,-1.08637 -1.99658,-1.05701 -0.61659,0.0294 -0.64595,0.32298 -0.29362,0.93957 0.35234,0.61659 1.35063,1.79105 3.08296,2.90678 0.70467,0.46979 1.17446,0.91021 1.49743,1.29191 -0.17616,0.1468 -0.3817,0.41106 -0.5285,0.73403 -0.14681,0.3817 -0.3817,0.70468 -0.67532,0.96893 -1.26254,1.17446 -4.4923,3.93444 -6.22463,3.93444 m 8.39738,-5.40251 c 0.52851,-0.11745 0.99829,0.35234 0.88085,0.88084 -0.0587,0.26426 -0.26426,0.46979 -0.52851,0.52851 -0.52851,0.11745 -0.99829,-0.35234 -0.88084,-0.88084 0.0587,-0.26426 0.26425,-0.46979 0.5285,-0.52851 z m -16.79476,1.32127 c -0.52851,0.11744 -0.99829,-0.35234 -0.88085,-0.88085 0.0587,-0.26425 0.26426,-0.46978 0.52851,-0.52851 0.52851,-0.11744 0.99829,0.35234 0.88084,0.88085 -0.0587,0.26425 -0.26425,0.46978 -0.5285,0.52851 z m 0.0587,16.06072 c -0.52851,0.11745 -0.99829,-0.35234 -0.88085,-0.88084 0.0587,-0.26426 0.26426,-0.46979 0.52851,-0.52851 0.52851,-0.11744 0.99829,0.35234 0.88084,0.88085 -0.0587,0.26425 -0.26425,0.46978 -0.5285,0.5285 z m 16.94156,-0.0881 c -0.5285,0.11744 -0.99829,-0.35234 -0.88084,-0.88085 0.0587,-0.26425 0.26425,-0.46978 0.52851,-0.5285 0.5285,-0.11745 0.99829,0.35233 0.88084,0.88084 -0.0587,0.26425 -0.26425,0.46978 -0.52851,0.52851 z"
         id="path6863-6-7-37"
         style="fill:#fa6900;fill-opacity:1;stroke:#fa6900;stroke-width:0.29361475;stroke-opacity:1" />
      <circle
         r="48.292896"
         cy="799.53339"
         cx="622.91663"
         id="path8780-65"
         style="opacity:1;fill:none;fill-opacity:1;stroke:#f38630;stroke-width:4;stroke-linecap:round;stroke-linejoin:round;stroke-miterlimit:4;stroke-dasharray:none;stroke-dashoffset:0;stroke-opacity:1" />
      <ellipse
         ry="27.875765"
         rx="27.875763"
         cy="799.53339"
         cx="622.91663"
         id="path8782-44"
         style="opacity:1;fill:none;fill-opacity:1;stroke:#f38630;stroke-width:4;stroke-linecap:round;stroke-linejoin:round;stroke-miterlimit:4;stroke-dasharray:none;stroke-dashoffset:0;stroke-opacity:1" />
    </g>
    <path
       style="fill:none;fill-rule:evenodd;stroke:#000000;stroke-width:10;stroke-linecap:butt;stroke-linejoin:miter;stroke-miterlimit:4;stroke-dasharray:none;stroke-opacity:1"
       d="M 72.612989,669.30235 110.49803,637.73149"
       id="path8959"
       inkscape:connector-curvature="0" />
    <path
       style="fill:none;fill-rule:evenodd;stroke:#000000;stroke-width:10;stroke-linecap:butt;stroke-linejoin:miter;stroke-miterlimit:4;stroke-dasharray:none;stroke-opacity:1"
       d="m 202.05354,650.35984 72.613,86.2937"
       id="path8961"
       inkscape:connector-curvature="0" />
    <path
       style="fill:none;fill-rule:evenodd;stroke:#000000;stroke-width:10;stroke-linecap:butt;stroke-linejoin:miter;stroke-miterlimit:4;stroke-dasharray:none;stroke-opacity:1"
       d="m 360.96024,744.02007 81.03189,-78.92716"
       id="path8963"
       inkscape:connector-curvature="0" />
    <path
       style="fill:none;fill-rule:evenodd;stroke:#000000;stroke-width:10;stroke-linecap:butt;stroke-linejoin:miter;stroke-miterlimit:4;stroke-dasharray:none;stroke-opacity:1"
       d="m 371.48386,798.74291 109.44567,30.5185"
       id="path8965"
       inkscape:connector-curvature="0" />
    <path
       style="fill:none;fill-rule:evenodd;stroke:#000000;stroke-width:10;stroke-linecap:butt;stroke-linejoin:miter;stroke-miterlimit:4;stroke-dasharray:none;stroke-opacity:1"
       d="m 503.02913,679.82598 22.09961,102.07913"
       id="path8967"
       inkscape:connector-curvature="0" />
    <g
       id="g4569"
       transform="translate(0,0.15574847)">
      <g
         transform="matrix(0.54840634,0,0,0.54840634,331.74412,413.60328)"
         id="g6565">
        <path
           inkscape:connector-curvature="0"
           d="m 672.18873,361.36701 -1.48444,-1.00814 c -0.50222,-0.34 -1.1837,-0.21037 -1.52519,0.29185 l -7.59851,11.19333 c -0.34,0.50074 -0.20963,1.18296 0.29111,1.5237 l 1.48592,1.00741 c 0.50074,0.34 1.18371,0.20963 1.52297,-0.29037 l 7.60148,-11.19333 c 0.33778,-0.50148 0.20889,-1.18371 -0.29334,-1.52445 z"
           id="path4320" />
        <path
           inkscape:connector-curvature="0"
           d="m 603.5354,368.93812 c -0.21333,-0.5674 -0.84592,-0.85407 -1.41333,-0.64074 l -1.68,0.6326 c -0.56667,0.21333 -0.85333,0.84592 -0.64,1.41333 l 4.76518,12.66148 c 0.21334,0.56741 0.84667,0.85407 1.41334,0.64148 l 1.68,-0.63259 c 0.56666,-0.21259 0.85407,-0.84593 0.63926,-1.41259 l -4.76445,-12.66297 z"
           id="path4322" />
        <path
           inkscape:connector-curvature="0"
           d="m 654.47096,347.36109 c -0.28445,-0.7563 -1.12741,-1.13852 -1.88371,-0.85408 l -2.24074,0.84297 c -0.75407,0.28444 -1.13703,1.12814 -0.85185,1.8837 l 2.64444,7.02963 -15.95777,6.00519 c -0.90963,-0.90963 -2.16445,-1.4726 -3.55259,-1.4726 -2.66519,0 -4.83334,2.07185 -5.00297,4.69259 l -6.11926,2.30297 -0.21037,-0.25852 c -1.13703,-1.36519 -3.16666,-1.54741 -4.53407,-0.40815 -0.87482,0.72963 -1.26074,1.8237 -1.12889,2.87556 l -3.57852,1.34666 -2.64518,-7.02963 c -0.28445,-0.75555 -1.12741,-1.13851 -1.88371,-0.85259 l -2.23926,0.84222 c -0.75629,0.28445 -1.13926,1.12815 -0.85333,1.88371 l 6.35333,16.88296 c 0.28445,0.75556 1.12667,1.13852 1.88371,0.85407 l 2.23926,-0.84296 c 0.75629,-0.28444 1.13777,-1.12815 0.85333,-1.8837 l -2.64519,-7.02963 4.05704,-1.52667 3.63408,4.35037 4.91037,1.20667 0,10.73481 c 0,0.29778 -1.34297,27.97778 -1.34297,27.97778 -0.13037,1.81037 1.23778,3.38074 3.04667,3.50741 1.80963,0.12296 3.3763,-1.23556 3.50148,-3.04741 l 1.11778,-21.55556 c 0.2,0.0133 1.06518,0.0193 1.29852,-0.009 l 1.47703,21.56371 c 0.12149,1.81185 1.69482,3.17037 3.50667,3.04741 1.80519,-0.12667 3.17704,-1.69704 3.04741,-3.50741 0,0 -1.83259,-27.73482 -1.83259,-27.97778 l 0,-11.27704 6.47407,-7.75333 2.26593,-2.7037 c 1.13777,-1.36445 0.95629,-3.39926 -0.41112,-4.53852 -0.64074,-0.53333 -1.42666,-0.77333 -2.19703,-0.74148 l 7.53185,-2.83408 2.64518,7.02963 c 0.28445,0.7563 1.12667,1.13778 1.88297,0.85334 l 2.24074,-0.84297 c 0.75555,-0.28518 1.13703,-1.12814 0.85333,-1.88444 l -6.35407,-16.88221 z m -11.13926,15.70963 c 0,0 -6.73334,7.99037 -6.74815,7.98 -1.12148,0.99037 -2.58963,1.59555 -4.19852,1.59555 -1.50667,0 -2.88592,-0.52592 -3.97259,-1.40148 l -4.05185,0.0482 -0.84371,-1.03407 4.83482,-1.81926 c 0.88222,1.43703 2.46296,2.4 4.27704,2.4 2.77555,0 5.01925,-2.24815 5.01925,-5.01926 0,-0.29111 -0.0296,-0.57333 -0.077,-0.85037 l 6.20371,-2.33482 c -0.15704,0.12741 -0.30741,0.2726 -0.44297,0.43556 z"
           id="path4324" />
      </g>
      <g
         transform="matrix(0.54601702,0,0,0.54601702,234.53616,473.42398)"
         id="g6570">
        <path
           inkscape:connector-curvature="0"
           d="m 780.38688,364.98657 0,74.07407 73.25779,0 0,-74.07407 -73.25779,0 z m 35.81261,37.60994 0,26.81779 -26.81778,0 0,-26.81779 26.81778,0 z m 33.52078,32.53973 -24.69071,0 0,-36.76114 8.38121,-8.38207 -0.003,11.96618 7.72647,-7.72733 8.6e-4,-18.20891 -18.21365,-0.002 -7.72647,7.72711 11.9733,-6.5e-4 -10.01766,10.01874 -32.83976,0 0,-24.85569 65.40899,0 0,66.22527 z"
           id="path4993" />
      </g>
      <g
         id="Isolation_Mode"
         transform="matrix(0.44922597,0,0,0.44922597,658.23327,530.53378)">
        <path
           id="path5640"
           d="M 94.078,41.762 C 95.865,28.231 90.376,12.018 74.164,4.742 61.345,-1.011 38.719,-1.001 26.785,9.878 16.377,19.368 14.031,32.837 14.031,32.837 c 0,0 -1.074,5.004 -1.074,6.665 0,1.588 1.788,2.213 1.583,3.029 -0.204,0.816 -2.207,3.151 -3.738,5.703 -1.53,2.551 -5.443,8.222 -5.443,9.752 0,1.53 0.916,2.097 2.753,2.709 1.836,0.612 3.265,1.122 3.571,1.836 0.306,0.714 -0.875,2.754 -0.938,4.209 -0.054,1.241 0.4,1.379 1.33,1.74 1.153,0.449 2.923,0.507 2.923,0.507 0,0 -3.943,0.745 -3.551,2.359 0.406,1.675 2.781,2.015 2.992,3.327 0.105,0.662 -2.008,4.053 -1.73,7.354 0.363,4.308 4.444,6.236 10.914,5.198 6.167,-0.99 9.067,-1.91 9.86,1.491 0.499,2.141 0.446,5.753 1.364,9.836 0.038,0.163 0.077,0.338 0.114,0.51 l 47.327,0 c -2.024,-3.689 -4.685,-9.61 -4.685,-17.144 0,-5.169 0.514,-12.842 4.221,-16.923 4.647,-5.116 10.819,-12.361 12.254,-23.233 z M 74.537,52.486 c 0,0 -0.619,6.769 -5.588,7.639 -4.255,0.744 -7.08,-3.354 -7.08,-3.354 l -1.398,6.613 -2.979,0 c 0,0 -2.701,-9.966 -4.564,-11.644 -1.864,-1.677 -4.752,-2.142 -4.752,-2.142 0,0 -3.912,-0.28 -6.428,-2.794 -2.515,-2.516 -0.186,-5.59 -0.186,-5.59 0,0 -3.167,0.187 -9.595,-1.21 -6.427,-1.398 -4.471,-5.497 -4.471,-5.497 0,0 -1.677,0.28 -3.074,-1.49 -0.993,-1.258 -1.717,-4.335 0.093,-7.918 1.622,-3.209 4.469,-4.323 4.469,-4.323 0,0 -1.054,-1.338 1.169,-3.207 1.161,-0.976 3.211,-0.947 3.211,-0.947 0,0 0.501,-2.151 3.587,-3.546 3.496,-1.579 5.822,-0.273 5.822,-0.273 0,0 0.934,-2.046 3.635,-2.978 2.702,-0.931 5.4,0.649 5.4,0.649 0,0 1.828,-1.653 5.182,-1.653 3.353,0 4.601,1.747 4.601,1.747 0,0 2.02,-1.038 4.471,-0.187 2.316,0.805 2.986,3.05 2.986,3.05 0,0 1.673,-1.187 4,-0.255 2.329,0.932 3.262,3.447 3.262,3.447 0,0 1.605,-0.235 3.202,1.183 1.185,1.054 0.802,3.009 0.802,3.009 0,0 1.976,0.656 3.158,3.021 1.101,2.201 -0.456,4.059 -0.456,4.059 0,0 3.26,2.422 3.726,8.756 0.568,7.728 -4.377,9.222 -4.377,9.222 0,0 0.978,2.452 -0.746,5.123 -2.346,3.635 -7.082,1.49 -7.082,1.49 z"
           inkscape:connector-curvature="0" />
      </g>
      <g
         id="Слой_2"
         transform="matrix(0.61918546,0,0,0.61918546,649.8879,734.95278)">
        <g
           id="g5129">
          <path
             id="path5131"
             d="m 81.967,73.9 -9.92,0 1.821,-1.821 c 2.156,0.28 4.389,0.421 6.699,0.421 l 0,-2.8 C 69.032,69.7 59.559,65.988 52.41,58.668 42.854,48.882 39.284,34.531 37.952,24.694 L 38.156,24.49 37.888,24.222 C 37.092,18.107 37.162,13.843 37.165,13.734 l -2.799,-0.068 c -0.011,0.434 -0.078,4.393 0.59,10.064 l -1.99,1.99 0,-14.82 -2.8,0 0,63 -12.8,0 0,2.8 12.8,0 0,11.4 2.8,0 0,-11.4 49,0 0,-2.8 z m -13.88,0 -4.441,0 3.295,-3.295 c 1.155,0.346 2.338,0.643 3.547,0.894 L 68.087,73.9 Z m -6.715,-5.426 c 0.854,0.405 1.723,0.784 2.613,1.128 l -4.009,4.009 0.29,0.29 -4.32,0 5.426,-5.427 z m -9.385,5.426 -4.441,0 8.506,-8.506 c 0.883,0.613 1.789,1.187 2.72,1.721 L 51.987,73.9 Z m 1.802,-10.202 -9.912,9.912 0.29,0.29 -5.02,0 12.282,-12.282 c 0.764,0.73 1.55,1.423 2.36,2.08 z m -13.866,-19.734 -6.956,6.956 0,-5.02 0.29,0.29 5.465,-5.465 c 0.367,1.077 0.769,2.159 1.201,3.239 z m -6.956,-1.444 0,-4.44 3.866,-3.866 c 0.28,1.15 0.593,2.319 0.94,3.501 l -4.806,4.805 z m 0,11.78 0.29,0.29 7.853,-7.853 c 0.457,0.999 0.944,1.993 1.464,2.976 l -9.607,9.607 0,-5.02 z m 0,8.98 11.035,-11.035 c 0.549,0.913 1.133,1.811 1.746,2.695 l -12.781,12.78 0,-4.44 z m 2.469,-36.069 c 0.19,1.21 0.412,2.467 0.674,3.767 l -3.143,3.143 0,-4.441 2.469,-2.469 z M 32.967,71.68 47.425,57.222 c 0.647,0.82 1.335,1.614 2.047,2.394 L 35.187,73.9 l -2.22,0 0,-2.22 z"
             inkscape:connector-curvature="0" />
          <path
             id="path5133"
             d="m 52.567,51.376 c 0.392,-0.196 0.794,-0.496 1.207,-0.901 0.413,-0.405 0.801,-0.935 1.166,-1.591 0.364,-0.656 0.622,-1.479 0.777,-2.471 l 1.344,-8.52 2.331,0 c 0.211,-0.364 0.28,-0.729 0.211,-1.092 l -2.331,0 0.209,-1.05 c 0.154,-0.727 0.316,-1.302 0.484,-1.723 0.167,-0.42 0.346,-0.745 0.535,-0.976 0.189,-0.231 0.388,-0.388 0.599,-0.472 0.211,-0.085 0.442,-0.161 0.693,-0.231 l 1.596,1.302 c 0.28,-0.238 0.48,-0.521 0.599,-0.85 0.119,-0.329 0.193,-0.648 0.22,-0.956 -0.224,-0.112 -0.5,-0.196 -0.829,-0.252 -0.329,-0.056 -0.614,-0.085 -0.852,-0.085 -0.574,0 -1.113,0.063 -1.616,0.19 -0.504,0.126 -0.967,0.353 -1.386,0.682 -0.42,0.328 -0.787,0.777 -1.102,1.344 -0.316,0.566 -0.565,1.284 -0.746,2.152 l -0.146,0.736 c -0.28,0.072 -0.578,0.17 -0.893,0.293 -0.315,0.123 -0.612,0.265 -0.893,0.424 l 0,0.565 1.533,0 -1.364,8.918 c -0.112,0.699 -0.269,1.308 -0.473,1.832 -0.202,0.524 -0.42,0.967 -0.651,1.33 -0.231,0.362 -0.465,0.652 -0.703,0.868 -0.238,0.216 -0.442,0.366 -0.61,0.45 l 0.19,0.461 c 0.208,-0.056 0.508,-0.182 0.901,-0.377 z"
             inkscape:connector-curvature="0" />
          <path
             id="path5135"
             d="m 60.085,44.843 c 0,1.288 0.256,2.495 0.767,3.622 0.51,1.128 1.367,2.209 2.572,3.246 l 0.61,-0.421 c -0.827,-1.008 -1.393,-2.062 -1.702,-3.16 -0.308,-1.099 -0.454,-2.279 -0.44,-3.538 -0.014,-1.317 0.164,-2.555 0.536,-3.717 0.371,-1.162 0.85,-2.23 1.438,-3.203 0.588,-0.972 1.239,-1.858 1.952,-2.656 0.714,-0.797 1.414,-1.49 2.1,-2.078 l -0.357,-0.379 c -0.839,0.533 -1.701,1.18 -2.583,1.943 -0.882,0.763 -1.684,1.649 -2.405,2.656 -0.721,1.008 -1.317,2.149 -1.784,3.423 -0.47,1.273 -0.704,2.694 -0.704,4.262 z"
             inkscape:connector-curvature="0" />
          <path
             id="path5137"
             d="m 67.204,37.451 0,0.525 1.344,0.168 1.427,3.864 c -0.224,0.197 -0.561,0.494 -1.008,0.893 -0.448,0.399 -0.911,0.844 -1.386,1.333 -0.476,0.491 -0.911,0.995 -1.302,1.512 -0.392,0.518 -0.651,0.987 -0.778,1.407 0.309,0.182 0.693,0.273 1.155,0.273 0.224,0 0.458,-0.021 0.704,-0.063 0.245,-0.042 0.485,-0.112 0.725,-0.211 -0.015,-0.083 -0.022,-0.213 -0.022,-0.388 0,-0.175 0.004,-0.364 0.011,-0.566 0.007,-0.204 0.014,-0.396 0.021,-0.578 0.007,-0.182 0.025,-0.321 0.053,-0.42 0.097,-0.182 0.231,-0.377 0.399,-0.588 0.167,-0.211 0.349,-0.42 0.546,-0.63 0.196,-0.209 0.395,-0.413 0.599,-0.608 0.202,-0.197 0.381,-0.379 0.535,-0.547 l 1.155,3.801 c 0.071,0.224 0.185,0.414 0.34,0.567 0.156,0.154 0.383,0.231 0.682,0.231 0.183,0 0.386,-0.027 0.606,-0.083 0.22,-0.056 0.425,-0.126 0.617,-0.211 0.193,-0.083 0.369,-0.168 0.533,-0.252 0.163,-0.085 0.287,-0.154 0.372,-0.211 l 0,-0.525 -1.364,-0.168 -1.512,-4.095 c 0.139,-0.126 0.332,-0.297 0.577,-0.514 0.245,-0.217 0.507,-0.462 0.787,-0.736 0.28,-0.272 0.57,-0.567 0.872,-0.882 0.301,-0.314 0.584,-0.633 0.85,-0.956 0.265,-0.321 0.496,-0.644 0.693,-0.965 0.196,-0.323 0.335,-0.623 0.42,-0.904 -0.338,-0.182 -0.73,-0.273 -1.179,-0.273 -0.239,0 -0.474,0.025 -0.705,0.074 -0.232,0.049 -0.468,0.116 -0.705,0.2 0.014,0.085 0.029,0.213 0.042,0.388 0.014,0.175 0.027,0.365 0.042,0.567 0.014,0.204 0.021,0.395 0.021,0.577 0,0.183 -0.007,0.323 -0.021,0.421 -0.197,0.364 -0.487,0.749 -0.872,1.154 -0.386,0.407 -0.738,0.771 -1.06,1.092 l -1.029,-3.653 c -0.085,-0.211 -0.198,-0.396 -0.34,-0.558 -0.141,-0.16 -0.368,-0.241 -0.679,-0.241 -0.198,0 -0.403,0.027 -0.615,0.083 -0.213,0.056 -0.421,0.126 -0.628,0.211 -0.205,0.083 -0.39,0.171 -0.552,0.263 -0.163,0.093 -0.288,0.166 -0.371,0.222 z"
             inkscape:connector-curvature="0" />
          <path
             id="path5139"
             d="m 79.458,36.127 c 0.16,0.504 0.272,1.016 0.335,1.534 0.063,0.518 0.096,1.077 0.096,1.68 0,1.4 -0.2,2.715 -0.599,3.947 -0.399,1.232 -0.897,2.356 -1.492,3.371 -0.595,1.014 -1.246,1.914 -1.952,2.697 -0.707,0.785 -1.369,1.429 -1.985,1.932 l 0.42,0.421 c 0.897,-0.518 1.781,-1.173 2.656,-1.965 0.875,-0.79 1.662,-1.697 2.363,-2.719 0.7,-1.021 1.267,-2.159 1.702,-3.412 0.433,-1.252 0.651,-2.607 0.651,-4.063 0,-1.315 -0.262,-2.537 -0.787,-3.664 -0.525,-1.127 -1.39,-2.237 -2.594,-3.329 l -0.547,0.379 c 0.435,0.588 0.792,1.14 1.072,1.658 0.28,0.518 0.5,1.03 0.661,1.533 z"
             inkscape:connector-curvature="0" />
        </g>
      </g>
      <g
         transform="matrix(0.59666856,0,0,0.59666856,255.30994,548.32809)"
         id="g6561">
        <line
           style="fill:none;stroke:#000000;stroke-width:0.55555552;stroke-miterlimit:10"
           stroke-miterlimit="10"
           x1="712.79279"
           y1="452.04034"
           x2="712.79279"
           y2="518.68402"
           id="line5969" />
        <path
           inkscape:connector-curvature="0"
           style="fill:none;stroke:#000000;stroke-width:0.55555552;stroke-miterlimit:10"
           stroke-miterlimit="10"
           d="m 679.54392,485.36182 66.49703,0 c 0,0 -3.6963,25.44815 -8.15704,25.49037 -4.46074,0.0422 -8.45259,-25.48963 -8.45259,-25.48963 0,0 -3.99481,-11.39479 -8.45333,-11.35257 -4.46148,0.043 -8.15778,11.35257 -8.15778,11.35257 0,0 -3.69555,25.44815 -8.1563,25.49037 -4.46074,0.0422 -8.45481,-25.49037 -8.45481,-25.49037 0,0 -3.99333,-25.53259 -8.45407,-25.49037 -4.46148,0.043 -8.15704,25.49037 -8.15704,25.49037 l -0.0541,-7.4e-4 z"
           id="path5971"
           sodipodi:nodetypes="ccscccsccccc" />
      </g>
      <g
         transform="matrix(0.55336335,0,0,0.55336335,614.34819,691.55446)"
         id="g6556">
        <path
           inkscape:connector-curvature="0"
           d="m 153.08107,367.76212 c 1.58,0 2.86074,-1.28074 2.86074,-2.86074 0,-1.58 -1.28074,-2.86074 -2.86074,-2.86074 -1.35408,0 -2.48371,0.94445 -2.77926,2.20889 l -14.1037,2.86074 c -0.67926,-1.33703 -1.95408,-2.31629 -3.4763,-2.59111 l -0.22222,-6.21555 c 1.1674,-0.49852 1.9874,-1.65556 1.9874,-3.00667 -7.4e-4,-1.80519 -1.46444,-3.26889 -3.27037,-3.26889 -1.80518,0 -3.26963,1.4637 -3.26963,3.26963 0,1.54518 1.07482,2.83111 2.51556,3.17259 l 0.21852,6.11482 c -1.21259,0.29926 -2.24519,1.04815 -2.91037,2.0637 l -11.56148,-6.99185 c 0.0541,-0.21926 0.0911,-0.44593 0.0911,-0.68148 0,-1.58074 -1.28074,-2.86074 -2.86074,-2.86074 -1.57926,0 -2.86074,1.28 -2.86074,2.86074 0,1.58074 1.28074,2.86074 2.86074,2.86074 0.59629,0 1.14963,-0.18371 1.6074,-0.49556 l 11.98741,7.25111 c -0.0356,0.2363 -0.0593,0.47704 -0.0593,0.72297 0,0.71333 0.15704,1.38889 0.43185,1.99926 l -18.21185,18.16888 c -0.84074,-0.6874 -1.91407,-1.10074 -3.08518,-1.10074 -0.99482,0 -1.91852,0.29926 -2.68963,0.81037 l -8.642224,-8.64222 c 0.456296,-0.64815 0.72963,-1.43481 0.72963,-2.28741 0,-2.20074 -1.783704,-3.98444 -3.984445,-3.98444 -2.20074,0 -3.984444,1.7837 -3.984444,3.98444 0,2.20075 1.784445,3.98445 3.984444,3.98445 0.602223,0 1.168149,-0.1437 1.68,-0.3837 l 8.788889,8.78962 c -0.47852,0.75482 -0.75926,1.64667 -0.75926,2.60593 0,0.36815 0.0444,0.72519 0.12148,1.06963 l -12.454071,4.18519 c -0.512593,-0.77186 -1.387408,-1.28075 -2.382963,-1.28075 -1.58,0 -2.860741,1.28075 -2.860741,2.86075 0,1.58 1.280741,2.85925 2.860741,2.85925 1.432592,0 2.608148,-1.05555 2.817037,-2.42963 l 12.887407,-4.33037 c 0.73926,0.97778 1.8363,1.66593 3.09852,1.87186 l -0.002,7.32222 c -1.46148,0.32518 -2.55556,1.62592 -2.55556,3.18592 0,1.80593 1.46371,3.26889 3.26963,3.26889 1.80593,0 3.26963,-1.4637 3.26963,-3.26889 0,-1.33185 -0.79852,-2.47259 -1.94074,-2.98148 l 0.003,-7.62518 c 1.40593,-0.37408 2.55926,-1.35704 3.1637,-2.65185 l 16.48297,3.31926 c -0.0245,0.17333 -0.0533,0.34444 -0.0533,0.5237 0,2.0963 1.7,3.79629 3.79629,3.79629 0.27704,0 0.54519,-0.0333 0.80519,-0.0896 l 2.69555,6.65926 c -0.77777,0.61926 -1.28666,1.56074 -1.28666,2.63334 0,0.54814 0.14296,1.05926 0.37629,1.51629 l -5.47037,5.73556 c -0.0245,-0.01 -0.0459,-0.0252 -0.0719,-0.0341 -1.48592,-0.53556 -3.12518,0.23704 -3.65926,1.72296 -0.53407,1.48593 0.23704,3.12445 1.72297,3.65926 1.4874,0.53482 3.12518,-0.23778 3.66,-1.7237 0.27555,-0.76667 0.19852,-1.57111 -0.14,-2.24815 l 5.39333,-5.65704 c 0.46889,0.24667 0.99407,0.39852 1.55926,0.39852 0.88518,0 1.6837,-0.34815 2.28593,-0.90667 l 10.14296,6.81852 c -0.10222,0.29334 -0.16889,0.60371 -0.16889,0.93408 0,1.58 1.28074,2.85926 2.85926,2.85926 1.58,0 2.86074,-1.28075 2.86074,-2.85926 0,-1.58074 -1.28074,-2.86074 -2.86074,-2.86074 -0.49482,0 -0.95482,0.13777 -1.36148,0.36 l -10.45852,-7.03037 c 0.0459,-0.22149 0.0719,-0.45038 0.0719,-0.68593 0,-1.86296 -1.50963,-3.37185 -3.37185,-3.37185 -0.0593,0 -0.11334,0.0141 -0.17111,0.0163 l -2.78075,-6.9163 c 0.71556,-0.69037 1.16371,-1.65481 1.16371,-2.72741 0,-2.09629 -1.7,-3.79629 -3.7963,-3.79629 -1.18074,0 -2.22296,0.55037 -2.91852,1.39704 l -16.85117,-3.44594 c 0,-0.0178 0.002,-0.0348 0.002,-0.0526 0,-0.78222 -0.18815,-1.51852 -0.51555,-2.17333 l 18.14891,-18.12741 c 0.86074,0.7637 1.99111,1.23185 3.23185,1.23185 1.00296,0 1.93333,-0.3037 2.70815,-0.82222 l 9.40963,9.40963 c -0.18223,0.40741 -0.28963,0.85629 -0.28963,1.33111 0,1.80667 1.46444,3.26963 3.26963,3.26963 1.80518,0 3.26888,-1.46296 3.26888,-3.26963 0,-1.80593 -1.4637,-3.26963 -3.26888,-3.26963 -0.58297,0 -1.12297,0.16519 -1.59556,0.43259 l -9.37111,-9.37185 c 0.47037,-0.75037 0.74667,-1.63481 0.74667,-2.58518 0,-0.0763 -0.008,-0.14963 -0.0118,-0.22519 l 13.87036,-2.81259 c 0.48741,0.88222 1.41556,1.48592 2.49408,1.48592 z"
           id="path4353" />
        <ellipse
           style="opacity:1;fill:#ffffff;fill-opacity:1;stroke:none;stroke-width:1;stroke-linecap:round;stroke-linejoin:round;stroke-miterlimit:4;stroke-dasharray:none;stroke-dashoffset:0;stroke-opacity:1"
           id="path6539"
           cx="118.31103"
           cy="381.18896"
           rx="5.2086616"
           ry="5.9527559" />
        <ellipse
           style="opacity:1;fill:#ffffff;fill-opacity:1;stroke:none;stroke-width:1;stroke-linecap:round;stroke-linejoin:round;stroke-miterlimit:4;stroke-dasharray:none;stroke-dashoffset:0;stroke-opacity:1"
           id="path6539-0"
           cx="119.05512"
           cy="396.07083"
           rx="5.2086616"
           ry="5.9527559" />
      </g>
    </g>
  </g>
</svg>
