%!PS-Adobe-3.0 EPSF-3.0
%%Creator: cairo 1.14.2 (http://cairographics.org)
%%CreationDate: Tue Apr 28 08:44:13 2015
%%Pages: 1
%%DocumentData: Clean7Bit
%%LanguageLevel: 2
%%BoundingBox: 147 539 516 771
%%EndComments
%%BeginProlog
save
50 dict begin
/q { gsave } bind def
/Q { grestore } bind def
/cm { 6 array astore concat } bind def
/w { setlinewidth } bind def
/J { setlinecap } bind def
/j { setlinejoin } bind def
/M { setmiterlimit } bind def
/d { setdash } bind def
/m { moveto } bind def
/l { lineto } bind def
/c { curveto } bind def
/h { closepath } bind def
/re { exch dup neg 3 1 roll 5 3 roll moveto 0 rlineto
      0 exch rlineto 0 rlineto closepath } bind def
/S { stroke } bind def
/f { fill } bind def
/f* { eofill } bind def
/n { newpath } bind def
/W { clip } bind def
/W* { eoclip } bind def
/BT { } bind def
/ET { } bind def
/pdfmark where { pop globaldict /?pdfmark /exec load put }
    { globaldict begin /?pdfmark /pop load def /pdfmark
    /cleartomark load def end } ifelse
/BDC { mark 3 1 roll /BDC pdfmark } bind def
/EMC { mark /EMC pdfmark } bind def
/cairo_store_point { /cairo_point_y exch def /cairo_point_x exch def } def
/Tj { show currentpoint cairo_store_point } bind def
/TJ {
  {
    dup
    type /stringtype eq
    { show } { -0.001 mul 0 cairo_font_matrix dtransform rmoveto } ifelse
  } forall
  currentpoint cairo_store_point
} bind def
/cairo_selectfont { cairo_font_matrix aload pop pop pop 0 0 6 array astore
    cairo_font exch selectfont cairo_point_x cairo_point_y moveto } bind def
/Tf { pop /cairo_font exch def /cairo_font_matrix where
      { pop cairo_selectfont } if } bind def
/Td { matrix translate cairo_font_matrix matrix concatmatrix dup
      /cairo_font_matrix exch def dup 4 get exch 5 get cairo_store_point
      /cairo_font where { pop cairo_selectfont } if } bind def
/Tm { 2 copy 8 2 roll 6 array astore /cairo_font_matrix exch def
      cairo_store_point /cairo_font where { pop cairo_selectfont } if } bind def
/g { setgray } bind def
/rg { setrgbcolor } bind def
/d1 { setcachedevice } bind def
%%EndProlog
%%BeginSetup
%%EndSetup
%%Page: 1 1
%%BeginPageSetup
%%PageBoundingBox: 147 539 516 771
%%EndPageSetup
q 147 539 369 232 rectclip q
0 g
0.8 w
1 J
2 j
[] 0.0 d
4 M q 1 0 0 -1 0 841.889771 cm
147.75 71.645 367.062 229.836 re S Q
1.975309 w
1 j
10 M q 1 0 0 -1 0 841.889771 cm
245.773 170.219 m 245.773 167.391 243.469 165.02 240.57 165.02 c S Q
q 1 0 0 -1 0 841.889771 cm
250.117 170.219 m 250.117 164.953 245.836 160.672 240.57 160.672 c S Q
q 1 0 0 -1 0 841.889771 cm
363.418 238.574 m 363.418 235.746 361.113 233.375 358.215 233.375 c S Q
q 1 0 0 -1 0 841.889771 cm
367.762 238.574 m 367.762 233.309 363.484 229.027 358.215 229.027 c S Q
q 1 0 0 -1 0 841.889771 cm
444.637 109.719 m 444.637 106.887 442.332 104.516 439.434 104.516 c S Q
q 1 0 0 -1 0 841.889771 cm
448.984 109.719 m 448.984 104.449 444.703 100.172 439.434 100.172 c S Q
0.8 w
0 J
0 j
4 M q 1 0 0 -1 0 841.889771 cm
267.723 182.691 m 395.688 138.07 l S Q
q 1 0 0 -1 0 841.889771 cm
267.723 217.207 m 311.5 243.305 l S Q
q 1 0 0 -1 0 841.889771 cm
378.008 222.258 m 420.102 159.961 l S Q
0.952941 0.52549 0.188235 rg
238.715 640.827 m 211.809 640.827 l 211.414 640.827 211.09 641.151 211.09
 641.546 c 211.09 641.905 l 211.09 642.3 211.414 642.624 211.809 642.624
 c 212.059 642.624 212.309 642.48 212.418 642.265 c 238.391 642.265 l 239.035
 642.909 l 239.035 657.042 l 238.176 657.905 l 238.066 658.05 237.996 658.23
 237.996 658.405 c 237.996 662.71 l 212.523 662.71 l 212.523 660.558 l 212.523
 660.163 212.203 659.843 211.809 659.843 c 211.414 659.843 211.09 660.163
 211.09 660.558 c 211.09 663.429 l 211.09 663.823 211.414 664.148 211.809
 664.148 c 238.715 664.148 l 239.109 664.148 239.43 663.823 239.43 663.429
 c 239.43 658.694 l 240.293 657.831 l 240.434 657.691 240.508 657.511 240.508
 657.331 c 240.508 642.624 l 240.508 642.444 240.434 642.265 240.293 642.12
 c 239.215 641.046 l 239.07 640.901 238.891 640.827 238.715 640.827 c h
238.715 640.827 m f
211.809 647.288 m 211.414 647.288 211.09 647.609 211.09 648.003 c 211.09
 653.386 l 211.09 653.78 211.414 654.101 211.809 654.101 c 212.203 654.101
 212.523 653.78 212.523 653.386 c 212.523 648.003 l 212.523 647.609 212.203
 647.288 211.809 647.288 c h
211.809 647.288 m f
214.5 654.46 m 208.758 654.46 l 208.473 654.46 208.219 654.714 208.219 
654.999 c 208.219 658.944 l 208.219 659.234 208.473 659.484 208.758 659.484
 c 214.5 659.484 l 214.785 659.484 215.035 659.234 215.035 658.944 c 215.035
 654.999 l 215.035 654.714 214.785 654.46 214.5 654.46 c h
214.5 654.46 m f
215.574 642.98 m 210.551 642.98 l 210.266 642.98 210.016 643.234 210.016
 643.519 c 210.016 646.39 l 210.016 646.675 210.266 646.929 210.551 646.929
 c 215.574 646.929 l 215.863 646.929 216.113 646.675 216.113 646.39 c 216.113
 643.519 l 216.113 643.234 215.863 642.98 215.574 642.98 c h
215.574 642.98 m f
224.004 650.515 m 223.789 650.515 223.645 650.37 223.645 650.155 c 223.645
 649.796 l 224.363 649.796 l 224.363 650.155 l 224.363 650.37 224.219 650.515
 224.004 650.515 c h
224.004 650.515 m f
222.93 650.515 m 222.715 650.515 222.57 650.37 222.57 650.155 c 222.57 
649.796 l 223.289 649.796 l 223.289 650.155 l 223.289 650.37 223.145 650.515
 222.93 650.515 c h
222.93 650.515 m f
225.082 650.515 m 224.867 650.515 224.723 650.37 224.723 650.155 c 224.723
 649.796 l 225.441 649.796 l 225.441 650.155 l 225.441 650.37 225.297 650.515
 225.082 650.515 c h
225.082 650.515 m f
226.156 650.515 m 225.941 650.515 225.797 650.37 225.797 650.155 c 225.797
 649.796 l 226.516 649.796 l 226.516 650.155 l 226.516 650.37 226.371 650.515
 226.156 650.515 c h
226.156 650.515 m f
227.234 650.515 m 227.02 650.515 226.875 650.37 226.875 650.155 c 226.875
 649.796 l 227.594 649.796 l 227.594 650.155 l 227.594 650.37 227.449 650.515
 227.234 650.515 c h
227.234 650.515 m f
228.309 650.515 m 228.094 650.515 227.949 650.37 227.949 650.155 c 227.949
 649.796 l 228.668 649.796 l 228.668 650.155 l 228.668 650.37 228.523 650.515
 228.309 650.515 c h
228.309 650.515 m f
229.387 650.515 m 229.172 650.515 229.027 650.37 229.027 650.155 c 229.027
 649.796 l 229.746 649.796 l 229.746 650.155 l 229.746 650.37 229.602 650.515
 229.387 650.515 c h
229.387 650.515 m f
230.461 650.515 m 230.246 650.515 230.102 650.37 230.102 650.155 c 230.102
 649.796 l 230.82 649.796 l 230.82 650.155 l 230.82 650.37 230.676 650.515
 230.461 650.515 c h
230.461 650.515 m f
231.539 650.515 m 231.324 650.515 231.18 650.37 231.18 650.155 c 231.18
 649.796 l 231.898 649.796 l 231.898 650.155 l 231.898 650.37 231.754 650.515
 231.539 650.515 c h
231.539 650.515 m f
232.613 650.515 m 232.398 650.515 232.254 650.37 232.254 650.155 c 232.254
 649.796 l 232.973 649.796 l 232.973 650.155 l 232.973 650.37 232.828 650.515
 232.613 650.515 c h
232.613 650.515 m f
233.691 650.515 m 233.477 650.515 233.332 650.37 233.332 650.155 c 233.332
 649.796 l 234.051 649.796 l 234.051 650.155 l 234.051 650.37 233.906 650.515
 233.691 650.515 c h
233.691 650.515 m f
234.766 650.515 m 234.551 650.515 234.406 650.37 234.406 650.155 c 234.406
 649.796 l 235.125 649.796 l 235.125 650.155 l 235.125 650.37 234.98 650.515
 234.766 650.515 c h
234.766 650.515 m f
235.844 650.515 m 235.629 650.515 235.484 650.37 235.484 650.155 c 235.484
 649.796 l 236.203 649.796 l 236.203 650.155 l 236.203 650.37 236.059 650.515
 235.844 650.515 c h
235.844 650.515 m f
236.918 650.515 m 236.703 650.515 236.562 650.37 236.562 650.155 c 236.562
 649.796 l 237.277 649.796 l 237.277 650.155 l 237.277 650.37 237.133 650.515
 236.918 650.515 c h
236.918 650.515 m f
235.844 645.132 m 236.059 645.132 236.203 645.276 236.203 645.491 c 236.203
 645.851 l 235.484 645.851 l 235.484 645.491 l 235.484 645.276 235.629 645.132
 235.844 645.132 c h
235.844 645.132 m f
236.918 645.132 m 237.133 645.132 237.277 645.276 237.277 645.491 c 237.277
 645.851 l 236.562 645.851 l 236.562 645.491 l 236.562 645.276 236.703 645.132
 236.918 645.132 c h
236.918 645.132 m f
234.766 645.132 m 234.98 645.132 235.125 645.276 235.125 645.491 c 235.125
 645.851 l 234.406 645.851 l 234.406 645.491 l 234.406 645.276 234.551 645.132
 234.766 645.132 c h
234.766 645.132 m f
233.691 645.132 m 233.906 645.132 234.051 645.276 234.051 645.491 c 234.051
 645.851 l 233.332 645.851 l 233.332 645.491 l 233.332 645.276 233.477 645.132
 233.691 645.132 c h
233.691 645.132 m f
232.613 645.132 m 232.828 645.132 232.973 645.276 232.973 645.491 c 232.973
 645.851 l 232.254 645.851 l 232.254 645.491 l 232.254 645.276 232.398 645.132
 232.613 645.132 c h
232.613 645.132 m f
231.539 645.132 m 231.754 645.132 231.898 645.276 231.898 645.491 c 231.898
 645.851 l 231.18 645.851 l 231.18 645.491 l 231.18 645.276 231.324 645.132
 231.539 645.132 c h
231.539 645.132 m f
230.461 645.132 m 230.676 645.132 230.82 645.276 230.82 645.491 c 230.82
 645.851 l 230.102 645.851 l 230.102 645.491 l 230.102 645.276 230.246 645.132
 230.461 645.132 c h
230.461 645.132 m f
229.387 645.132 m 229.602 645.132 229.746 645.276 229.746 645.491 c 229.746
 645.851 l 229.027 645.851 l 229.027 645.491 l 229.027 645.276 229.172 645.132
 229.387 645.132 c h
229.387 645.132 m f
228.309 645.132 m 228.523 645.132 228.668 645.276 228.668 645.491 c 228.668
 645.851 l 227.949 645.851 l 227.949 645.491 l 227.949 645.276 228.094 645.132
 228.309 645.132 c h
228.309 645.132 m f
227.234 645.132 m 227.449 645.132 227.594 645.276 227.594 645.491 c 227.594
 645.851 l 226.875 645.851 l 226.875 645.491 l 226.875 645.276 227.02 645.132
 227.234 645.132 c h
227.234 645.132 m f
226.156 645.132 m 226.371 645.132 226.516 645.276 226.516 645.491 c 226.516
 645.851 l 225.797 645.851 l 225.797 645.491 l 225.797 645.276 225.941 645.132
 226.156 645.132 c h
226.156 645.132 m f
225.082 645.132 m 225.297 645.132 225.441 645.276 225.441 645.491 c 225.441
 645.851 l 224.723 645.851 l 224.723 645.491 l 224.723 645.276 224.867 645.132
 225.082 645.132 c h
225.082 645.132 m f
224.004 645.132 m 224.219 645.132 224.363 645.276 224.363 645.491 c 224.363
 645.851 l 223.645 645.851 l 223.645 645.491 l 223.645 645.276 223.789 645.132
 224.004 645.132 c h
224.004 645.132 m f
222.93 645.132 m 223.145 645.132 223.289 645.276 223.289 645.491 c 223.289
 645.851 l 222.57 645.851 l 222.57 645.491 l 222.57 645.276 222.715 645.132
 222.93 645.132 c h
222.93 645.132 m f
237.637 649.441 m 222.211 649.441 l 221.996 649.441 221.852 649.296 221.852
 649.081 c 221.852 646.569 l 221.852 646.355 221.996 646.21 222.211 646.21
 c 237.637 646.21 l 237.852 646.21 237.996 646.355 237.996 646.569 c 237.996
 649.081 l 237.996 649.296 237.852 649.441 237.637 649.441 c h
237.637 647.109 m 237.242 647.109 236.918 647.429 236.918 647.823 c 236.918
 648.218 237.242 648.542 237.637 648.542 c h
237.637 647.109 m f
238.703 660.933 m 238.309 660.933 237.988 661.257 237.988 661.651 c 237.988
 667.034 l 237.988 667.429 238.309 667.749 238.703 667.749 c 239.098 667.749
 239.422 667.429 239.422 667.034 c 239.422 661.651 l 239.422 661.257 239.098
 660.933 238.703 660.933 c h
238.703 660.933 m f
218.621 661.234 m 218.52 661.234 218.449 660.999 218.449 660.651 c 218.449
 660.066 l 218.793 660.066 l 218.793 660.651 l 218.793 660.999 218.727 661.234
 218.621 661.234 c h
218.621 661.234 m f
218.105 661.234 m 218 661.234 217.93 660.999 217.93 660.651 c 217.93 660.066
 l 218.277 660.066 l 218.277 660.651 l 218.277 660.999 218.207 661.234 218.105
 661.234 c h
218.105 661.234 m f
219.141 661.234 m 219.035 661.234 218.965 660.999 218.965 660.651 c 218.965
 660.066 l 219.312 660.066 l 219.312 660.651 l 219.312 660.999 219.242 661.234
 219.141 661.234 c h
219.141 661.234 m f
219.656 661.234 m 219.555 661.234 219.484 660.999 219.484 660.651 c 219.484
 660.066 l 219.828 660.066 l 219.828 660.651 l 219.828 660.999 219.762 661.234
 219.656 661.234 c h
219.656 661.234 m f
220.176 661.234 m 220.07 661.234 220 660.999 220 660.651 c 220 660.066 
l 220.348 660.066 l 220.348 660.651 l 220.348 660.999 220.277 661.234 220.176
 661.234 c h
220.176 661.234 m f
220.691 661.234 m 220.59 661.234 220.52 660.999 220.52 660.651 c 220.52
 660.066 l 220.863 660.066 l 220.863 660.651 l 220.863 660.999 220.797 661.234
 220.691 661.234 c h
220.691 661.234 m f
221.211 661.234 m 221.105 661.234 221.039 660.999 221.039 660.651 c 221.039
 660.066 l 221.383 660.066 l 221.383 660.651 l 221.383 660.999 221.312 661.234
 221.211 661.234 c h
221.211 661.234 m f
221.727 661.234 m 221.625 661.234 221.555 660.999 221.555 660.651 c 221.555
 660.066 l 221.898 660.066 l 221.898 660.651 l 221.898 660.999 221.832 661.234
 221.727 661.234 c h
221.727 661.234 m f
222.246 661.234 m 222.141 661.234 222.074 660.999 222.074 660.651 c 222.074
 660.066 l 222.418 660.066 l 222.418 660.651 l 222.418 660.999 222.348 661.234
 222.246 661.234 c h
222.246 661.234 m f
222.762 661.234 m 222.66 661.234 222.59 660.999 222.59 660.651 c 222.59
 660.066 l 222.934 660.066 l 222.934 660.651 l 222.934 660.999 222.867 661.234
 222.762 661.234 c h
222.762 661.234 m f
223.281 661.234 m 223.176 661.234 223.109 660.999 223.109 660.651 c 223.109
 660.066 l 223.453 660.066 l 223.453 660.651 l 223.453 660.999 223.383 661.234
 223.281 661.234 c h
223.281 661.234 m f
223.797 661.234 m 223.695 661.234 223.625 660.999 223.625 660.651 c 223.625
 660.066 l 223.973 660.066 l 223.973 660.651 l 223.973 660.999 223.902 661.234
 223.797 661.234 c h
223.797 661.234 m f
224.316 661.234 m 224.211 661.234 224.145 660.999 224.145 660.651 c 224.145
 660.066 l 224.488 660.066 l 224.488 660.651 l 224.488 660.999 224.418 661.234
 224.316 661.234 c h
224.316 661.234 m f
224.832 661.234 m 224.73 661.234 224.66 660.999 224.66 660.651 c 224.66
 660.066 l 225.008 660.066 l 225.008 660.651 l 225.008 660.999 224.938 661.234
 224.832 661.234 c h
224.832 661.234 m f
224.316 652.499 m 224.418 652.499 224.488 652.734 224.488 653.081 c 224.488
 653.663 l 224.145 653.663 l 224.145 653.081 l 224.145 652.734 224.211 652.499
 224.316 652.499 c h
224.316 652.499 m f
224.832 652.499 m 224.938 652.499 225.008 652.734 225.008 653.081 c 225.008
 653.663 l 224.66 653.663 l 224.66 653.081 l 224.66 652.734 224.73 652.499
 224.832 652.499 c h
224.832 652.499 m f
223.797 652.499 m 223.902 652.499 223.973 652.734 223.973 653.081 c 223.973
 653.663 l 223.625 653.663 l 223.625 653.081 l 223.625 652.734 223.695 652.499
 223.797 652.499 c h
223.797 652.499 m f
223.281 652.499 m 223.383 652.499 223.453 652.734 223.453 653.081 c 223.453
 653.663 l 223.109 653.663 l 223.109 653.081 l 223.109 652.734 223.176 652.499
 223.281 652.499 c h
223.281 652.499 m f
222.762 652.499 m 222.867 652.499 222.934 652.734 222.934 653.081 c 222.934
 653.663 l 222.59 653.663 l 222.59 653.081 l 222.59 652.734 222.66 652.499
 222.762 652.499 c h
222.762 652.499 m f
222.246 652.499 m 222.348 652.499 222.418 652.734 222.418 653.081 c 222.418
 653.663 l 222.074 653.663 l 222.074 653.081 l 222.074 652.734 222.141 652.499
 222.246 652.499 c h
222.246 652.499 m f
221.727 652.499 m 221.832 652.499 221.898 652.734 221.898 653.081 c 221.898
 653.663 l 221.555 653.663 l 221.555 653.081 l 221.555 652.734 221.625 652.499
 221.727 652.499 c h
221.727 652.499 m f
221.211 652.499 m 221.312 652.499 221.383 652.734 221.383 653.081 c 221.383
 653.663 l 221.039 653.663 l 221.039 653.081 l 221.039 652.734 221.105 652.499
 221.211 652.499 c h
221.211 652.499 m f
220.691 652.499 m 220.797 652.499 220.863 652.734 220.863 653.081 c 220.863
 653.663 l 220.52 653.663 l 220.52 653.081 l 220.52 652.734 220.59 652.499
 220.691 652.499 c h
220.691 652.499 m f
220.176 652.499 m 220.277 652.499 220.348 652.734 220.348 653.081 c 220.348
 653.663 l 220 653.663 l 220 653.081 l 220 652.734 220.07 652.499 220.176
 652.499 c h
220.176 652.499 m f
219.656 652.499 m 219.762 652.499 219.828 652.734 219.828 653.081 c 219.828
 653.663 l 219.484 653.663 l 219.484 653.081 l 219.484 652.734 219.555 652.499
 219.656 652.499 c h
219.656 652.499 m f
219.141 652.499 m 219.242 652.499 219.312 652.734 219.312 653.081 c 219.312
 653.663 l 218.965 653.663 l 218.965 653.081 l 218.965 652.734 219.035 652.499
 219.141 652.499 c h
219.141 652.499 m f
218.621 652.499 m 218.727 652.499 218.793 652.734 218.793 653.081 c 218.793
 653.663 l 218.449 653.663 l 218.449 653.081 l 218.449 652.734 218.52 652.499
 218.621 652.499 c h
218.621 652.499 m f
218.105 652.499 m 218.207 652.499 218.277 652.734 218.277 653.081 c 218.277
 653.663 l 217.93 653.663 l 217.93 653.081 l 217.93 652.734 218 652.499 
218.105 652.499 c h
218.105 652.499 m f
225.18 659.484 m 217.758 659.484 l 217.656 659.484 217.586 659.253 217.586
 658.901 c 217.586 654.827 l 217.586 654.48 217.656 654.245 217.758 654.245
 c 225.18 654.245 l 225.281 654.245 225.352 654.48 225.352 654.827 c 225.352
 658.901 l 225.352 659.253 225.281 659.484 225.18 659.484 c h
225.18 655.702 m 224.988 655.702 224.832 656.226 224.832 656.866 c 224.832
 657.507 224.988 658.03 225.18 658.03 c h
225.18 655.702 m f
358.152 572.245 m 331.246 572.245 l 330.852 572.245 330.531 572.566 330.531
 572.96 c 330.531 573.319 l 330.531 573.714 330.852 574.038 331.246 574.038
 c 331.5 574.038 331.75 573.894 331.859 573.679 c 357.828 573.679 l 358.477
 574.323 l 358.477 588.46 l 357.613 589.319 l 357.508 589.464 357.434 589.644
 357.434 589.823 c 357.434 594.128 l 331.965 594.128 l 331.965 591.976 l
 331.965 591.577 331.641 591.257 331.246 591.257 c 330.852 591.257 330.531
 591.577 330.531 591.976 c 330.531 594.843 l 330.531 595.237 330.852 595.562
 331.246 595.562 c 358.152 595.562 l 358.547 595.562 358.871 595.237 358.871
 594.843 c 358.871 590.109 l 359.73 589.249 l 359.875 589.105 359.945 588.925
 359.945 588.745 c 359.945 574.038 l 359.945 573.859 359.875 573.679 359.73
 573.534 c 358.656 572.46 l 358.512 572.316 358.332 572.245 358.152 572.245
 c h
358.152 572.245 m f
331.246 578.702 m 330.852 578.702 330.531 579.023 330.531 579.417 c 330.531
 584.8 l 330.531 585.194 330.852 585.515 331.246 585.515 c 331.641 585.515
 331.965 585.194 331.965 584.8 c 331.965 579.417 l 331.965 579.023 331.641
 578.702 331.246 578.702 c h
331.246 578.702 m f
333.938 585.874 m 328.199 585.874 l 327.91 585.874 327.66 586.128 327.66
 586.413 c 327.66 590.359 l 327.66 590.648 327.91 590.898 328.199 590.898
 c 333.938 590.898 l 334.227 590.898 334.477 590.648 334.477 590.359 c 334.477
 586.413 l 334.477 586.128 334.227 585.874 333.938 585.874 c h
333.938 585.874 m f
335.016 574.398 m 329.992 574.398 l 329.707 574.398 329.453 574.648 329.453
 574.933 c 329.453 577.804 l 329.453 578.089 329.707 578.343 329.992 578.343
 c 335.016 578.343 l 335.301 578.343 335.551 578.089 335.551 577.804 c 335.551
 574.933 l 335.551 574.648 335.301 574.398 335.016 574.398 c h
335.016 574.398 m f
343.445 581.929 m 343.23 581.929 343.086 581.784 343.086 581.569 c 343.086
 581.21 l 343.805 581.21 l 343.805 581.569 l 343.805 581.784 343.66 581.929
 343.445 581.929 c h
343.445 581.929 m f
342.367 581.929 m 342.152 581.929 342.008 581.784 342.008 581.569 c 342.008
 581.21 l 342.727 581.21 l 342.727 581.569 l 342.727 581.784 342.582 581.929
 342.367 581.929 c h
342.367 581.929 m f
344.52 581.929 m 344.305 581.929 344.164 581.784 344.164 581.569 c 344.164
 581.21 l 344.879 581.21 l 344.879 581.569 l 344.879 581.784 344.734 581.929
 344.52 581.929 c h
344.52 581.929 m f
345.598 581.929 m 345.383 581.929 345.238 581.784 345.238 581.569 c 345.238
 581.21 l 345.957 581.21 l 345.957 581.569 l 345.957 581.784 345.812 581.929
 345.598 581.929 c h
345.598 581.929 m f
346.672 581.929 m 346.457 581.929 346.316 581.784 346.316 581.569 c 346.316
 581.21 l 347.031 581.21 l 347.031 581.569 l 347.031 581.784 346.887 581.929
 346.672 581.929 c h
346.672 581.929 m f
347.75 581.929 m 347.535 581.929 347.391 581.784 347.391 581.569 c 347.391
 581.21 l 348.109 581.21 l 348.109 581.569 l 348.109 581.784 347.965 581.929
 347.75 581.929 c h
347.75 581.929 m f
348.824 581.929 m 348.609 581.929 348.469 581.784 348.469 581.569 c 348.469
 581.21 l 349.184 581.21 l 349.184 581.569 l 349.184 581.784 349.039 581.929
 348.824 581.929 c h
348.824 581.929 m f
349.902 581.929 m 349.688 581.929 349.543 581.784 349.543 581.569 c 349.543
 581.21 l 350.262 581.21 l 350.262 581.569 l 350.262 581.784 350.117 581.929
 349.902 581.929 c h
349.902 581.929 m f
350.977 581.929 m 350.762 581.929 350.621 581.784 350.621 581.569 c 350.621
 581.21 l 351.336 581.21 l 351.336 581.569 l 351.336 581.784 351.191 581.929
 350.977 581.929 c h
350.977 581.929 m f
352.055 581.929 m 351.84 581.929 351.695 581.784 351.695 581.569 c 351.695
 581.21 l 352.414 581.21 l 352.414 581.569 l 352.414 581.784 352.27 581.929
 352.055 581.929 c h
352.055 581.929 m f
353.129 581.929 m 352.914 581.929 352.773 581.784 352.773 581.569 c 352.773
 581.21 l 353.488 581.21 l 353.488 581.569 l 353.488 581.784 353.348 581.929
 353.129 581.929 c h
353.129 581.929 m f
354.207 581.929 m 353.992 581.929 353.848 581.784 353.848 581.569 c 353.848
 581.21 l 354.566 581.21 l 354.566 581.569 l 354.566 581.784 354.422 581.929
 354.207 581.929 c h
354.207 581.929 m f
355.281 581.929 m 355.066 581.929 354.926 581.784 354.926 581.569 c 354.926
 581.21 l 355.641 581.21 l 355.641 581.569 l 355.641 581.784 355.5 581.929
 355.281 581.929 c h
355.281 581.929 m f
356.359 581.929 m 356.145 581.929 356 581.784 356 581.569 c 356 581.21 
l 356.719 581.21 l 356.719 581.569 l 356.719 581.784 356.574 581.929 356.359
 581.929 c h
356.359 581.929 m f
355.281 576.55 m 355.5 576.55 355.641 576.691 355.641 576.905 c 355.641
 577.265 l 354.926 577.265 l 354.926 576.905 l 354.926 576.691 355.066 576.55
 355.281 576.55 c h
355.281 576.55 m f
356.359 576.55 m 356.574 576.55 356.719 576.691 356.719 576.905 c 356.719
 577.265 l 356 577.265 l 356 576.905 l 356 576.691 356.145 576.55 356.359
 576.55 c h
356.359 576.55 m f
354.207 576.55 m 354.422 576.55 354.566 576.691 354.566 576.905 c 354.566
 577.265 l 353.848 577.265 l 353.848 576.905 l 353.848 576.691 353.992 576.55
 354.207 576.55 c h
354.207 576.55 m f
353.129 576.55 m 353.348 576.55 353.488 576.691 353.488 576.905 c 353.488
 577.265 l 352.773 577.265 l 352.773 576.905 l 352.773 576.691 352.914 576.55
 353.129 576.55 c h
353.129 576.55 m f
352.055 576.55 m 352.27 576.55 352.414 576.691 352.414 576.905 c 352.414
 577.265 l 351.695 577.265 l 351.695 576.905 l 351.695 576.691 351.84 576.55
 352.055 576.55 c h
352.055 576.55 m f
350.977 576.55 m 351.191 576.55 351.336 576.691 351.336 576.905 c 351.336
 577.265 l 350.621 577.265 l 350.621 576.905 l 350.621 576.691 350.762 576.55
 350.977 576.55 c h
350.977 576.55 m f
349.902 576.55 m 350.117 576.55 350.262 576.691 350.262 576.905 c 350.262
 577.265 l 349.543 577.265 l 349.543 576.905 l 349.543 576.691 349.688 576.55
 349.902 576.55 c h
349.902 576.55 m f
348.824 576.55 m 349.039 576.55 349.184 576.691 349.184 576.905 c 349.184
 577.265 l 348.469 577.265 l 348.469 576.905 l 348.469 576.691 348.609 576.55
 348.824 576.55 c h
348.824 576.55 m f
347.75 576.55 m 347.965 576.55 348.109 576.691 348.109 576.905 c 348.109
 577.265 l 347.391 577.265 l 347.391 576.905 l 347.391 576.691 347.535 576.55
 347.75 576.55 c h
347.75 576.55 m f
346.672 576.55 m 346.887 576.55 347.031 576.691 347.031 576.905 c 347.031
 577.265 l 346.316 577.265 l 346.316 576.905 l 346.316 576.691 346.457 576.55
 346.672 576.55 c h
346.672 576.55 m f
345.598 576.55 m 345.812 576.55 345.957 576.691 345.957 576.905 c 345.957
 577.265 l 345.238 577.265 l 345.238 576.905 l 345.238 576.691 345.383 576.55
 345.598 576.55 c h
345.598 576.55 m f
344.52 576.55 m 344.734 576.55 344.879 576.691 344.879 576.905 c 344.879
 577.265 l 344.164 577.265 l 344.164 576.905 l 344.164 576.691 344.305 576.55
 344.52 576.55 c h
344.52 576.55 m f
343.445 576.55 m 343.66 576.55 343.805 576.691 343.805 576.905 c 343.805
 577.265 l 343.086 577.265 l 343.086 576.905 l 343.086 576.691 343.23 576.55
 343.445 576.55 c h
343.445 576.55 m f
342.367 576.55 m 342.582 576.55 342.727 576.691 342.727 576.905 c 342.727
 577.265 l 342.008 577.265 l 342.008 576.905 l 342.008 576.691 342.152 576.55
 342.367 576.55 c h
342.367 576.55 m f
357.078 580.855 m 341.652 580.855 l 341.438 580.855 341.293 580.71 341.293
 580.495 c 341.293 577.984 l 341.293 577.769 341.438 577.624 341.652 577.624
 c 357.078 577.624 l 357.293 577.624 357.434 577.769 357.434 577.984 c 357.434
 580.495 l 357.434 580.71 357.293 580.855 357.078 580.855 c h
357.078 578.523 m 356.684 578.523 356.359 578.843 356.359 579.237 c 356.359
 579.632 356.684 579.956 357.078 579.956 c h
357.078 578.523 m f
358.145 592.347 m 357.75 592.347 357.426 592.671 357.426 593.066 c 357.426
 598.448 l 357.426 598.843 357.75 599.163 358.145 599.163 c 358.539 599.163
 358.863 598.843 358.863 598.448 c 358.863 593.066 l 358.863 592.671 358.539
 592.347 358.145 592.347 c h
358.145 592.347 m f
338.062 592.648 m 337.957 592.648 337.887 592.413 337.887 592.066 c 337.887
 591.484 l 338.234 591.484 l 338.234 592.066 l 338.234 592.413 338.164 592.648
 338.062 592.648 c h
338.062 592.648 m f
337.543 592.648 m 337.441 592.648 337.371 592.413 337.371 592.066 c 337.371
 591.484 l 337.715 591.484 l 337.715 592.066 l 337.715 592.413 337.648 592.648
 337.543 592.648 c h
337.543 592.648 m f
338.578 592.648 m 338.477 592.648 338.406 592.413 338.406 592.066 c 338.406
 591.484 l 338.75 591.484 l 338.75 592.066 l 338.75 592.413 338.684 592.648
 338.578 592.648 c h
338.578 592.648 m f
339.098 592.648 m 338.992 592.648 338.926 592.413 338.926 592.066 c 338.926
 591.484 l 339.27 591.484 l 339.27 592.066 l 339.27 592.413 339.199 592.648
 339.098 592.648 c h
339.098 592.648 m f
339.613 592.648 m 339.512 592.648 339.441 592.413 339.441 592.066 c 339.441
 591.484 l 339.785 591.484 l 339.785 592.066 l 339.785 592.413 339.719 592.648
 339.613 592.648 c h
339.613 592.648 m f
340.133 592.648 m 340.027 592.648 339.961 592.413 339.961 592.066 c 339.961
 591.484 l 340.305 591.484 l 340.305 592.066 l 340.305 592.413 340.234 592.648
 340.133 592.648 c h
340.133 592.648 m f
340.648 592.648 m 340.547 592.648 340.477 592.413 340.477 592.066 c 340.477
 591.484 l 340.82 591.484 l 340.82 592.066 l 340.82 592.413 340.754 592.648
 340.648 592.648 c h
340.648 592.648 m f
341.168 592.648 m 341.062 592.648 340.996 592.413 340.996 592.066 c 340.996
 591.484 l 341.34 591.484 l 341.34 592.066 l 341.34 592.413 341.27 592.648
 341.168 592.648 c h
341.168 592.648 m f
341.684 592.648 m 341.582 592.648 341.512 592.413 341.512 592.066 c 341.512
 591.484 l 341.859 591.484 l 341.859 592.066 l 341.859 592.413 341.789 592.648
 341.684 592.648 c h
341.684 592.648 m f
342.203 592.648 m 342.098 592.648 342.031 592.413 342.031 592.066 c 342.031
 591.484 l 342.375 591.484 l 342.375 592.066 l 342.375 592.413 342.305 592.648
 342.203 592.648 c h
342.203 592.648 m f
342.719 592.648 m 342.617 592.648 342.547 592.413 342.547 592.066 c 342.547
 591.484 l 342.895 591.484 l 342.895 592.066 l 342.895 592.413 342.824 592.648
 342.719 592.648 c h
342.719 592.648 m f
343.238 592.648 m 343.133 592.648 343.066 592.413 343.066 592.066 c 343.066
 591.484 l 343.41 591.484 l 343.41 592.066 l 343.41 592.413 343.34 592.648
 343.238 592.648 c h
343.238 592.648 m f
343.754 592.648 m 343.652 592.648 343.582 592.413 343.582 592.066 c 343.582
 591.484 l 343.93 591.484 l 343.93 592.066 l 343.93 592.413 343.859 592.648
 343.754 592.648 c h
343.754 592.648 m f
344.273 592.648 m 344.168 592.648 344.102 592.413 344.102 592.066 c 344.102
 591.484 l 344.445 591.484 l 344.445 592.066 l 344.445 592.413 344.375 592.648
 344.273 592.648 c h
344.273 592.648 m f
343.754 583.913 m 343.859 583.913 343.93 584.148 343.93 584.495 c 343.93
 585.077 l 343.582 585.077 l 343.582 584.495 l 343.582 584.148 343.652 583.913
 343.754 583.913 c h
343.754 583.913 m f
344.273 583.913 m 344.375 583.913 344.445 584.148 344.445 584.495 c 344.445
 585.077 l 344.102 585.077 l 344.102 584.495 l 344.102 584.148 344.168 583.913
 344.273 583.913 c h
344.273 583.913 m f
343.238 583.913 m 343.34 583.913 343.41 584.148 343.41 584.495 c 343.41
 585.077 l 343.066 585.077 l 343.066 584.495 l 343.066 584.148 343.133 583.913
 343.238 583.913 c h
343.238 583.913 m f
342.719 583.913 m 342.824 583.913 342.895 584.148 342.895 584.495 c 342.895
 585.077 l 342.547 585.077 l 342.547 584.495 l 342.547 584.148 342.617 583.913
 342.719 583.913 c h
342.719 583.913 m f
342.203 583.913 m 342.305 583.913 342.375 584.148 342.375 584.495 c 342.375
 585.077 l 342.031 585.077 l 342.031 584.495 l 342.031 584.148 342.098 583.913
 342.203 583.913 c h
342.203 583.913 m f
341.684 583.913 m 341.789 583.913 341.859 584.148 341.859 584.495 c 341.859
 585.077 l 341.512 585.077 l 341.512 584.495 l 341.512 584.148 341.582 583.913
 341.684 583.913 c h
341.684 583.913 m f
341.168 583.913 m 341.27 583.913 341.34 584.148 341.34 584.495 c 341.34
 585.077 l 340.996 585.077 l 340.996 584.495 l 340.996 584.148 341.062 583.913
 341.168 583.913 c h
341.168 583.913 m f
340.648 583.913 m 340.754 583.913 340.82 584.148 340.82 584.495 c 340.82
 585.077 l 340.477 585.077 l 340.477 584.495 l 340.477 584.148 340.547 583.913
 340.648 583.913 c h
340.648 583.913 m f
340.133 583.913 m 340.234 583.913 340.305 584.148 340.305 584.495 c 340.305
 585.077 l 339.961 585.077 l 339.961 584.495 l 339.961 584.148 340.027 583.913
 340.133 583.913 c h
340.133 583.913 m f
339.613 583.913 m 339.719 583.913 339.785 584.148 339.785 584.495 c 339.785
 585.077 l 339.441 585.077 l 339.441 584.495 l 339.441 584.148 339.512 583.913
 339.613 583.913 c h
339.613 583.913 m f
339.098 583.913 m 339.199 583.913 339.27 584.148 339.27 584.495 c 339.27
 585.077 l 338.926 585.077 l 338.926 584.495 l 338.926 584.148 338.992 583.913
 339.098 583.913 c h
339.098 583.913 m f
338.578 583.913 m 338.684 583.913 338.75 584.148 338.75 584.495 c 338.75
 585.077 l 338.406 585.077 l 338.406 584.495 l 338.406 584.148 338.477 583.913
 338.578 583.913 c h
338.578 583.913 m f
338.062 583.913 m 338.164 583.913 338.234 584.148 338.234 584.495 c 338.234
 585.077 l 337.887 585.077 l 337.887 584.495 l 337.887 584.148 337.957 583.913
 338.062 583.913 c h
338.062 583.913 m f
337.543 583.913 m 337.648 583.913 337.715 584.148 337.715 584.495 c 337.715
 585.077 l 337.371 585.077 l 337.371 584.495 l 337.371 584.148 337.441 583.913
 337.543 583.913 c h
337.543 583.913 m f
344.617 590.901 m 337.199 590.901 l 337.094 590.901 337.027 590.667 337.027
 590.319 c 337.027 586.241 l 337.027 585.894 337.094 585.659 337.199 585.659
 c 344.617 585.659 l 344.723 585.659 344.789 585.894 344.789 586.241 c 344.789
 590.319 l 344.789 590.667 344.723 590.901 344.617 590.901 c h
344.617 587.116 m 344.43 587.116 344.273 587.64 344.273 588.28 c 344.273
 588.921 344.43 589.444 344.617 589.444 c h
344.617 587.116 m f
438.152 703.671 m 411.246 703.671 l 410.852 703.671 410.527 703.991 410.527
 704.386 c 410.527 704.745 l 410.527 705.14 410.852 705.464 411.246 705.464
 c 411.496 705.464 411.75 705.319 411.855 705.105 c 437.828 705.105 l 438.473
 705.749 l 438.473 719.886 l 437.613 720.745 l 437.504 720.89 437.434 721.069
 437.434 721.249 c 437.434 725.554 l 411.965 725.554 l 411.965 723.401 l
 411.965 723.007 411.641 722.683 411.246 722.683 c 410.852 722.683 410.527
 723.007 410.527 723.401 c 410.527 726.269 l 410.527 726.663 410.852 726.987
 411.246 726.987 c 438.152 726.987 l 438.547 726.987 438.867 726.663 438.867
 726.269 c 438.867 721.534 l 439.73 720.675 l 439.875 720.53 439.945 720.351
 439.945 720.171 c 439.945 705.464 l 439.945 705.284 439.875 705.105 439.73
 704.96 c 438.652 703.886 l 438.512 703.741 438.332 703.671 438.152 703.671
 c h
438.152 703.671 m f
411.246 710.128 m 410.852 710.128 410.527 710.448 410.527 710.843 c 410.527
 716.226 l 410.527 716.62 410.852 716.944 411.246 716.944 c 411.641 716.944
 411.965 716.62 411.965 716.226 c 411.965 710.843 l 411.965 710.448 411.641
 710.128 411.246 710.128 c h
411.246 710.128 m f
413.938 717.3 m 408.195 717.3 l 407.91 717.3 407.66 717.554 407.66 717.839
 c 407.66 721.784 l 407.66 722.073 407.91 722.323 408.195 722.323 c 413.938
 722.323 l 414.223 722.323 414.477 722.073 414.477 721.784 c 414.477 717.839
 l 414.477 717.554 414.223 717.3 413.938 717.3 c h
413.938 717.3 m f
415.012 705.823 m 409.992 705.823 l 409.703 705.823 409.453 706.073 409.453
 706.359 c 409.453 709.23 l 409.453 709.519 409.703 709.769 409.992 709.769
 c 415.012 709.769 l 415.301 709.769 415.551 709.519 415.551 709.23 c 415.551
 706.359 l 415.551 706.073 415.301 705.823 415.012 705.823 c h
415.012 705.823 m f
423.441 713.355 m 423.227 713.355 423.086 713.21 423.086 712.995 c 423.086
 712.64 l 423.801 712.64 l 423.801 712.995 l 423.801 713.21 423.66 713.355
 423.441 713.355 c h
423.441 713.355 m f
422.367 713.355 m 422.152 713.355 422.008 713.21 422.008 712.995 c 422.008
 712.64 l 422.727 712.64 l 422.727 712.995 l 422.727 713.21 422.582 713.355
 422.367 713.355 c h
422.367 713.355 m f
424.52 713.355 m 424.305 713.355 424.16 713.21 424.16 712.995 c 424.16 
712.64 l 424.879 712.64 l 424.879 712.995 l 424.879 713.21 424.734 713.355
 424.52 713.355 c h
424.52 713.355 m f
425.594 713.355 m 425.379 713.355 425.238 713.21 425.238 712.995 c 425.238
 712.64 l 425.953 712.64 l 425.953 712.995 l 425.953 713.21 425.812 713.355
 425.594 713.355 c h
425.594 713.355 m f
426.672 713.355 m 426.457 713.355 426.312 713.21 426.312 712.995 c 426.312
 712.64 l 427.031 712.64 l 427.031 712.995 l 427.031 713.21 426.887 713.355
 426.672 713.355 c h
426.672 713.355 m f
427.75 713.355 m 427.531 713.355 427.391 713.21 427.391 712.995 c 427.391
 712.64 l 428.105 712.64 l 428.105 712.995 l 428.105 713.21 427.965 713.355
 427.75 713.355 c h
427.75 713.355 m f
428.824 713.355 m 428.609 713.355 428.465 713.21 428.465 712.995 c 428.465
 712.64 l 429.184 712.64 l 429.184 712.995 l 429.184 713.21 429.039 713.355
 428.824 713.355 c h
428.824 713.355 m f
429.902 713.355 m 429.684 713.355 429.543 713.21 429.543 712.995 c 429.543
 712.64 l 430.258 712.64 l 430.258 712.995 l 430.258 713.21 430.117 713.355
 429.902 713.355 c h
429.902 713.355 m f
430.977 713.355 m 430.762 713.355 430.617 713.21 430.617 712.995 c 430.617
 712.64 l 431.336 712.64 l 431.336 712.995 l 431.336 713.21 431.191 713.355
 430.977 713.355 c h
430.977 713.355 m f
432.055 713.355 m 431.836 713.355 431.695 713.21 431.695 712.995 c 431.695
 712.64 l 432.41 712.64 l 432.41 712.995 l 432.41 713.21 432.27 713.355 
432.055 713.355 c h
432.055 713.355 m f
433.129 713.355 m 432.914 713.355 432.77 713.21 432.77 712.995 c 432.77
 712.64 l 433.488 712.64 l 433.488 712.995 l 433.488 713.21 433.344 713.355
 433.129 713.355 c h
433.129 713.355 m f
434.207 713.355 m 433.988 713.355 433.848 713.21 433.848 712.995 c 433.848
 712.64 l 434.562 712.64 l 434.562 712.995 l 434.562 713.21 434.422 713.355
 434.207 713.355 c h
434.207 713.355 m f
435.281 713.355 m 435.066 713.355 434.922 713.21 434.922 712.995 c 434.922
 712.64 l 435.641 712.64 l 435.641 712.995 l 435.641 713.21 435.496 713.355
 435.281 713.355 c h
435.281 713.355 m f
436.359 713.355 m 436.141 713.355 436 713.21 436 712.995 c 436 712.64 l
 436.715 712.64 l 436.715 712.995 l 436.715 713.21 436.574 713.355 436.359
 713.355 c h
436.359 713.355 m f
435.281 707.976 m 435.496 707.976 435.641 708.116 435.641 708.335 c 435.641
 708.691 l 434.922 708.691 l 434.922 708.335 l 434.922 708.116 435.066 707.976
 435.281 707.976 c h
435.281 707.976 m f
436.359 707.976 m 436.574 707.976 436.715 708.116 436.715 708.335 c 436.715
 708.691 l 436 708.691 l 436 708.335 l 436 708.116 436.141 707.976 436.359
 707.976 c h
436.359 707.976 m f
434.207 707.976 m 434.422 707.976 434.562 708.116 434.562 708.335 c 434.562
 708.691 l 433.848 708.691 l 433.848 708.335 l 433.848 708.116 433.988 707.976
 434.207 707.976 c h
434.207 707.976 m f
433.129 707.976 m 433.344 707.976 433.488 708.116 433.488 708.335 c 433.488
 708.691 l 432.77 708.691 l 432.77 708.335 l 432.77 708.116 432.914 707.976
 433.129 707.976 c h
433.129 707.976 m f
432.055 707.976 m 432.27 707.976 432.41 708.116 432.41 708.335 c 432.41
 708.691 l 431.695 708.691 l 431.695 708.335 l 431.695 708.116 431.836 707.976
 432.055 707.976 c h
432.055 707.976 m f
430.977 707.976 m 431.191 707.976 431.336 708.116 431.336 708.335 c 431.336
 708.691 l 430.617 708.691 l 430.617 708.335 l 430.617 708.116 430.762 707.976
 430.977 707.976 c h
430.977 707.976 m f
429.902 707.976 m 430.117 707.976 430.258 708.116 430.258 708.335 c 430.258
 708.691 l 429.543 708.691 l 429.543 708.335 l 429.543 708.116 429.684 707.976
 429.902 707.976 c h
429.902 707.976 m f
428.824 707.976 m 429.039 707.976 429.184 708.116 429.184 708.335 c 429.184
 708.691 l 428.465 708.691 l 428.465 708.335 l 428.465 708.116 428.609 707.976
 428.824 707.976 c h
428.824 707.976 m f
427.75 707.976 m 427.965 707.976 428.105 708.116 428.105 708.335 c 428.105
 708.691 l 427.391 708.691 l 427.391 708.335 l 427.391 708.116 427.531 707.976
 427.75 707.976 c h
427.75 707.976 m f
426.672 707.976 m 426.887 707.976 427.031 708.116 427.031 708.335 c 427.031
 708.691 l 426.312 708.691 l 426.312 708.335 l 426.312 708.116 426.457 707.976
 426.672 707.976 c h
426.672 707.976 m f
425.594 707.976 m 425.812 707.976 425.953 708.116 425.953 708.335 c 425.953
 708.691 l 425.238 708.691 l 425.238 708.335 l 425.238 708.116 425.379 707.976
 425.594 707.976 c h
425.594 707.976 m f
424.52 707.976 m 424.734 707.976 424.879 708.116 424.879 708.335 c 424.879
 708.691 l 424.16 708.691 l 424.16 708.335 l 424.16 708.116 424.305 707.976
 424.52 707.976 c h
424.52 707.976 m f
423.441 707.976 m 423.66 707.976 423.801 708.116 423.801 708.335 c 423.801
 708.691 l 423.086 708.691 l 423.086 708.335 l 423.086 708.116 423.227 707.976
 423.441 707.976 c h
423.441 707.976 m f
422.367 707.976 m 422.582 707.976 422.727 708.116 422.727 708.335 c 422.727
 708.691 l 422.008 708.691 l 422.008 708.335 l 422.008 708.116 422.152 707.976
 422.367 707.976 c h
422.367 707.976 m f
437.074 712.28 m 421.648 712.28 l 421.434 712.28 421.289 712.136 421.289
 711.921 c 421.289 709.409 l 421.289 709.194 421.434 709.05 421.648 709.05
 c 437.074 709.05 l 437.289 709.05 437.434 709.194 437.434 709.409 c 437.434
 711.921 l 437.434 712.136 437.289 712.28 437.074 712.28 c h
437.074 709.948 m 436.68 709.948 436.359 710.269 436.359 710.663 c 436.359
 711.058 436.68 711.382 437.074 711.382 c h
437.074 709.948 m f
438.145 723.776 m 437.746 723.776 437.426 724.097 437.426 724.491 c 437.426
 729.874 l 437.426 730.269 437.746 730.589 438.145 730.589 c 438.539 730.589
 438.859 730.269 438.859 729.874 c 438.859 724.491 l 438.859 724.097 438.539
 723.776 438.145 723.776 c h
438.145 723.776 m f
418.059 724.073 m 417.957 724.073 417.887 723.839 417.887 723.491 c 417.887
 722.909 l 418.23 722.909 l 418.23 723.491 l 418.23 723.839 418.164 724.073
 418.059 724.073 c h
418.059 724.073 m f
417.543 724.073 m 417.438 724.073 417.371 723.839 417.371 723.491 c 417.371
 722.909 l 417.715 722.909 l 417.715 723.491 l 417.715 723.839 417.645 724.073
 417.543 724.073 c h
417.543 724.073 m f
418.578 724.073 m 418.473 724.073 418.406 723.839 418.406 723.491 c 418.406
 722.909 l 418.75 722.909 l 418.75 723.491 l 418.75 723.839 418.68 724.073
 418.578 724.073 c h
418.578 724.073 m f
419.094 724.073 m 418.992 724.073 418.922 723.839 418.922 723.491 c 418.922
 722.909 l 419.27 722.909 l 419.27 723.491 l 419.27 723.839 419.199 724.073
 419.094 724.073 c h
419.094 724.073 m f
419.613 724.073 m 419.508 724.073 419.441 723.839 419.441 723.491 c 419.441
 722.909 l 419.785 722.909 l 419.785 723.491 l 419.785 723.839 419.715 724.073
 419.613 724.073 c h
419.613 724.073 m f
420.129 724.073 m 420.027 724.073 419.957 723.839 419.957 723.491 c 419.957
 722.909 l 420.305 722.909 l 420.305 723.491 l 420.305 723.839 420.234 724.073
 420.129 724.073 c h
420.129 724.073 m f
420.648 724.073 m 420.543 724.073 420.477 723.839 420.477 723.491 c 420.477
 722.909 l 420.82 722.909 l 420.82 723.491 l 420.82 723.839 420.75 724.073
 420.648 724.073 c h
420.648 724.073 m f
421.164 724.073 m 421.062 724.073 420.992 723.839 420.992 723.491 c 420.992
 722.909 l 421.34 722.909 l 421.34 723.491 l 421.34 723.839 421.27 724.073
 421.164 724.073 c h
421.164 724.073 m f
421.684 724.073 m 421.578 724.073 421.512 723.839 421.512 723.491 c 421.512
 722.909 l 421.855 722.909 l 421.855 723.491 l 421.855 723.839 421.785 724.073
 421.684 724.073 c h
421.684 724.073 m f
422.199 724.073 m 422.098 724.073 422.027 723.839 422.027 723.491 c 422.027
 722.909 l 422.375 722.909 l 422.375 723.491 l 422.375 723.839 422.305 724.073
 422.199 724.073 c h
422.199 724.073 m f
422.719 724.073 m 422.617 724.073 422.547 723.839 422.547 723.491 c 422.547
 722.909 l 422.891 722.909 l 422.891 723.491 l 422.891 723.839 422.824 724.073
 422.719 724.073 c h
422.719 724.073 m f
423.238 724.073 m 423.133 724.073 423.062 723.839 423.062 723.491 c 423.062
 722.909 l 423.41 722.909 l 423.41 723.491 l 423.41 723.839 423.34 724.073
 423.238 724.073 c h
423.238 724.073 m f
423.754 724.073 m 423.652 724.073 423.582 723.839 423.582 723.491 c 423.582
 722.909 l 423.926 722.909 l 423.926 723.491 l 423.926 723.839 423.859 724.073
 423.754 724.073 c h
423.754 724.073 m f
424.273 724.073 m 424.168 724.073 424.098 723.839 424.098 723.491 c 424.098
 722.909 l 424.445 722.909 l 424.445 723.491 l 424.445 723.839 424.375 724.073
 424.273 724.073 c h
424.273 724.073 m f
423.754 715.339 m 423.859 715.339 423.926 715.573 423.926 715.921 c 423.926
 716.503 l 423.582 716.503 l 423.582 715.921 l 423.582 715.573 423.652 715.339
 423.754 715.339 c h
423.754 715.339 m f
424.273 715.339 m 424.375 715.339 424.445 715.573 424.445 715.921 c 424.445
 716.503 l 424.098 716.503 l 424.098 715.921 l 424.098 715.573 424.168 715.339
 424.273 715.339 c h
424.273 715.339 m f
423.238 715.339 m 423.34 715.339 423.41 715.573 423.41 715.921 c 423.41
 716.503 l 423.062 716.503 l 423.062 715.921 l 423.062 715.573 423.133 715.339
 423.238 715.339 c h
423.238 715.339 m f
422.719 715.339 m 422.824 715.339 422.891 715.573 422.891 715.921 c 422.891
 716.503 l 422.547 716.503 l 422.547 715.921 l 422.547 715.573 422.617 715.339
 422.719 715.339 c h
422.719 715.339 m f
422.199 715.339 m 422.305 715.339 422.375 715.573 422.375 715.921 c 422.375
 716.503 l 422.027 716.503 l 422.027 715.921 l 422.027 715.573 422.098 715.339
 422.199 715.339 c h
422.199 715.339 m f
421.684 715.339 m 421.785 715.339 421.855 715.573 421.855 715.921 c 421.855
 716.503 l 421.512 716.503 l 421.512 715.921 l 421.512 715.573 421.578 715.339
 421.684 715.339 c h
421.684 715.339 m f
421.164 715.339 m 421.27 715.339 421.34 715.573 421.34 715.921 c 421.34
 716.503 l 420.992 716.503 l 420.992 715.921 l 420.992 715.573 421.062 715.339
 421.164 715.339 c h
421.164 715.339 m f
420.648 715.339 m 420.75 715.339 420.82 715.573 420.82 715.921 c 420.82
 716.503 l 420.477 716.503 l 420.477 715.921 l 420.477 715.573 420.543 715.339
 420.648 715.339 c h
420.648 715.339 m f
420.129 715.339 m 420.234 715.339 420.305 715.573 420.305 715.921 c 420.305
 716.503 l 419.957 716.503 l 419.957 715.921 l 419.957 715.573 420.027 715.339
 420.129 715.339 c h
420.129 715.339 m f
419.613 715.339 m 419.715 715.339 419.785 715.573 419.785 715.921 c 419.785
 716.503 l 419.441 716.503 l 419.441 715.921 l 419.441 715.573 419.508 715.339
 419.613 715.339 c h
419.613 715.339 m f
419.094 715.339 m 419.199 715.339 419.27 715.573 419.27 715.921 c 419.27
 716.503 l 418.922 716.503 l 418.922 715.921 l 418.922 715.573 418.992 715.339
 419.094 715.339 c h
419.094 715.339 m f
418.578 715.339 m 418.68 715.339 418.75 715.573 418.75 715.921 c 418.75
 716.503 l 418.406 716.503 l 418.406 715.921 l 418.406 715.573 418.473 715.339
 418.578 715.339 c h
418.578 715.339 m f
418.059 715.339 m 418.164 715.339 418.23 715.573 418.23 715.921 c 418.23
 716.503 l 417.887 716.503 l 417.887 715.921 l 417.887 715.573 417.957 715.339
 418.059 715.339 c h
418.059 715.339 m f
417.543 715.339 m 417.645 715.339 417.715 715.573 417.715 715.921 c 417.715
 716.503 l 417.371 716.503 l 417.371 715.921 l 417.371 715.573 417.438 715.339
 417.543 715.339 c h
417.543 715.339 m f
424.617 722.327 m 417.195 722.327 l 417.094 722.327 417.023 722.093 417.023
 721.745 c 417.023 717.667 l 417.023 717.319 417.094 717.085 417.195 717.085
 c 424.617 717.085 l 424.719 717.085 424.789 717.319 424.789 717.667 c 424.789
 721.745 l 424.789 722.093 424.719 722.327 424.617 722.327 c h
424.617 718.542 m 424.426 718.542 424.273 719.066 424.273 719.706 c 424.273
 720.347 424.426 720.87 424.617 720.87 c h
424.617 718.542 m f
Q Q
showpage
%%Trailer
end restore
%%EOF
