%!PS-Adobe-3.0 EPSF-3.0
%%Creator: cairo 1.14.2 (http://cairographics.org)
%%CreationDate: Wed Apr 29 16:05:11 2015
%%Pages: 1
%%DocumentData: Clean7Bit
%%LanguageLevel: 2
%%BoundingBox: 0 -1 676 124
%%EndComments
%%BeginProlog
save
50 dict begin
/q { gsave } bind def
/Q { grestore } bind def
/cm { 6 array astore concat } bind def
/w { setlinewidth } bind def
/J { setlinecap } bind def
/j { setlinejoin } bind def
/M { setmiterlimit } bind def
/d { setdash } bind def
/m { moveto } bind def
/l { lineto } bind def
/c { curveto } bind def
/h { closepath } bind def
/re { exch dup neg 3 1 roll 5 3 roll moveto 0 rlineto
      0 exch rlineto 0 rlineto closepath } bind def
/S { stroke } bind def
/f { fill } bind def
/f* { eofill } bind def
/n { newpath } bind def
/W { clip } bind def
/W* { eoclip } bind def
/BT { } bind def
/ET { } bind def
/pdfmark where { pop globaldict /?pdfmark /exec load put }
    { globaldict begin /?pdfmark /pop load def /pdfmark
    /cleartomark load def end } ifelse
/BDC { mark 3 1 roll /BDC pdfmark } bind def
/EMC { mark /EMC pdfmark } bind def
/cairo_store_point { /cairo_point_y exch def /cairo_point_x exch def } def
/Tj { show currentpoint cairo_store_point } bind def
/TJ {
  {
    dup
    type /stringtype eq
    { show } { -0.001 mul 0 cairo_font_matrix dtransform rmoveto } ifelse
  } forall
  currentpoint cairo_store_point
} bind def
/cairo_selectfont { cairo_font_matrix aload pop pop pop 0 0 6 array astore
    cairo_font exch selectfont cairo_point_x cairo_point_y moveto } bind def
/Tf { pop /cairo_font exch def /cairo_font_matrix where
      { pop cairo_selectfont } if } bind def
/Td { matrix translate cairo_font_matrix matrix concatmatrix dup
      /cairo_font_matrix exch def dup 4 get exch 5 get cairo_store_point
      /cairo_font where { pop cairo_selectfont } if } bind def
/Tm { 2 copy 8 2 roll 6 array astore /cairo_font_matrix exch def
      cairo_store_point /cairo_font where { pop cairo_selectfont } if } bind def
/g { setgray } bind def
/rg { setrgbcolor } bind def
/d1 { setcachedevice } bind def
%%EndProlog
%%BeginSetup
%%EndSetup
%%Page: 1 1
%%BeginPageSetup
%%PageBoundingBox: 0 -1 676 124
%%EndPageSetup
q 0 -1 676 125 rectclip q
0 g
69.645 25.698 m 51.539 25.698 l 49.98 25.698 48.617 24.334 48.617 22.78
 c 48.617 21.221 49.98 19.858 51.539 19.858 c 69.645 19.858 l 71.203 19.858
 72.562 21.221 72.562 22.78 c 72.562 24.334 71.395 25.698 69.645 25.698 
c h
69.645 25.698 m f
0.980392 0.411765 0 rg
119.094 16.159 m 104.102 39.717 l 104.102 49.061 104.297 87.221 104.297
 87.221 c 104.297 93.647 99.043 98.901 92.617 98.901 c 28.953 98.901 l 22.527
 98.901 17.273 93.647 17.273 87.221 c 17.273 87.221 17.469 49.061 17.469
 39.717 c 2.281 16.159 l -0.055 13.432 -0.641 9.541 0.723 6.034 c 2.281 
2.338 5.785 -0.002 9.68 -0.002 c 111.695 -0.002 l 115.59 -0.002 119.094 
2.338 120.652 6.034 c 122.016 9.541 121.43 13.432 119.094 16.159 c h
92.617 87.221 m 92.617 87.221 92.422 52.178 92.422 41.08 c 28.953 41.08
 l 28.953 52.178 28.758 87.221 28.758 87.221 c h
13.379 11.877 m 27.395 33.877 l 27.59 34.069 l 28.371 35.432 l 93.395 35.432
 l 94.176 34.069 l 94.176 34.069 94.176 33.877 94.367 33.877 c 108.387 11.877
 l h
13.379 11.877 m f
0 g
5.840643 w
1 J
1 j
[] 0.0 d
10 M q 1 0 0 -1 0 123.627258 cm
113.254 31.152 m 113.254 22.777 106.441 15.77 97.875 15.77 c S Q
q 1 0 0 -1 0 123.627258 cm
126.102 31.152 m 126.102 15.574 113.449 2.922 97.875 2.922 c S Q
601.344 25.698 m 583.234 25.698 l 581.68 25.698 580.316 24.334 580.316 
22.78 c 580.316 21.221 581.68 19.858 583.234 19.858 c 601.344 19.858 l 602.898
 19.858 604.262 21.221 604.262 22.78 c 604.262 24.334 603.094 25.698 601.344
 25.698 c h
601.344 25.698 m f
0.980392 0.411765 0 rg
650.793 16.159 m 635.801 39.717 l 635.801 49.061 635.996 87.221 635.996
 87.221 c 635.996 93.647 630.738 98.901 624.316 98.901 c 560.652 98.901 
l 554.227 98.901 548.973 93.647 548.973 87.221 c 548.973 87.221 549.164 
49.061 549.164 39.717 c 533.98 16.159 l 531.645 13.432 531.059 9.541 532.422
 6.034 c 533.98 2.338 537.484 -0.002 541.379 -0.002 c 643.395 -0.002 l 647.289
 -0.002 650.793 2.338 652.352 6.034 c 653.715 9.541 653.129 13.432 650.793
 16.159 c h
624.316 87.221 m 624.316 87.221 624.121 52.178 624.121 41.08 c 560.652 
41.08 l 560.652 52.178 560.457 87.221 560.457 87.221 c h
545.078 11.877 m 559.094 33.877 l 559.289 34.069 l 560.066 35.432 l 625.094
 35.432 l 625.871 34.069 l 625.871 34.069 625.871 33.877 626.066 33.877 
c 640.086 11.877 l h
545.078 11.877 m f
0 g
q -1 0 0 -1 0 123.627258 cm
-541.578 32.75 m -541.578 24.379 -548.395 17.371 -556.961 17.371 c S Q
q -1 0 0 -1 0 123.627258 cm
-528.73 32.75 m -528.73 17.176 -541.387 4.52 -556.961 4.52 c S Q
674.289 93.475 m 666.508 89.112 l 663.891 89.959 l 675.207 96.303 l h
674.289 93.475 m f
637.984 87.662 m 637.984 86.166 l 644.199 86.166 l 651.879 93.85 l 636.879
 98.705 l 636.145 98.944 635.746 99.729 635.98 100.463 c 638.918 109.534
 l 639.156 110.264 639.941 110.666 640.676 110.428 c 674.742 99.397 l 675.215
 99.244 675.547 98.866 675.66 98.416 c 661.789 90.639 l 655.398 92.709 l
 645.566 82.873 l 637.984 82.873 l 637.984 81.85 l 637.984 80.553 637.047
 79.479 635.812 79.256 c 635.812 90.256 l 637.047 90.037 637.984 88.959 
637.984 87.662 c h
637.984 87.662 m f
348.383 36.323 m 342.586 36.323 l 343.156 35.752 343.727 35.182 344.293
 34.616 c 344.652 38.553 344.688 43.174 341.199 45.807 c 337.891 48.299 
333.777 47.717 329.871 47.717 c 326.27 47.717 322.562 48.186 319.305 46.381
 c 315.113 44.057 315.074 38.764 315.449 34.616 c 317.156 36.323 l 314.082
 36.323 309.852 37.01 307.047 35.455 c 302.98 33.201 302.246 29.584 302.246
 25.319 c 302.246 21.83 302.062 18.287 302.32 14.807 c 302.695 9.67 307.496
 7.276 312.055 7.276 c 313.066 7.276 313.66 8.057 313.766 8.983 c 314.5 
15.616 323.82 15.616 324.559 8.983 c 324.66 8.057 325.258 7.276 326.266 
7.276 c 334.27 7.276 l 335.277 7.276 335.875 8.057 335.977 8.983 c 336.715
 15.616 346.027 15.616 346.773 8.987 c 346.867 8.127 347.477 7.19 348.48
 7.28 c 352.43 7.619 355.18 9.701 356.582 13.405 c 357.492 15.811 356.926
 19.311 356.926 21.799 c 356.926 24.151 357.309 26.912 356.793 29.244 c 
355.848 33.479 352.656 36.01 348.383 36.323 c 346.184 36.483 346.199 33.065
 348.383 32.905 c 354.492 32.455 353.512 26.112 353.512 21.795 c 353.512
 17.526 354.496 11.217 348.48 10.694 c 350.191 8.987 l 348.957 19.975 333.785
 19.975 332.559 8.983 c 333.129 9.553 333.699 10.123 334.27 10.69 c 326.266
 10.69 l 326.836 10.123 327.406 9.553 327.977 8.983 c 326.754 19.975 311.566
 19.975 310.348 8.983 c 310.918 9.553 311.484 10.123 312.055 10.69 c 303.867
 10.69 305.664 19.639 305.664 25.319 c 305.664 28.916 306.258 32.573 310.789
 32.905 c 312.891 33.061 315.051 32.905 317.156 32.905 c 318.027 32.905 
318.949 33.686 318.867 34.616 c 318.543 38.213 318.289 42.514 322.371 44.069
 c 324.48 44.873 327.695 44.299 329.871 44.299 c 335.852 44.299 l 341.258
 44.299 341.227 38.471 340.879 34.616 c 340.793 33.686 341.719 32.905 342.586
 32.905 c 348.383 32.905 l 350.586 32.905 350.586 36.323 348.383 36.323 
c h
348.383 36.323 m f
324.461 8.838 m 324.086 1.866 314.012 1.866 313.637 8.838 c 313.262 15.819
 324.086 15.784 324.461 8.838 c 324.578 6.647 327.996 6.635 327.879 8.838
 c 327.609 13.834 324.043 17.401 319.047 17.67 c 314.066 17.94 310.469 13.428
 310.219 8.838 c 309.953 3.858 314.457 0.26 319.047 0.01 c 324.031 -0.256
 327.629 4.252 327.879 8.838 c 327.996 11.041 324.578 11.034 324.461 8.838
 c h
324.461 8.838 m f
346.672 8.838 m 346.297 1.866 336.227 1.866 335.852 8.838 c 335.477 15.819
 346.301 15.784 346.672 8.838 c 346.793 6.647 350.211 6.635 350.09 8.838
 c 349.82 13.834 346.258 17.401 341.266 17.67 c 336.281 17.94 332.684 13.428
 332.434 8.838 c 332.168 3.858 336.676 0.26 341.266 0.01 c 346.246 -0.256
 349.844 4.252 350.09 8.838 c 350.211 11.041 346.793 11.034 346.672 8.838
 c h
346.672 8.838 m f
365.895 38.94 m 365.852 38.991 365.805 39.041 365.758 39.088 c 365.387 
39.455 364.895 39.674 364.367 39.701 c 363.773 39.733 363.195 39.506 362.777
 39.088 c 362.027 38.338 l 361.262 37.576 361.199 36.358 361.883 35.518 
c 367.371 28.78 367.371 18.994 361.883 12.256 c 361.199 11.416 361.262 10.198
 362.027 9.436 c 362.773 8.686 l 363.195 8.264 363.773 8.041 364.367 8.073
 c 364.961 8.1 365.516 8.377 365.895 8.838 c 373.066 17.557 373.066 30.217
 365.895 38.94 c h
365.895 38.94 m f
373.324 46.459 m 373.293 46.498 373.262 46.53 373.23 46.561 c 372.852 46.94
 372.344 47.159 371.809 47.178 c 371.227 47.198 370.66 46.975 370.25 46.561
 c 369.504 45.815 l 368.719 45.034 368.676 43.776 369.406 42.94 c 378.898
 32.076 378.898 15.698 369.406 4.834 c 368.676 4.002 368.719 2.744 369.504
 1.959 c 370.25 1.213 l 370.66 0.799 371.227 0.576 371.809 0.596 c 372.391
 0.616 372.938 0.873 373.324 1.315 c 384.621 14.182 384.621 33.592 373.324
 46.459 c h
373.324 46.459 m f
288.941 38.94 m 288.984 38.991 289.031 39.041 289.078 39.088 c 289.445 
39.455 289.941 39.674 290.465 39.701 c 291.059 39.733 291.637 39.506 292.059
 39.088 c 292.805 38.338 l 293.57 37.576 293.633 36.358 292.953 35.518 c
 287.465 28.78 287.465 18.994 292.953 12.256 c 293.633 11.416 293.57 10.198
 292.805 9.436 c 292.059 8.686 l 291.637 8.264 291.059 8.041 290.465 8.073
 c 289.871 8.1 289.32 8.377 288.941 8.838 c 281.766 17.557 281.766 30.217
 288.941 38.94 c h
288.941 38.94 m f
281.512 46.459 m 281.539 46.498 281.57 46.53 281.605 46.561 c 281.98 46.94
 282.488 47.159 283.027 47.178 c 283.609 47.198 284.172 46.975 284.586 46.561
 c 285.332 45.815 l 286.113 45.034 286.156 43.776 285.43 42.94 c 275.938
 32.076 275.938 15.698 285.43 4.834 c 286.156 4.002 286.113 2.744 285.332
 1.959 c 284.586 1.213 l 284.172 0.799 283.609 0.576 283.027 0.596 c 282.441
 0.616 281.895 0.873 281.512 1.315 c 270.215 14.182 270.215 33.592 281.512
 46.459 c h
281.512 46.459 m f
254.129 26.256 m 229.035 26.256 l 235.746 32.967 l 236.672 33.893 236.672
 35.393 235.746 36.319 c 234.82 37.244 233.32 37.244 232.395 36.319 c 221.637
 25.565 l 221.527 25.451 221.43 25.33 221.344 25.201 c 221.305 25.147 221.281
 25.092 221.254 25.037 c 221.207 24.955 221.16 24.877 221.125 24.791 c 221.094
 24.725 221.082 24.651 221.059 24.58 c 221.035 24.506 221.004 24.428 220.988
 24.35 c 220.965 24.229 220.957 24.108 220.953 23.983 c 220.953 23.951 220.945
 23.92 220.945 23.889 c 220.945 23.85 220.953 23.815 220.953 23.78 c 220.961
 23.662 220.965 23.545 220.988 23.424 c 221.008 23.342 221.035 23.264 221.062
 23.182 c 221.082 23.116 221.098 23.049 221.125 22.983 c 221.16 22.893 221.215
 22.807 221.262 22.721 c 221.289 22.674 221.309 22.623 221.34 22.576 c 221.43
 22.444 221.527 22.319 221.641 22.209 c 232.395 11.455 l 232.855 10.994 
233.461 10.764 234.07 10.764 c 234.676 10.764 235.281 10.994 235.746 11.455
 c 236.672 12.381 236.672 13.885 235.746 14.807 c 229.035 21.518 l 254.129
 21.518 l 255.438 21.518 256.5 22.576 256.5 23.889 c 256.5 25.198 255.438
 26.256 254.129 26.256 c h
254.129 26.256 m f
400.707 26.256 m 425.797 26.256 l 419.09 32.967 l 418.164 33.893 418.164
 35.393 419.09 36.319 c 420.016 37.244 421.516 37.244 422.441 36.319 c 433.195
 25.565 l 433.305 25.451 433.406 25.33 433.492 25.201 c 433.527 25.147 433.551
 25.092 433.582 25.037 c 433.625 24.955 433.676 24.877 433.711 24.791 c 
433.738 24.725 433.754 24.651 433.777 24.58 c 433.801 24.506 433.828 24.428
 433.844 24.35 c 433.867 24.229 433.875 24.108 433.883 23.983 c 433.883 
23.951 433.891 23.92 433.891 23.889 c 433.891 23.85 433.883 23.815 433.879
 23.78 c 433.875 23.662 433.867 23.545 433.844 23.424 c 433.828 23.342 433.797
 23.264 433.77 23.182 c 433.75 23.116 433.734 23.049 433.711 22.983 c 433.672
 22.893 433.621 22.807 433.57 22.721 c 433.543 22.674 433.523 22.623 433.492
 22.576 c 433.406 22.444 433.305 22.319 433.191 22.209 c 422.441 11.455 
l 421.977 10.994 421.371 10.764 420.766 10.764 c 420.156 10.764 419.551 
10.994 419.09 11.455 c 418.164 12.381 418.164 13.885 419.09 14.807 c 425.797
 21.518 l 400.707 21.518 l 399.398 21.518 398.336 22.576 398.336 23.889 
c 398.336 25.198 399.398 26.256 400.707 26.256 c h
400.707 26.256 m f
Q Q
showpage
%%Trailer
end restore
%%EOF
