%!PS-Adobe-3.0 EPSF-3.0
%%Creator: cairo 1.12.16 (http://cairographics.org)
%%CreationDate: Wed May 21 09:22:48 2014
%%Pages: 1
%%DocumentData: Clean7Bit
%%LanguageLevel: 2
%%BoundingBox: 0 -1 80 56
%%EndComments
%%BeginProlog
save
50 dict begin
/q { gsave } bind def
/Q { grestore } bind def
/cm { 6 array astore concat } bind def
/w { setlinewidth } bind def
/J { setlinecap } bind def
/j { setlinejoin } bind def
/M { setmiterlimit } bind def
/d { setdash } bind def
/m { moveto } bind def
/l { lineto } bind def
/c { curveto } bind def
/h { closepath } bind def
/re { exch dup neg 3 1 roll 5 3 roll moveto 0 rlineto
      0 exch rlineto 0 rlineto closepath } bind def
/S { stroke } bind def
/f { fill } bind def
/f* { eofill } bind def
/n { newpath } bind def
/W { clip } bind def
/W* { eoclip } bind def
/BT { } bind def
/ET { } bind def
/pdfmark where { pop globaldict /?pdfmark /exec load put }
    { globaldict begin /?pdfmark /pop load def /pdfmark
    /cleartomark load def end } ifelse
/BDC { mark 3 1 roll /BDC pdfmark } bind def
/EMC { mark /EMC pdfmark } bind def
/cairo_store_point { /cairo_point_y exch def /cairo_point_x exch def } def
/Tj { show currentpoint cairo_store_point } bind def
/TJ {
  {
    dup
    type /stringtype eq
    { show } { -0.001 mul 0 cairo_font_matrix dtransform rmoveto } ifelse
  } forall
  currentpoint cairo_store_point
} bind def
/cairo_selectfont { cairo_font_matrix aload pop pop pop 0 0 6 array astore
    cairo_font exch selectfont cairo_point_x cairo_point_y moveto } bind def
/Tf { pop /cairo_font exch def /cairo_font_matrix where
      { pop cairo_selectfont } if } bind def
/Td { matrix translate cairo_font_matrix matrix concatmatrix dup
      /cairo_font_matrix exch def dup 4 get exch 5 get cairo_store_point
      /cairo_font where { pop cairo_selectfont } if } bind def
/Tm { 2 copy 8 2 roll 6 array astore /cairo_font_matrix exch def
      cairo_store_point /cairo_font where { pop cairo_selectfont } if } bind def
/g { setgray } bind def
/rg { setrgbcolor } bind def
/d1 { setcachedevice } bind def
%%EndProlog
%%Page: 1 1
%%BeginPageSetup
%%PageBoundingBox: 0 -1 80 56
%%EndPageSetup
q 0 -1 80 57 rectclip q
0 g
60.246 22.223 m 62.699 23.848 65.152 25.476 67.605 27.101 c 66.344 30.207
 65.254 33.441 63.992 36.551 c 61.613 34.73 59.234 32.914 56.852 31.098 
c 58.039 28.176 59.059 25.141 60.246 22.223 c h
f
52.887 17.348 m 53.996 14.613 55.254 11.992 56.969 9.691 c 59.52 11.141
 62.062 12.59 64.609 14.039 c 62.777 16.5 61.43 19.305 60.246 22.223 c 57.793
 20.598 55.34 18.973 52.887 17.348 c h
f
72.25 18.391 m 69.703 16.941 67.156 15.492 64.609 14.039 c 66.441 11.582
 68.762 9.469 71.887 7.93 c 74.59 9.25 77.297 10.57 80 11.887 c 76.672 13.523
 74.203 15.773 72.25 18.391 c h
f
56.969 9.691 m 54.422 8.238 51.875 6.789 49.328 5.34 c 47.734 7.48 46.559
 9.926 45.527 12.469 c 47.98 14.094 50.434 15.719 52.887 17.348 c 51.777
 20.078 50.82 22.918 49.711 25.648 c 47.332 23.832 44.949 22.016 42.57 20.199
 c 41.539 22.742 40.367 25.184 38.77 27.328 c 41.055 29.32 43.34 31.312 
45.629 33.305 c 43.914 35.605 41.746 37.578 38.82 39.019 c 40.949 41.141
 43.078 43.266 45.211 45.391 c 48.336 43.851 50.652 41.742 52.484 39.281
 c 54.773 41.273 57.059 43.266 59.344 45.262 c 57.395 47.875 54.926 50.125
 51.598 51.762 c 49 51.738 l 46.871 49.613 44.742 47.488 42.613 45.367 c
 40.48 43.242 38.352 41.117 36.223 38.992 c 34.094 36.871 31.965 34.746 
29.836 32.621 c 32.555 31.285 34.574 29.441 36.172 27.301 c 37.77 25.16 
38.941 22.719 39.973 20.176 c 41.008 17.633 41.898 14.988 42.93 12.445 c
 43.961 9.902 45.137 7.461 46.73 5.32 c 48.328 3.176 50.348 1.336 53.07 
-0 c 55.668 0.023 l 58.371 1.34 61.074 2.66 63.777 3.976 c 60.852 5.414 
58.684 7.391 56.969 9.691 c h
f
52.484 39.281 m 50.203 37.289 47.914 35.297 45.629 33.301 c 47.344 31.004
 48.602 28.379 49.711 25.648 c 52.094 27.465 54.473 29.281 56.852 31.098
 c 55.668 34.019 54.32 36.824 52.484 39.281 c h
f
1.125 9.246 m 1.93 8.441 2.75 7.961 2.961 8.168 c 47.582 52.793 l 47.793
 53.004 47.312 53.828 46.508 54.629 c 45.703 55.434 44.883 55.914 44.672
 55.703 c 0.051 11.082 l -0.16 10.871 0.32 10.051 1.125 9.246 c h
f
Q Q
showpage
%%Trailer
end restore
%%EOF
