%!PS-Adobe-3.0 EPSF-3.0
%%Creator: cairo 1.14.2 (http://cairographics.org)
%%CreationDate: Mon Apr 27 18:00:31 2015
%%Pages: 1
%%DocumentData: Clean7Bit
%%LanguageLevel: 2
%%BoundingBox: 147 539 516 771
%%EndComments
%%BeginProlog
save
50 dict begin
/q { gsave } bind def
/Q { grestore } bind def
/cm { 6 array astore concat } bind def
/w { setlinewidth } bind def
/J { setlinecap } bind def
/j { setlinejoin } bind def
/M { setmiterlimit } bind def
/d { setdash } bind def
/m { moveto } bind def
/l { lineto } bind def
/c { curveto } bind def
/h { closepath } bind def
/re { exch dup neg 3 1 roll 5 3 roll moveto 0 rlineto
      0 exch rlineto 0 rlineto closepath } bind def
/S { stroke } bind def
/f { fill } bind def
/f* { eofill } bind def
/n { newpath } bind def
/W { clip } bind def
/W* { eoclip } bind def
/BT { } bind def
/ET { } bind def
/pdfmark where { pop globaldict /?pdfmark /exec load put }
    { globaldict begin /?pdfmark /pop load def /pdfmark
    /cleartomark load def end } ifelse
/BDC { mark 3 1 roll /BDC pdfmark } bind def
/EMC { mark /EMC pdfmark } bind def
/cairo_store_point { /cairo_point_y exch def /cairo_point_x exch def } def
/Tj { show currentpoint cairo_store_point } bind def
/TJ {
  {
    dup
    type /stringtype eq
    { show } { -0.001 mul 0 cairo_font_matrix dtransform rmoveto } ifelse
  } forall
  currentpoint cairo_store_point
} bind def
/cairo_selectfont { cairo_font_matrix aload pop pop pop 0 0 6 array astore
    cairo_font exch selectfont cairo_point_x cairo_point_y moveto } bind def
/Tf { pop /cairo_font exch def /cairo_font_matrix where
      { pop cairo_selectfont } if } bind def
/Td { matrix translate cairo_font_matrix matrix concatmatrix dup
      /cairo_font_matrix exch def dup 4 get exch 5 get cairo_store_point
      /cairo_font where { pop cairo_selectfont } if } bind def
/Tm { 2 copy 8 2 roll 6 array astore /cairo_font_matrix exch def
      cairo_store_point /cairo_font where { pop cairo_selectfont } if } bind def
/g { setgray } bind def
/rg { setrgbcolor } bind def
/d1 { setcachedevice } bind def
%%EndProlog
%%BeginSetup
%%EndSetup
%%Page: 1 1
%%BeginPageSetup
%%PageBoundingBox: 147 539 516 771
%%EndPageSetup
q 147 539 369 232 rectclip q
0 g
0.8 w
1 J
2 j
[] 0.0 d
4 M q 1 0 0 -1 0 841.889771 cm
147.75 71.645 367.062 229.836 re S Q
231.023 649.085 m 224.898 649.085 l 224.371 649.085 223.91 648.624 223.91
 648.097 c 223.91 647.569 224.371 647.109 224.898 647.109 c 231.023 647.109
 l 231.551 647.109 232.012 647.569 232.012 648.097 c 232.012 648.624 231.617
 649.085 231.023 649.085 c h
231.023 649.085 m f
0.411765 0.823529 0.905882 rg
247.746 645.859 m 242.676 653.827 l 242.676 656.987 242.742 669.894 242.742
 669.894 c 242.742 672.066 240.965 673.843 238.793 673.843 c 217.262 673.843
 l 215.09 673.843 213.312 672.066 213.312 669.894 c 213.312 669.894 213.375
 656.987 213.375 653.827 c 208.242 645.859 l 207.449 644.937 207.254 643.62
 207.715 642.437 c 208.242 641.183 209.426 640.394 210.742 640.394 c 245.246
 640.394 l 246.562 640.394 247.746 641.183 248.273 642.437 c 248.734 643.62
 248.539 644.937 247.746 645.859 c h
238.793 669.894 m 238.793 669.894 238.727 658.042 238.727 654.288 c 217.262
 654.288 l 217.262 658.042 217.195 669.894 217.195 669.894 c h
211.992 644.409 m 216.734 651.851 l 216.801 651.917 l 217.062 652.378 l
 239.055 652.378 l 239.32 651.917 l 239.32 651.917 239.32 651.851 239.387
 651.851 c 244.125 644.409 l h
211.992 644.409 m f
0 g
1.975309 w
1 j
10 M q 1 0 0 -1 0 841.889771 cm
245.773 170.219 m 245.773 167.391 243.469 165.02 240.57 165.02 c S Q
q 1 0 0 -1 0 841.889771 cm
250.117 170.219 m 250.117 164.953 245.836 160.672 240.57 160.672 c S Q
348.668 580.73 m 342.543 580.73 l 342.02 580.73 341.559 580.269 341.559
 579.741 c 341.559 579.214 342.02 578.753 342.543 578.753 c 348.668 578.753
 l 349.195 578.753 349.656 579.214 349.656 579.741 c 349.656 580.269 349.262
 580.73 348.668 580.73 c h
348.668 580.73 m f
0.411765 0.823529 0.905882 rg
365.391 577.503 m 360.32 585.472 l 360.32 588.632 360.387 601.534 360.387
 601.534 c 360.387 603.71 358.609 605.487 356.438 605.487 c 334.906 605.487
 l 332.734 605.487 330.957 603.71 330.957 601.534 c 330.957 601.534 331.023
 588.632 331.023 585.472 c 325.887 577.503 l 325.098 576.581 324.898 575.265
 325.359 574.077 c 325.887 572.827 327.07 572.038 328.387 572.038 c 362.891
 572.038 l 364.207 572.038 365.391 572.827 365.918 574.077 c 366.379 575.265
 366.184 576.581 365.391 577.503 c h
356.438 601.534 m 356.438 601.534 356.371 589.683 356.371 585.933 c 334.906
 585.933 l 334.906 589.683 334.84 601.534 334.84 601.534 c h
329.641 576.054 m 334.379 583.495 l 334.445 583.562 l 334.711 584.023 l
 356.699 584.023 l 356.965 583.562 l 356.965 583.562 356.965 583.495 357.031
 583.495 c 361.77 576.054 l h
329.641 576.054 m f
0 g
q 1 0 0 -1 0 841.889771 cm
363.418 238.574 m 363.418 235.746 361.113 233.375 358.215 233.375 c S Q
q 1 0 0 -1 0 841.889771 cm
367.762 238.574 m 367.762 233.309 363.484 229.027 358.215 229.027 c S Q
429.887 709.589 m 423.766 709.589 l 423.238 709.589 422.777 709.128 422.777
 708.601 c 422.777 708.073 423.238 707.612 423.766 707.612 c 429.887 707.612
 l 430.414 707.612 430.875 708.073 430.875 708.601 c 430.875 709.128 430.48
 709.589 429.887 709.589 c h
429.887 709.589 m f
0.411765 0.823529 0.905882 rg
446.613 706.362 m 441.543 714.327 l 441.543 717.487 441.609 730.394 441.609
 730.394 c 441.609 732.566 439.832 734.347 437.656 734.347 c 416.125 734.347
 l 413.953 734.347 412.176 732.566 412.176 730.394 c 412.176 730.394 412.242
 717.487 412.242 714.327 c 407.105 706.362 l 406.316 705.441 406.117 704.124
 406.578 702.937 c 407.105 701.687 408.293 700.898 409.609 700.898 c 444.109
 700.898 l 445.426 700.898 446.613 701.687 447.141 702.937 c 447.602 704.124
 447.402 705.441 446.613 706.362 c h
437.656 730.394 m 437.656 730.394 437.594 718.542 437.594 714.788 c 416.125
 714.788 l 416.125 718.542 416.062 730.394 416.062 730.394 c h
410.859 704.913 m 415.602 712.355 l 415.664 712.417 l 415.93 712.878 l 
437.922 712.878 l 438.184 712.417 l 438.184 712.417 438.184 712.355 438.25
 712.355 c 442.992 704.913 l h
410.859 704.913 m f
0 g
q 1 0 0 -1 0 841.889771 cm
444.637 109.719 m 444.637 106.887 442.332 104.516 439.434 104.516 c S Q
q 1 0 0 -1 0 841.889771 cm
448.984 109.719 m 448.984 104.449 444.703 100.172 439.434 100.172 c S Q
0.8 w
0 J
0 j
4 M q 1 0 0 -1 0 841.889771 cm
267.723 182.691 m 395.688 138.07 l S Q
q 1 0 0 -1 0 841.889771 cm
267.723 217.207 m 311.5 243.305 l S Q
q 1 0 0 -1 0 841.889771 cm
378.008 222.258 m 420.102 159.961 l S Q
Q Q
showpage
%%Trailer
end restore
%%EOF
