% WARNING - This is exported REVIGO data useful only for the specific purpose of constructing a TreeMap visualization.
% Do not use this table as a general list of non-redundant GO categories, as it sets an extremely permissive 
% threshold to detect redundancies (c=0.10) and fill the 'representative' column, while normally c>=0.4 is recommended.
% To export a reduced-redundancy set of GO terms, go to the Scatterplot & Table tab, and export to CSV from there.
term_ID,description,frequencyInDb,log10pvalue,uniqueness,dispensability,representative
GO:0006825,"copper ion transport",0.027%,-3.9057,0.796,0.000,"copper ion transport"
GO:0006979,"response to oxidative stress",0.539%,-3.6391,0.599,0.000,"response to oxidative stress"
GO:0009607,"response to biotic stimulus",0.465%,-2.8280,0.624,0.418,"response to oxidative stress"
GO:0000160,"phosphorelay signal transduction system",2.126%,-2.6405,0.544,0.488,"response to oxidative stress"
GO:0006952,"defense response",0.569%,-2.1447,0.598,0.588,"response to oxidative stress"
GO:0015979,"photosynthesis",0.343%,-11.6592,0.782,0.000,"photosynthesis"
GO:0030244,"cellulose biosynthetic process",0.016%,-1.8247,0.670,0.040,"cellulose biosynthesis"
GO:0006351,"transcription, DNA-templated",9.014%,-2.7224,0.580,0.261,"cellulose biosynthesis"
GO:0006012,"galactose metabolic process",0.110%,-1.4946,0.709,0.412,"cellulose biosynthesis"
GO:0019684,"photosynthesis, light reaction",0.085%,-5.6952,0.571,0.045,"photosynthesis, light reaction"
