10059566 reads; of these:
  10059566 (100.00%) were unpaired; of these:
    878316 (8.73%) aligned 0 times
    2990283 (29.73%) aligned exactly 1 time
    6190967 (61.54%) aligned >1 times
91.27% overall alignment rate
