Settings:
  Output files: "/home/maa146/scratch/ma.csb25-fiber//analysis/tophat//RL9/tmp/segment_juncs.*.bt2"
  Line rate: 6 (line is 64 bytes)
  Lines per side: 1 (side is 64 bytes)
  Offset rate: 4 (one in 16)
  FTable chars: 10
  Strings: unpacked
  Max bucket size: default
  Max bucket size, sqrt multiplier: default
  Max bucket size, len divisor: 4
  Difference-cover sample period: 1024
  Endianness: little
  Actual local endianness: little
  Sanity checking: disabled
  Assertions: disabled
  Random seed: 0
  Sizeofs: void*:8, int:4, long:8, size_t:8
Input files DNA, FASTA:
  /home/maa146/scratch/ma.csb25-fiber//analysis/tophat//RL9/tmp/segment_juncs.fa
Reading reference sizes
  Time reading reference sizes: 00:00:02
Calculating joined length
Writing header
Reserving space for joined string
Joining reference sequences
  Time to join reference sequences: 00:00:02
bmax according to bmaxDivN setting: 39981506
Using parameters --bmax 29986130 --dcv 1024
  Doing ahead-of-time memory usage test
  Passed!  Constructing with these parameters: --bmax 29986130 --dcv 1024
Constructing suffix-array element generator
Building DifferenceCoverSample
  Building sPrime
  Building sPrimeOrder
  V-Sorting samples
  V-Sorting samples time: 00:00:02
  Allocating rank array
  Ranking v-sort output
  Ranking v-sort output time: 00:00:00
  Invoking Larsson-Sadakane on ranks
  Invoking Larsson-Sadakane on ranks time: 00:00:01
  Sanity-checking and returning
Building samples
Reserving space for 12 sample suffixes
Generating random suffixes
QSorting 12 sample offsets, eliminating duplicates
QSorting sample offsets, eliminating duplicates time: 00:00:00
Multikey QSorting 12 samples
  (Using difference cover)
  Multikey QSorting samples time: 00:00:00
Calculating bucket sizes
  Binary sorting into buckets
  10%
  20%
  30%
  40%
  50%
  60%
  70%
  80%
  90%
  100%
  Binary sorting into buckets time: 00:00:04
Splitting and merging
  Splitting and merging time: 00:00:00
Split 2, merged 8; iterating...
  Binary sorting into buckets
  10%
  20%
  30%
  40%
  50%
  60%
  70%
  80%
  90%
  100%
  Binary sorting into buckets time: 00:00:03
Splitting and merging
  Splitting and merging time: 00:00:00
Split 1, merged 1; iterating...
  Binary sorting into buckets
  10%
  20%
  30%
  40%
  50%
  60%
  70%
  80%
  90%
  100%
  Binary sorting into buckets time: 00:00:03
Splitting and merging
  Splitting and merging time: 00:00:00
Avg bucket size: 2.28466e+07 (target: 29986129)
Converting suffix-array elements to index image
Allocating ftab, absorbFtab
Entering Ebwt loop
Getting block 1 of 7
  Reserving size (29986130) for bucket
  Calculating Z arrays
  Calculating Z arrays time: 00:00:00
  Entering block accumulator loop:
  10%
  20%
  30%
  40%
  50%
  60%
  70%
  80%
  90%
  100%
  Block accumulator loop time: 00:00:01
  Sorting block of length 27755310
  (Using difference cover)
  Sorting block time: 00:00:05
Returning block of 27755311
Getting block 2 of 7
  Reserving size (29986130) for bucket
  Calculating Z arrays
  Calculating Z arrays time: 00:00:00
  Entering block accumulator loop:
  10%
  20%
  30%
  40%
  50%
  60%
  70%
  80%
  90%
  100%
  Block accumulator loop time: 00:00:01
  Sorting block of length 15588661
  (Using difference cover)
  Sorting block time: 00:00:03
Returning block of 15588662
Getting block 3 of 7
  Reserving size (29986130) for bucket
  Calculating Z arrays
  Calculating Z arrays time: 00:00:00
  Entering block accumulator loop:
  10%
  20%
  30%
  40%
  50%
  60%
  70%
  80%
  90%
  100%
  Block accumulator loop time: 00:00:02
  Sorting block of length 29141305
  (Using difference cover)
  Sorting block time: 00:00:05
Returning block of 29141306
Getting block 4 of 7
  Reserving size (29986130) for bucket
  Calculating Z arrays
  Calculating Z arrays time: 00:00:00
  Entering block accumulator loop:
  10%
  20%
  30%
  40%
  50%
  60%
  70%
  80%
  90%
  100%
  Block accumulator loop time: 00:00:02
  Sorting block of length 27198609
  (Using difference cover)
  Sorting block time: 00:00:04
Returning block of 27198610
Getting block 5 of 7
  Reserving size (29986130) for bucket
  Calculating Z arrays
  Calculating Z arrays time: 00:00:00
  Entering block accumulator loop:
  10%
  20%
  30%
  40%
  50%
  60%
  70%
  80%
  90%
  100%
  Block accumulator loop time: 00:00:01
  Sorting block of length 8086602
  (Using difference cover)
  Sorting block time: 00:00:01
Returning block of 8086603
Getting block 6 of 7
  Reserving size (29986130) for bucket
  Calculating Z arrays
  Calculating Z arrays time: 00:00:00
  Entering block accumulator loop:
  10%
  20%
  30%
  40%
  50%
  60%
  70%
  80%
  90%
  100%
  Block accumulator loop time: 00:00:01
  Sorting block of length 22750222
  (Using difference cover)
  Sorting block time: 00:00:04
Returning block of 22750223
Getting block 7 of 7
  Reserving size (29986130) for bucket
  Calculating Z arrays
  Calculating Z arrays time: 00:00:00
  Entering block accumulator loop:
  10%
  20%
  30%
  40%
  50%
  60%
  70%
  80%
  90%
  100%
  Block accumulator loop time: 00:00:01
  Sorting block of length 29405310
  (Using difference cover)
  Sorting block time: 00:00:05
Returning block of 29405311
Exited Ebwt loop
fchr[A]: 0
fchr[C]: 57717114
fchr[G]: 80140965
fchr[T]: 102736955
fchr[$]: 159926025
Exiting Ebwt::buildToDisk()
Returning from initFromVector
Wrote 262616119 bytes to primary EBWT file: /home/maa146/scratch/ma.csb25-fiber//analysis/tophat//RL9/tmp/segment_juncs.1.bt2
Wrote 39981512 bytes to secondary EBWT file: /home/maa146/scratch/ma.csb25-fiber//analysis/tophat//RL9/tmp/segment_juncs.2.bt2
Re-opening _in1 and _in2 as input streams
Returning from Ebwt constructor
Headers:
    len: 159926025
    bwtLen: 159926026
    sz: 39981507
    bwtSz: 39981507
    lineRate: 6
    offRate: 4
    offMask: 0xfffffff0
    ftabChars: 10
    eftabLen: 20
    eftabSz: 80
    ftabLen: 1048577
    ftabSz: 4194308
    offsLen: 9995377
    offsSz: 39981508
    lineSz: 64
    sideSz: 64
    sideBwtSz: 48
    sideBwtLen: 192
    numSides: 832949
    numLines: 832949
    ebwtTotLen: 53308736
    ebwtTotSz: 53308736
    color: 0
    reverse: 0
Total time for call to driver() for forward index: 00:01:03
Reading reference sizes
  Time reading reference sizes: 00:00:01
Calculating joined length
Writing header
Reserving space for joined string
Joining reference sequences
  Time to join reference sequences: 00:00:02
  Time to reverse reference sequence: 00:00:01
bmax according to bmaxDivN setting: 39981506
Using parameters --bmax 29986130 --dcv 1024
  Doing ahead-of-time memory usage test
  Passed!  Constructing with these parameters: --bmax 29986130 --dcv 1024
Constructing suffix-array element generator
Building DifferenceCoverSample
  Building sPrime
  Building sPrimeOrder
  V-Sorting samples
  V-Sorting samples time: 00:00:02
  Allocating rank array
  Ranking v-sort output
  Ranking v-sort output time: 00:00:00
  Invoking Larsson-Sadakane on ranks
  Invoking Larsson-Sadakane on ranks time: 00:00:01
  Sanity-checking and returning
Building samples
Reserving space for 12 sample suffixes
Generating random suffixes
QSorting 12 sample offsets, eliminating duplicates
QSorting sample offsets, eliminating duplicates time: 00:00:00
Multikey QSorting 12 samples
  (Using difference cover)
  Multikey QSorting samples time: 00:00:00
Calculating bucket sizes
  Binary sorting into buckets
  10%
  20%
  30%
  40%
  50%
  60%
  70%
  80%
  90%
  100%
  Binary sorting into buckets time: 00:00:04
Splitting and merging
  Splitting and merging time: 00:00:00
Split 1, merged 6; iterating...
  Binary sorting into buckets
  10%
  20%
  30%
  40%
  50%
  60%
  70%
  80%
  90%
  100%
  Binary sorting into buckets time: 00:00:03
Splitting and merging
  Splitting and merging time: 00:00:00
Avg bucket size: 1.99908e+07 (target: 29986129)
Converting suffix-array elements to index image
Allocating ftab, absorbFtab
Entering Ebwt loop
Getting block 1 of 8
  Reserving size (29986130) for bucket
  Calculating Z arrays
  Calculating Z arrays time: 00:00:00
  Entering block accumulator loop:
  10%
  20%
  30%
  40%
  50%
  60%
  70%
  80%
  90%
  100%
  Block accumulator loop time: 00:00:01
  Sorting block of length 24534517
  (Using difference cover)
  Sorting block time: 00:00:04
Returning block of 24534518
Getting block 2 of 8
  Reserving size (29986130) for bucket
  Calculating Z arrays
  Calculating Z arrays time: 00:00:00
  Entering block accumulator loop:
  10%
  20%
  30%
  40%
  50%
  60%
  70%
  80%
  90%
  100%
  Block accumulator loop time: 00:00:01
  Sorting block of length 26631635
  (Using difference cover)
  Sorting block time: 00:00:05
Returning block of 26631636
Getting block 3 of 8
  Reserving size (29986130) for bucket
  Calculating Z arrays
  Calculating Z arrays time: 00:00:00
  Entering block accumulator loop:
  10%
  20%
  30%
  40%
  50%
  60%
  70%
  80%
  90%
  100%
  Block accumulator loop time: 00:00:01
  Sorting block of length 11769553
  (Using difference cover)
  Sorting block time: 00:00:02
Returning block of 11769554
Getting block 4 of 8
  Reserving size (29986130) for bucket
  Calculating Z arrays
  Calculating Z arrays time: 00:00:00
  Entering block accumulator loop:
  10%
  20%
  30%
  40%
  50%
  60%
  70%
  80%
  90%
  100%
  Block accumulator loop time: 00:00:01
  Sorting block of length 21293836
  (Using difference cover)
  Sorting block time: 00:00:04
Returning block of 21293837
Getting block 5 of 8
  Reserving size (29986130) for bucket
  Calculating Z arrays
  Calculating Z arrays time: 00:00:00
  Entering block accumulator loop:
  10%
  20%
  30%
  40%
  50%
  60%
  70%
  80%
  90%
  100%
  Block accumulator loop time: 00:00:01
  Sorting block of length 13355254
  (Using difference cover)
  Sorting block time: 00:00:02
Returning block of 13355255
Getting block 6 of 8
  Reserving size (29986130) for bucket
  Calculating Z arrays
  Calculating Z arrays time: 00:00:00
  Entering block accumulator loop:
  10%
  20%
  30%
  40%
  50%
  60%
  70%
  80%
  90%
  100%
  Block accumulator loop time: 00:00:01
  Sorting block of length 26969201
  (Using difference cover)
  Sorting block time: 00:00:05
Returning block of 26969202
Getting block 7 of 8
  Reserving size (29986130) for bucket
  Calculating Z arrays
  Calculating Z arrays time: 00:00:00
  Entering block accumulator loop:
  10%
  20%
  30%
  40%
  50%
  60%
  70%
  80%
  90%
  100%
  Block accumulator loop time: 00:00:02
  Sorting block of length 22617856
  (Using difference cover)
  Sorting block time: 00:00:03
Returning block of 22617857
Getting block 8 of 8
  Reserving size (29986130) for bucket
  Calculating Z arrays
  Calculating Z arrays time: 00:00:00
  Entering block accumulator loop:
  10%
  20%
  30%
  40%
  50%
  60%
  70%
  80%
  90%
  100%
  Block accumulator loop time: 00:00:01
  Sorting block of length 12754166
  (Using difference cover)
  Sorting block time: 00:00:02
Returning block of 12754167
Exited Ebwt loop
fchr[A]: 0
fchr[C]: 57717114
fchr[G]: 80140965
fchr[T]: 102736955
fchr[$]: 159926025
Exiting Ebwt::buildToDisk()
Returning from initFromVector
Wrote 262616119 bytes to primary EBWT file: /home/maa146/scratch/ma.csb25-fiber//analysis/tophat//RL9/tmp/segment_juncs.rev.1.bt2
Wrote 39981512 bytes to secondary EBWT file: /home/maa146/scratch/ma.csb25-fiber//analysis/tophat//RL9/tmp/segment_juncs.rev.2.bt2
Re-opening _in1 and _in2 as input streams
Returning from Ebwt constructor
Headers:
    len: 159926025
    bwtLen: 159926026
    sz: 39981507
    bwtSz: 39981507
    lineRate: 6
    offRate: 4
    offMask: 0xfffffff0
    ftabChars: 10
    eftabLen: 20
    eftabSz: 80
    ftabLen: 1048577
    ftabSz: 4194308
    offsLen: 9995377
    offsSz: 39981508
    lineSz: 64
    sideSz: 64
    sideBwtSz: 48
    sideBwtLen: 192
    numSides: 832949
    numLines: 832949
    ebwtTotLen: 53308736
    ebwtTotSz: 53308736
    color: 0
    reverse: 1
Total time for backward call to driver() for mirror index: 00:01:01
