"logFC"	"logCPM"	"LR"	"PValue"	"FDR"
"all-m0170-3p"	-1.90757726664414	10.2515391975889	3.03323971440211	0.0815749849903439	1
"all-m0212-3p"	-2.0547986330409	7.65662989199862	2.71577235179399	0.0993608678320139	1
"all-m0059-3p"	-6.40279841777739	4.34835654639111	2.05001450710996	0.152204739480441	1
"Afl-milR-33"	-5.41335310012072	8.46246830107616	1.93302551569025	0.164427818031375	1
"all-m0144-3p"	5.6275760406439	6.11441394415366	1.59589564151195	0.206485829346495	1
"all-m0048-5p"	5.55370614617933	5.72395529508272	1.4034990200652	0.236138598107395	1
"Afl-milR-9"	4.61486342773055	4.97883599504984	0.802898073266956	0.370228303341255	1
"all-m0178-3p"	-1.32967879527951	5.08773645088496	0.758656508347864	0.383749292189787	1
"all-m0164-5p"	4.59220236331096	5.66569509936743	0.732839932301885	0.391964201929512	1
"all-m0184-3p"	-0.590445559460527	7.12309076025727	0.0613495643782453	0.804375475097859	1
"Afl-milR-3"	-0.590927907843216	7.91458410782815	0.0401512312362602	0.841185181893691	1
"all-m0236-5p"	0.00219668011098095	19.9241469580013	0.0253243047477838	0.873561631018984	1
"all-m0156-5p"	0.194756339783437	5.07865728331819	0.0159440050975501	0.899518540578106	1
"Afl-milR-2"	-5.12548240610387e-15	4.41447689842194	0	1	1
"all-m0027-3p"	-5.12548240610387e-15	4.35784984845904	0	1	1
"all-m0036-5p"	-5.12548240610387e-15	4.35441035792269	0	1	1
"all-m0107-3p"	-5.12548240610387e-15	5.4972762646114	0	1	1
"all-m0140-3p"	-5.12548240610387e-15	4.35839350753428	0	1	1
"all-m0191-5p"	-5.12548240610387e-15	4.56105989033472	0	1	1
"all-m0236-3p"	-5.12548240610387e-15	5.05726159287729	0	1	1
"Afl-milR-43"	-5.12548240610387e-15	4.26241567039914	0	1	1
"all-m0013-3p"	-5.12548240610387e-15	4.33058015011355	0	1	1
"all-m0073-3p"	-5.12548240610387e-15	4.33129399176074	0	1	1
"all-m0110-5p"	-5.12548240610387e-15	4.3593183928111	0	1	1
"all-m0121-3p"	-5.12548240610387e-15	4.32342634910677	0	1	1
"all-m0140-5p"	-5.12548240610387e-15	4.26241567039914	0	1	1
"all-m0141-3p"	-5.12548240610387e-15	4.32287489573716	0	1	1
"all-m0145-5p"	-5.12548240610387e-15	4.32320083399734	0	1	1
"all-m0173-5p"	-5.12548240610387e-15	4.3287210598302	0	1	1
"all-m0187-3p"	-5.12548240610387e-15	4.51539840460507	0	1	1
"all-m0195-5p"	-5.12548240610387e-15	4.35145977022631	0	1	1
"all-m0217-3p"	-5.12548240610387e-15	4.43608701219237	0	1	1
"all-m0225-3p"	-5.12548240610387e-15	4.40415368997189	0	1	1
"all-m0229-3p"	-5.12548240610387e-15	4.32254899235338	0	1	1
"all-m0233-3p"	-5.12548240610387e-15	4.3276272605346	0	1	1
"all-m0235-5p"	-5.12548240610387e-15	4.48939895366536	0	1	1
"Afl-milR-92"	-5.12548240610387e-15	4.26264381567658	0	1	1
"all-m0007-5p"	-5.12548240610387e-15	4.32714283629906	0	1	1
"all-m0036-3p"	-5.12548240610387e-15	4.38871417051524	0	1	1
"all-m0130-5p"	-5.12548240610387e-15	4.35907445998803	0	1	1
"all-m0133-5p"	-5.12548240610387e-15	4.32387743243524	0	1	1
"all-m0224-3p"	-5.12548240610387e-15	4.50731912367337	0	1	1
"all-m0029-3p"	-5.12548240610387e-15	4.29869077291164	0	1	1
"all-m0123-3p"	-5.12548240610387e-15	4.33351428406843	0	1	1
"all-m0185-5p"	-5.12548240610387e-15	4.41979744622396	0	1	1
"all-m0221-3p"	-5.12548240610387e-15	4.30127133310698	0	1	1
"all-m0091-5p"	-5.12548240610387e-15	4.3581545562044	0	1	1
"all-m0002-3p"	-5.12548240610387e-15	4.44553613280064	0	1	1
"all-m0067-3p"	-5.12548240610387e-15	4.29249201146229	0	1	1
"all-m0188-5p"	-5.12548240610387e-15	4.36671416904758	0	1	1
"all-m0214-3p"	-5.12548240610387e-15	4.32222312385201	0	1	1
"Afl-milR-7"	-5.12548240610387e-15	4.30044104251567	0	1	1
"all-m0136-5p"	-5.12548240610387e-15	4.34008150864033	0	1	1
"all-m0233-5p"	-5.12548240610387e-15	4.26607362254598	0	1	1
"all-m0063-3p"	-5.12548240610387e-15	4.31540141898848	0	1	1
"all-m0079-3p"	-5.12548240610387e-15	4.31540141898848	0	1	1
"all-m0118-5p"	-5.12548240610387e-15	4.31540141898848	0	1	1
"all-m0119-5p"	-5.12548240610387e-15	4.28790849251451	0	1	1
"all-m0162-3p"	-5.12548240610387e-15	4.31540141898848	0	1	1
"all-m0168-3p"	-5.12548240610387e-15	4.29200857952658	0	1	1
"all-m0193-3p"	-5.12548240610387e-15	4.31540141898848	0	1	1
"all-m0234-5p"	-5.12548240610387e-15	4.28790849251451	0	1	1
"all-m0029-5p"	-5.12548240610387e-15	4.33354189456397	0	1	1
"all-m0171-5p"	-5.12548240610387e-15	4.34543843109638	0	1	1
"all-m0049-5p"	-5.12548240610387e-15	4.32762839511752	0	1	1
"all-m0071-5p"	-5.12548240610387e-15	4.38869133617685	0	1	1
"all-m0099-5p"	-5.12548240610387e-15	4.32762839511752	0	1	1
"all-m0201-5p"	-5.12548240610387e-15	4.26390586121915	0	1	1
"all-m0202-3p"	-5.12548240610387e-15	4.32762839511752	0	1	1
