"logFC"	"logCPM"	"LR"	"PValue"	"FDR"
"Predict-miR-163"	-4.61422654356585	10.8338577848117	35.7700832598507	2.22031307381021e-09	7.70609743033166e-07
"Predict-miR-286"	-4.39751943489546	10.8867214982272	35.7612359663139	2.23041893786734e-09	7.70609743033166e-07
"Predict-miR-529"	-4.3959438413891	10.8927277722526	34.5074107592206	4.24631543583899e-09	9.78067988721582e-07
"Predict-miR-612"	-9.24575525621008	10.3456910410862	29.3338866280006	6.09209819834256e-08	1.04293318038459e-05
"Predict-miR-162"	-3.89707003620154	10.69433215859	28.9190896762464	7.54654978570615e-08	1.04293318038459e-05
"Predict-miR-471"	-4.2556628457187	11.4935224304729	28.5458810257617	9.15042768820661e-08	1.05382425542513e-05
"Predict-miR-426"	-5.63325677874159	9.86734068429686	28.1686372767954	1.11191787604224e-07	1.09762178906456e-05
"Predict-miR-169"	-4.08058252730097	10.1065966648299	23.4176142914548	1.30379233475254e-06	0.00011261506291425
"Predict-miR-613"	-4.80847148855705	10.4760330909133	22.2520583990315	2.39102327623716e-06	0.000183577453764431
"Predict-miR-292"	-5.1897977978308	9.77259070953632	19.1622180659753	1.20066487124365e-05	0.000829659426029365
"Predict-miR-58"	-4.21496458393602	9.78175027996752	18.9365397167475	1.35139357198679e-05	0.000848920871129887
"rna70267"	3.13894039027161	14.7219008422959	16.4688878903638	4.94549999197055e-05	0.00284778374537637
"rna33836"	2.81390819542163	13.1735413613415	15.4863038202108	8.31052458134313e-05	0.0044173634505447
"Predict-miR-374"	-3.21681163529032	11.2585404649055	15.3262976996627	9.04485933884418e-05	0.00446428414510095
"Predict-miR-222"	3.19601882982362	14.1310885108698	14.6871866636011	0.000126906128270634	0.00584614230900055
"Predict-miR-453"	-7.65145600946692	9.25100675403269	14.0595338498376	0.000177113685834181	0.00764909730696369
"rna798"	3.96673278609488	13.6350918482623	12.7402414367595	0.000357871493376499	0.0145464236425389
"rna55116"	2.98984576548484	13.0926682152402	12.5300616337052	0.000400456599655017	0.0153730839089787
"rna44065"	8.05516201882299	9.48578741228696	12.3831019168228	0.000433236817877408	0.0157561390080678
"rna55381"	2.46008909325456	12.6919851466835	12.2106168765915	0.000475183194026486	0.0164175793536151
"rna31043"	3.13254909141315	11.5664869235503	12.0810893881094	0.000509358266039752	0.0167603124682604
"rna19202"	2.43463927648601	13.0613914964638	11.3890760007004	0.000738772691524987	0.0224816590710827
"rna20252"	2.10453651525523	13.1449065868966	11.3652646571354	0.000748304136953549	0.0224816590710827
"Predict-miR-9"	2.86275663460014	14.8306346806919	11.0511814164998	0.00088630702845541	0.025518256527612
"Predict-miR-574"	-4.64782507064429	8.61567423009946	10.8989095557714	0.000962208872102413	0.0265954532249107
"Predict-miR-431"	-2.47510005297982	10.996428880749	10.4916021255992	0.00119918342719795	0.0318706056997608
"rna55112"	7.88400540953345	9.79838891016123	10.3856443328872	0.00126998860890887	0.0325023010650382
"rna53549"	7.46906073401075	9.08344749105145	10.2801605245612	0.00134468247549609	0.0331848425202786
"rna54469"	2.26732330931118	13.1925964150171	10.1961388534555	0.0014073501783207	0.0335337576972277
"rna40086"	3.07141245622107	12.9343065476749	10.0651433305747	0.00151100810361713	0.0347727398260472
"Predict-miR-368"	-2.25783658132706	11.7891807602104	9.95891757294706	0.00160072139781429	0.0347727398260472
"rna65320"	3.39729904416695	10.924295726072	9.94791701297109	0.00161031501365197	0.0347727398260472
"rna54463"	2.17446797628052	13.2540219390037	9.77180413918315	0.00177208477842655	0.0371063812694771
"Predict-miR-53"	7.31919352630364	11.0055108387747	9.65776499007945	0.00188552879520243	0.0383205999260259
"Predict-miR-344"	-1.97159254934958	10.2549446633077	9.52299414531179	0.00202913249715163	0.0400608730151937
"rna25395"	2.13178162751594	13.1460907446358	9.33219683901796	0.00225162257633557	0.0432186444513299
"Predict-miR-462"	-2.01944948536888	11.3769368493769	9.18927796015537	0.00243436900311444	0.0454634859770833
"rna54466"	2.02581158139225	13.2198224693218	8.93689790042137	0.00279466935353609	0.0508188558761432
"rna60849"	2.67026219859473	11.6841358969496	8.79395640836746	0.00302230082552009	0.0522479211356203
"rna19197"	2.48807643102639	13.0602794318771	8.78180205229019	0.00304250481338396	0.0522479211356203
"rna55111"	2.45606944026172	13.2147327657316	8.67317517774472	0.00322928050184741	0.0522479211356203
"rna41815"	7.16569813358785	10.2216404154509	8.66983407550867	0.00323520647064423	0.0522479211356203
"Predict-miR-69"	-6.96155732379631	8.88341491404841	8.66078173473777	0.00325131781307044	0.0522479211356203
"rna37547"	1.85644504165668	13.1731209451404	8.49002659323986	0.00357098586974354	0.056080709908927
"rna10649"	2.10903589552943	14.6307786293945	8.43625435772495	0.00367813076848418	0.0564797413560571
"Predict-miR-299"	-2.72525165759136	10.1464152788952	8.37073321489414	0.00381311746408031	0.0572796558191194
"Predict-miR-417"	-2.58068789057088	9.50481473892253	8.10854865091091	0.0044056986909101	0.0636565631807412
"Predict-miR-621"	-2.35225672737821	16.4287379977371	8.10190577069255	0.00442187414280113	0.0636565631807412
"rna34588"	3.38104176036	13.212220275305	8.01090724126671	0.00464964376471664	0.0655694661514123
"Predict-miR-234"	-6.62936520103433	8.88673962454618	7.75634180492156	0.00535242613700758	0.0739705292134448
"Predict-miR-296"	-3.72403101900703	8.82728472035464	7.6864824155295	0.0055635960575261	0.07538127207354
"Predict-miR-385"	-6.57753086009489	9.69990889849673	7.58531461126619	0.00588456930185529	0.0771058350455774
"rna54457"	1.94880768211388	13.1856587656258	7.5636031082302	0.00595587990569614	0.0771058350455774
"rna19536"	2.5959716269264	12.9450741068605	7.54261973660772	0.00602563689212906	0.0771058350455774
"Predict-miR-341"	-6.66259033838747	9.1712077610241	7.47970706641958	0.00623982225843904	0.078204262469965
"Predict-miR-64"	-6.55993571567774	10.0798582763356	7.4203226631572	0.00644912495253965	0.078204262469965
"Predict-miR-497"	-6.79689493117767	8.90874126640152	7.38283978802005	0.00658491132518819	0.078204262469965
"Predict-miR-248"	2.41197295636245	12.9182346847149	7.35801941079911	0.0066764294867426	0.078204262469965
"Predict-miR-57"	-2.04901420929165	12.8186309137668	7.35777050257438	0.00667735381436749	0.078204262469965
"Predict-miR-364"	-4.39385189795546	9.24753365436051	7.31510881410604	0.00683772588541417	0.0787478097803532
"Predict-miR-116"	2.1736238890263	11.7057724826134	7.20726182177541	0.00726091850767828	0.082250732603372
"Predict-miR-233"	-6.88407132812388	9.41717947670357	7.12370736987837	0.00760712396544184	0.0835707187101488
"rna48653"	6.79595867785523	9.34315043568135	7.12083351454954	0.00761932746561414	0.0835707187101488
"Predict-miR-244"	3.32188955295613	12.6752102152864	6.98200606586043	0.0082333268645232	0.0888942009903989
"rna37546"	2.67079536507776	11.085053326615	6.86614083035156	0.0087844149336486	0.0926637633878029
"rna34928"	6.83500826988148	8.26125668934063	6.85271582984019	0.00885066336265556	0.0926637633878029
"Predict-miR-104"	-6.4946282790956	10.3215060768955	6.59851861924256	0.0102063650275705	0.105262660209719
"rna437"	1.87730438981138	10.9812916256853	6.27468658037608	0.0122474781547751	0.124455991249259
"Predict-miR-56"	-3.29092907125805	8.54472290417634	6.14408461543178	0.0131852399366783	0.132043489800648
"rna46361"	6.70766269729105	9.09204776197801	6.11377551015664	0.01341323027337	0.132407744555695
"Predict-miR-319"	-3.26715258704064	9.23237411195862	6.0366401181012	0.0140119265235338	0.13636959475721
"Predict-miR-568"	-6.18256055072452	8.37654637988661	6.00245137783413	0.0142860151639361	0.137106062198331
"Predict-miR-407"	6.63336063682422	10.1022961052148	5.89803783253282	0.0151577619906131	0.14347963747279
"Predict-miR-566"	-6.17768613989045	9.3244138918325	5.81981561599848	0.0158466060632586	0.147232864548288
"Predict-miR-361"	-6.19241828885806	9.96621943013775	5.80502812353597	0.0159804122158055	0.147232864548288
"Predict-miR-211"	2.52410668333241	10.6530939896661	5.66421444658045	0.0173144695932879	0.15742498011792
"Predict-miR-510"	-6.1707701152828	9.14756758292003	5.57139979566687	0.0182561605983036	0.162427687918529
"Predict-miR-165"	-1.70227316318855	10.7561910607176	5.56387205404579	0.0183348186073013	0.162427687918529
"Predict-miR-461"	-6.17919421999469	7.80997171742813	5.49027256308127	0.0191225616569908	0.167261900063046
"Predict-miR-72"	-6.19278498692619	9.84111443801896	5.42363530854468	0.0198659555707577	0.17159219124242
"Predict-miR-400"	6.456391088116	10.0778962928009	5.3992671519003	0.0201452087456057	0.171856040039673
"Predict-miR-229"	-6.11003775159316	8.65977688227527	5.23996114111818	0.0220737670181099	0.182636752540149
"rna15912"	6.37565995706256	8.36765599346247	5.22816930358886	0.0222239117517362	0.182636752540149
"rna46983"	6.39463193014101	8.98565305673993	5.21881051653802	0.0223438294877452	0.182636752540149
"Predict-miR-320"	-3.04596398853363	9.23533499679827	5.20931606735171	0.0224661707176739	0.182636752540149
"Predict-miR-399"	1.33403412110038	15.0022257786217	5.09083507181969	0.0240526069032846	0.19141997697821
"Predict-miR-208"	1.94457059805414	11.7636608357212	5.08737583057023	0.0241006338597747	0.19141997697821
"rna68982"	2.03835723159898	12.8758218896994	5.03279329609154	0.0248717536663936	0.195299792994068
"Predict-miR-518"	-2.13609028071104	10.6497763147839	4.99861643167753	0.0253675894241782	0.196955104405698
"rna10532"	6.45115397467682	10.2849372623409	4.93336028830992	0.0263430445966236	0.202256042402966
"rna63087"	1.79801858442957	13.6285897679488	4.75347315023398	0.0292392224888995	0.222025304833292
"Predict-miR-565"	-3.07742860396644	8.98683019490733	4.65719764610227	0.0309236231806162	0.231002158520887
"Predict-miR-587"	-2.9999029433979	12.0644737669933	4.64798535617687	0.0310900155462265	0.231002158520887
"rna30256"	2.25461674663552	10.7092676189618	4.58775028827394	0.0322012540889277	0.236713474206905
"rna52801"	6.27925715225162	8.80242464821676	4.47326351654142	0.034429171258293	0.250262714454768
"Predict-miR-338"	6.20156403730859	10.1020673620764	4.44633421710089	0.0349762498401656	0.250262714454768
"Predict-miR-87"	-2.68241075723468	8.31748021447382	4.43879934997204	0.0351309454444464	0.250262714454768
"rna11049"	6.26359892852765	8.34057314411914	4.40372607407623	0.0358604989919773	0.25285311023935
"Predict-miR-301"	-2.37339227022343	9.28639258199586	4.33165638685598	0.0374098242126048	0.260762483363837
"Predict-miR-221"	-2.58273736831342	9.43476014912868	4.31683846535236	0.0377369729904251	0.260762483363837
"rna70362"	6.22000888876026	10.2340974350821	4.28236543776021	0.038509720146687	0.262970097212966
"rna9999"	6.12228211371193	8.91963743880327	4.26883290596476	0.0388175830907707	0.262970097212966
"rna46224"	6.20280215979946	8.94098126647345	4.2115067755621	0.0401506570489045	0.269360233211582
"rna29118"	1.86692205368814	12.8185879610229	4.11463013451166	0.0425138203641942	0.282471633381328
"Predict-miR-422"	-5.62380026378524	9.12643149478958	3.990345457762	0.0457616809703105	0.301155443337948
"Predict-miR-415"	-5.60978414418339	9.30991391469203	3.95562274801474	0.0467150300738724	0.304171258983398
"Predict-miR-68"	-5.5979159691093	8.10416154127467	3.94180104377481	0.0471003251971397	0.304171258983398
"Predict-miR-596"	-5.64389698429942	9.11090639776035	3.87931698900631	0.0488844404559669	0.311149420921276
"Predict-miR-524"	-5.62012087766277	8.91217620534813	3.86782105126776	0.049220383010423	0.311149420921276
"Predict-miR-373"	-5.61308995941815	9.28502326807549	3.85385705129159	0.0496317316122072	0.311149420921276
"Predict-miR-269"	-5.62358281906477	9.17822116233357	3.82871420252618	0.0503815681573027	0.311149420921276
"Predict-miR-207"	-2.70562782948516	8.88874379643202	3.81768704104008	0.0507141999378123	0.311149420921276
"Predict-miR-75"	-5.57834483794077	9.47708005216057	3.80732883612872	0.0510287678688342	0.311149420921276
"rna50768"	1.70826403812284	12.8766403508374	3.78748482787782	0.0516371865985403	0.311149420921276
"Predict-miR-223"	-5.61487584226736	9.38364841422402	3.78275965466827	0.0517831887206175	0.311149420921276
"Predict-miR-473"	-5.63190317866554	8.78686845323021	3.73409147537616	0.0533126522993735	0.317577954645406
"rna24415"	1.32364748184066	13.6768377746363	3.70160085229449	0.0543602890921903	0.321050938142765
"rna31208"	5.8253448771254	8.62945302641125	3.65550428225132	0.0558842352517464	0.324743004363969
"Predict-miR-438"	5.81742043059425	8.56128040375312	3.654279145134	0.055925350968614	0.324743004363969
"Predict-miR-92"	-5.57885352340987	8.81881994884398	3.59745044846553	0.0578682553364957	0.329543504708559
"rna58409"	1.15909850969952	13.1279379670187	3.56723616744237	0.0589303180545772	0.329543504708559
"Predict-miR-226"	-5.8743227302663	8.06342036742586	3.54793891911146	0.0596194626668053	0.329543504708559
"rna40085"	5.81369659921376	10.1741052014231	3.54734766054921	0.0596407125519256	0.329543504708559
"Predict-miR-277"	5.83790774758648	9.16489854696745	3.54555189454854	0.0597053019363553	0.329543504708559
"rna39160"	2.95806089161681	8.59711509227398	3.5390755040312	0.0599388607607341	0.329543504708559
"rna2228"	5.93134132231781	11.2679048949464	3.53488718237942	0.0600904219873784	0.329543504708559
"Predict-miR-97"	5.85035190617163	9.75613516381396	3.51718001301315	0.0607357047767985	0.330459622053289
"Predict-miR-416"	-2.69064397959601	9.60737968577729	3.46817504301898	0.0625602953076345	0.337727844199808
"rna34406"	-2.66188508942705	8.72336417449406	3.42953911776263	0.0640399703785553	0.343035810322339
"rna15913"	1.72515106223224	12.8583544652376	3.40388616117262	0.0650430121671376	0.344484073663085
"Predict-miR-288"	-1.30054535433402	11.5818451357992	3.38543147157147	0.065774961128094	0.344484073663085
"rna49429"	-1.52543583829866	10.5254847146854	3.3846554886002	0.0658059301353506	0.344484073663085
"rna30133"	2.3444542721465	10.3095483987365	3.35205716518633	0.0671210821846367	0.348726825485594
"rna55382"	6.06918057315365	8.31189706921139	3.31970277782086	0.0684542037635232	0.349728416017165
"Predict-miR-261"	2.40169663935254	9.65981011781234	3.31678426219719	0.0685758421380546	0.349728416017165
"Predict-miR-555"	2.07383633915002	11.4952475112931	3.31065096668238	0.0688322208080094	0.349728416017165
"rna19201"	2.62586335539465	9.91703009894555	3.28557596147014	0.0698911024435322	0.352516436412268
"Predict-miR-249"	1.53143860462731	12.8863121446539	3.06798209352857	0.0798485299558752	0.398912180798484
"rna39356"	1.44156394823334	14.3034995452275	3.05994726197199	0.0802442737062074	0.398912180798484
"rna504"	2.33099625547982	11.2044355932828	2.95731671581495	0.0854897044395144	0.417662445663073
"rna12553"	1.66106038788899	12.8608125074129	2.95110388804368	0.0858189200444848	0.417662445663073
"Predict-miR-329"	1.56349490112464	12.4924459520995	2.95090784927279	0.0858293303678096	0.417662445663073
"Predict-miR-573"	2.32306069923518	10.0493204844553	2.81453367074306	0.0934140399120898	0.451267124564066
"Predict-miR-553"	-5.61468114584004	7.82887265729034	2.79187250294929	0.0947434596499076	0.451267124564066
"Predict-miR-306"	5.41130745905425	8.38094333908445	2.74202472137821	0.0977408538901152	0.451267124564066
"Predict-miR-241"	5.41308742643145	8.38787718981506	2.740189917197	0.0978531366058571	0.451267124564066
"Predict-miR-121"	5.44590085646478	10.432316482062	2.73944332324405	0.0978988654444546	0.451267124564066
"rna41819"	5.42615222967814	9.24393198833396	2.73371122885433	0.0982507333472921	0.451267124564066
"Predict-miR-410"	5.47010358992363	10.1063276362687	2.73168394770677	0.0983755092035438	0.451267124564066
"Predict-miR-81"	5.43812852247526	9.11789887303037	2.72190474915418	0.0989798364738653	0.451267124564066
"Predict-miR-358"	5.4178567966636	9.04389716587609	2.71713305306589	0.0992761837876214	0.451267124564066
"Predict-miR-15"	5.3966094678597	8.04437092693266	2.69470015403586	0.100682428268601	0.451267124564066
"rna9998"	5.4280198006191	8.26790730543047	2.69403500414891	0.100724455103491	0.451267124564066
"Predict-miR-509"	5.50725193963312	8.32894308880511	2.68920688994479	0.101030089912981	0.451267124564066
"Predict-miR-143"	5.43031121438713	9.61423708175188	2.6861378330114	0.101224897695268	0.451267124564066
"Predict-miR-268"	5.38633542317185	9.20964066358724	2.66025790629192	0.102884051250373	0.452527057910173
"rna17900"	2.22441139174425	9.08072432257166	2.65423956768944	0.103274133963418	0.452527057910173
"Predict-miR-545"	5.42208348886312	8.43464515617042	2.65119358377814	0.103472178219692	0.452527057910173
"rna21854"	1.12632953145547	13.661192166112	2.6300981467347	0.104855231630909	0.455691604131813
"rna29117"	5.3938908960574	9.03063860696733	2.60272367576245	0.106680235886289	0.46072526873391
"Predict-miR-83"	-1.54701269530259	10.8717533044986	2.57758100544497	0.108387185591719	0.465189722011663
"rna60848"	1.67601947086166	10.9468479437413	2.55940721722535	0.1096396868446	0.467660639565545
"Predict-miR-363"	5.32600185763868	8.79354443418063	2.45371671618003	0.117246955877405	0.497040776142865
"Predict-miR-323"	-2.03396447042764	9.91124145005783	2.35307142879692	0.125036434488006	0.523762470418626
"Predict-miR-315"	-2.33624580762155	8.63895474047814	2.34122643541021	0.125990326410374	0.523762470418626
"rna44410"	1.17368467116858	13.6512952182184	2.30392519376714	0.129047518237719	0.523762470418626
"Predict-miR-562"	2.02896709633279	9.68182304156824	2.25510395915622	0.133174511929149	0.523762470418626
"Predict-miR-572"	-1.25808357211757	10.418628377911	2.22112290447389	0.136134014604882	0.523762470418626
"rna54456"	1.98131162045536	9.34373161135416	2.07896721325939	0.149341192009374	0.523762470418626
"Predict-miR-290"	-2.31154572733934	8.87867037398784	2.07375286833981	0.149852382731777	0.523762470418626
"rna69973"	5.34191885069057	8.33819959924235	2.00931976348699	0.156335401721087	0.523762470418626
"Predict-miR-231"	-4.63705939609012	8.86177546687586	2.00302348595132	0.15698579455258	0.523762470418626
"Predict-miR-594"	-4.63662356225056	8.21219721956944	2.00241387097639	0.157048929654743	0.523762470418626
"Predict-miR-608"	-4.63660925577531	8.012944721316	2.0023664349595	0.157053843601351	0.523762470418626
"Predict-miR-263"	-4.64026563410914	8.29198986216098	2.00198556023875	0.157093305147493	0.523762470418626
"Predict-miR-119"	-4.63604062005786	8.48813419938108	2.00047989936545	0.157249413555382	0.523762470418626
"Predict-miR-295"	-4.64729293436522	8.8834592668901	1.99828492241392	0.157477306973499	0.523762470418626
"Predict-miR-607"	-4.64785541217109	8.89448552421086	1.99798498445547	0.157508477174105	0.523762470418626
"Predict-miR-390"	-4.64974710146153	9.76991297199503	1.9969721385267	0.157613786163112	0.523762470418626
"Predict-miR-27"	-4.63766676341384	9.52083827354088	1.99575068485189	0.157740891307711	0.523762470418626
"Predict-miR-129"	-4.65221634620084	10.6589031607194	1.99564044915164	0.157752368228882	0.523762470418626
"Predict-miR-157"	-4.63768488111188	7.99419308808984	1.99552935521947	0.157763935463501	0.523762470418626
"Predict-miR-42"	-4.63771474987969	8.40641152653531	1.99516389960975	0.15780199394967	0.523762470418626
"Predict-miR-98"	-4.63374912157339	8.62180882557673	1.99285558947946	0.158042622379511	0.523762470418626
"Predict-miR-531"	-4.63798034223463	7.84853896791336	1.99188243653463	0.158144193175373	0.523762470418626
"rna15527"	-4.66180181398263	9.72986097162187	1.99036569543634	0.158302647935826	0.523762470418626
"Predict-miR-70"	-4.66181143810153	9.05875698148576	1.99036031385351	0.15830321047415	0.523762470418626
"rna27273"	-4.668338128416	7.87702541812518	1.98667027726927	0.158689467000091	0.523762470418626
"Predict-miR-474"	-4.63847236774185	8.74485672284428	1.98564579601205	0.158796895239337	0.523762470418626
"rna39161"	1.58054561364556	9.61469180309796	1.98557649649198	0.158804165051836	0.523762470418626
"Predict-miR-123"	-4.67149743614906	8.11153597603091	1.98485463837753	0.15887991354463	0.523762470418626
"Predict-miR-105"	-4.67478546634066	9.62749058207378	1.98294423523553	0.159080581034977	0.523762470418626
"Predict-miR-398"	-4.62922298423556	10.5526192323479	1.97769304942643	0.159633650307288	0.523762470418626
"Predict-miR-7"	-4.62915616872622	8.98363983060416	1.97746819309115	0.159657381628636	0.523762470418626
"Predict-miR-493"	-4.63924092176	9.83377380753136	1.97545958521556	0.159869548296332	0.523762470418626
"Predict-miR-534"	-4.63927184678145	7.94034578270987	1.97503753341938	0.159914169899466	0.523762470418626
"Predict-miR-582"	-4.62758840141437	8.48640545369518	1.97218358520351	0.160216277352405	0.523762470418626
"Predict-miR-78"	-4.70158758892025	8.1409953857343	1.96654028210049	0.16081557084884	0.523762470418626
"Predict-miR-181"	-4.63990933356859	8.42354643915719	1.96610911819647	0.160861463469985	0.523762470418626
"Predict-miR-294"	-4.62578434043733	8.7080880675786	1.96608219116717	0.160864330049152	0.523762470418626
"Predict-miR-65"	-4.624467389965	8.82423657624039	1.96161451760597	0.161340753932813	0.523762470418626
"Predict-miR-35"	-4.6229390131061	8.36598616257092	1.95641510179812	0.161897236339173	0.523762470418626
"Predict-miR-90"	-2.25349610475342	8.0372123866844	1.9561127050625	0.161929668518722	0.523762470418626
"Predict-miR-452"	-4.62223622366596	9.14658592944097	1.95401904524982	0.162154417835455	0.523762470418626
"rna46223"	-4.64121479610385	7.80007323308895	1.94628177348669	0.162988089122908	0.523762470418626
"Predict-miR-161"	-4.64122940578089	7.76845812396175	1.94604651277459	0.163013514392482	0.523762470418626
"Predict-miR-137"	-4.61296875116142	8.18958929991853	1.92211559909172	0.165623625490357	0.523762470418626
"rna31044"	1.5106685659392	11.0410265117269	1.90611646397974	0.167395286969584	0.523762470418626
"Predict-miR-614"	-4.6005593623595	8.23255810342049	1.87850366062113	0.17050431396069	0.523762470418626
"Predict-miR-425"	-1.5028498941614	10.3684733640161	1.86052984908487	0.172563660540414	0.523762470418626
"Predict-miR-470"	-4.5942032197718	8.5840308754385	1.85577117559179	0.173113661659766	0.523762470418626
"Predict-miR-631"	4.84469218065678	8.52164077371017	1.83019850034352	0.176104101414246	0.523762470418626
"Predict-miR-543"	4.85556765653579	9.26277995570464	1.829374996194	0.176201385652781	0.523762470418626
"Predict-miR-411"	4.84370229939302	8.67361496161708	1.82926988484757	0.176213807386452	0.523762470418626
"rna50769"	4.8436871218184	8.30053320432768	1.82909070174806	0.176234985018589	0.523762470418626
"rna12554"	-4.58678854205575	8.36518894003644	1.82891657966525	0.176255567301357	0.523762470418626
"Predict-miR-455"	4.84297192957994	8.78985843188788	1.82859753805504	0.176293287141045	0.523762470418626
"Predict-miR-354"	4.84911507129199	8.90806348374786	1.82762351295021	0.176408502359598	0.523762470418626
"Predict-miR-138"	4.85581454155829	9.31273461815007	1.8270625769817	0.176474893605109	0.523762470418626
"rna9752"	-1.1277458185721	13.2189554497289	1.82581879510547	0.176622207926241	0.523762470418626
"rna41818"	4.86407273325439	8.89026424780761	1.82438594623341	0.176792091317122	0.523762470418626
"Predict-miR-432"	4.86582492617879	9.16927489668793	1.82377789957316	0.17686424033966	0.523762470418626
"rna65319"	-4.64646681317909	8.11883429881765	1.82349772130476	0.176897496897831	0.523762470418626
"Predict-miR-539"	4.84312636606105	8.81593232452184	1.82246255223031	0.177020431826646	0.523762470418626
"rna11052"	4.90557214254286	8.18073902577238	1.8201537842024	0.177294972488632	0.523762470418626
"Predict-miR-173"	4.88112025625256	8.97528782827614	1.81783526576678	0.177571167197291	0.523762470418626
"Predict-miR-327"	4.86764033618516	9.0042523719727	1.81623733562238	0.177761810550847	0.523762470418626
"Predict-miR-600"	-4.58286081816263	8.33085337010225	1.81454471920865	0.177964008342354	0.523762470418626
"Predict-miR-171"	4.84244536254896	9.08089080163828	1.81439152456679	0.177982321879094	0.523762470418626
"Predict-miR-140"	-1.49645894023299	10.3536489908152	1.80971181590554	0.178542804140222	0.523762470418626
"rna44577"	4.84490186875512	7.86241164994298	1.8034074776552	0.179301092729941	0.523762470418626
"rna20253"	4.84498072686099	7.89663908261102	1.80152675076612	0.179528027693646	0.523762470418626
"Predict-miR-180"	4.89130249593319	9.62439903716052	1.79740404906467	0.180026649783834	0.523762470418626
"Predict-miR-132"	4.92741158506683	8.71969029469654	1.79163883220196	0.180726615012504	0.523762470418626
"Predict-miR-197"	-4.57663866803732	8.17420033215292	1.79157038804589	0.180734943830181	0.523762470418626
"Predict-miR-210"	-4.57502009976254	8.11015233983805	1.78555255056155	0.181468980739638	0.523762470418626
"Predict-miR-552"	4.82323751924087	7.99026461894876	1.78471610285573	0.181571280926141	0.523762470418626
"Predict-miR-270"	4.84590736833391	9.50627252956206	1.77985831455356	0.18216672555604	0.523762470418626
"Predict-miR-131"	4.81892204632764	8.65231253741677	1.77504689181232	0.182758717724295	0.523762470418626
"Predict-miR-389"	4.8173137161778	9.73971863399068	1.77143650664745	0.183204399907888	0.523762470418626
"Predict-miR-593"	4.8380502816793	8.18188187644513	1.76165973624457	0.184417629607298	0.523762470418626
"Predict-miR-464"	4.96313163860423	8.02054159890914	1.76033756538712	0.184582416308876	0.523762470418626
"Predict-miR-567"	-4.56478783957078	7.96991623759292	1.74711323508596	0.186240050861385	0.523762470418626
"Predict-miR-217"	4.84747295527259	8.24705677735465	1.74466273406011	0.186549110357774	0.523762470418626
"rna51554"	4.83660970393856	7.77359335136515	1.7441007338177	0.186620074364324	0.523762470418626
"Predict-miR-77"	4.8042472276705	8.31179423787962	1.74196752240576	0.186889721636755	0.523762470418626
"rna11053"	5.13677067183088	7.92683457098374	1.73935598090855	0.187220448905066	0.523762470418626
"Predict-miR-133"	4.79810548125098	7.98863067888942	1.72803075001824	0.188662584462014	0.524285037866119
"Predict-miR-508"	-4.55923904845015	7.9906370492997	1.72598307704282	0.188924709737574	0.524285037866119
"Predict-miR-343"	-1.68026478083792	9.16218101501375	1.71324350475807	0.190565082570168	0.526721888223945
"Predict-miR-183"	4.84925026978978	8.23093459935557	1.70613710142997	0.191487329869342	0.527162330437112
"Predict-miR-62"	-4.64798192392085	7.88560697984477	1.63549410722199	0.200944817298369	0.551003447433227
"rna19535"	4.74153292043376	8.69964691734023	1.59696225099913	0.206334235843795	0.562722807333207
"Predict-miR-168"	-1.78315550788193	9.28794537738811	1.59335496275469	0.206847457398892	0.562722807333207
"Predict-miR-634"	1.18000459309216	9.76960450359329	1.56062737481925	0.211573384179367	0.573322386148795
"rna30134"	-0.756886954491133	11.9048612823613	1.54789562708744	0.213446372360115	0.576138450393905
"Predict-miR-146"	-4.5015732137864	7.95226274833368	1.49459757038864	0.221504488771213	0.59556265268836
"rna37801"	5.16237198611691	7.96618345740545	1.47854606129379	0.224002143116715	0.599943724393993
"Predict-miR-500"	4.68336050695016	8.30350206797548	1.45643480749442	0.227498233117555	0.606954745498959
"rna41496"	-0.796845763060699	11.2834194671721	1.426080109176	0.23240523354172	0.617661601451263
"Predict-miR-559"	0.617578464698661	14.2269457051603	1.28410013243729	0.257138074717042	0.673883406507908
"rna31047"	1.2077573780124	10.3293225314708	1.18102874801813	0.277146662398941	0.673883406507908
"Predict-miR-303"	-1.05387024957648	10.0700747702323	1.15124179093577	0.28328935012231	0.673883406507908
"rna34927"	0.837163505620954	13.2757257079128	1.12720949617663	0.288371341994009	0.673883406507908
"rna33835"	1.01665255787133	9.47656991282232	1.12133705077273	0.289630734413139	0.673883406507908
"Predict-miR-548"	1.50565304078105	11.5599412351597	1.10650590382444	0.292842750614815	0.673883406507908
"rna46984"	-1.7371281325791	7.92066350630791	1.06641048575436	0.301757641891533	0.673883406507908
"Predict-miR-342"	-1.70452483509467	9.14619278783346	1.06531421038475	0.302006258492187	0.673883406507908
"rna57201"	1.49093345545197	8.58773617222539	1.06233543151163	0.302683130990104	0.673883406507908
"Predict-miR-37"	-1.35207759606442	9.87064914950797	1.04560443626685	0.306521601044248	0.673883406507908
"Predict-miR-49"	-1.70688249827702	10.5232153485508	1.04537032483913	0.306575757294081	0.673883406507908
"rna70363"	1.62851021331087	8.96867952364288	1.03394021714292	0.309235017307086	0.673883406507908
"Predict-miR-311"	-1.70599076196684	9.11838676291414	1.01664801641786	0.313315430703163	0.673883406507908
"Predict-miR-606"	-1.69765743496517	8.72850840680299	1.01530104300777	0.313636213936433	0.673883406507908
"rna9092"	0.849376050957884	11.8700808205735	1.01419535151058	0.313899856273443	0.673883406507908
"Predict-miR-159"	-1.69487601766088	9.48025569034	1.00192283201863	0.316845685693782	0.673883406507908
"Predict-miR-480"	-1.70380257763096	8.64118730871282	0.990629219105724	0.319588636466521	0.673883406507908
"Predict-miR-372"	3.89376015741458	8.18425184229483	0.915192038020106	0.338740560974912	0.673883406507908
"Predict-miR-265"	3.89354230258351	8.61184942643479	0.915122092757479	0.338759019488299	0.673883406507908
"rna44578"	3.89737187290829	9.08145550192164	0.915047835954109	0.338778617293232	0.673883406507908
"Predict-miR-120"	3.89897511687617	8.53725347007962	0.914978111136477	0.338797020405879	0.673883406507908
"rna9559"	3.8941889812051	8.67774903884865	0.914955794779542	0.338802910850961	0.673883406507908
"Predict-miR-287"	3.9000831143511	9.19205660144877	0.914927846014186	0.33881028817504	0.673883406507908
"rna42423"	3.89272192026795	8.59141559360325	0.914702008670955	0.338869907858344	0.673883406507908
"rna51239"	3.90476688472959	9.37415454600787	0.914696316489845	0.338871410741564	0.673883406507908
"Predict-miR-396"	3.89266550717614	8.25074208976962	0.914639688509117	0.338886362482552	0.673883406507908
"Predict-miR-468"	3.89265827840401	8.18882088468909	0.914631702602291	0.338888471108826	0.673883406507908
"Predict-miR-550"	3.89265289972856	8.13826341283053	0.91462576053941	0.338890040082959	0.673883406507908
"Predict-miR-477"	3.89265075333543	8.1168982005595	0.914623389315729	0.338890666196294	0.673883406507908
"Predict-miR-260"	3.90656491407201	9.95130506964522	0.914599128105072	0.338897072373556	0.673883406507908
"Predict-miR-203"	3.91089970120152	9.09478682521643	0.914345454995829	0.3389640645503	0.673883406507908
"Predict-miR-533"	3.91355953774444	8.52584270401544	0.914176004240947	0.339008824474948	0.673883406507908
"Predict-miR-405"	3.91469319703163	8.86516431685362	0.914100539791491	0.339028760745763	0.673883406507908
"Predict-miR-430"	3.91738891486767	9.42146255419778	0.91391320696955	0.339078257319893	0.673883406507908
"Predict-miR-325"	3.89816954541161	8.95409528647473	0.913900386291637	0.339081645119885	0.673883406507908
"Predict-miR-441"	3.91928332782772	9.91197363359268	0.913774836899847	0.339114823322047	0.673883406507908
"Predict-miR-73"	3.89911282904774	8.18638234464386	0.913642118395416	0.3391499008067	0.673883406507908
"Predict-miR-605"	3.92111227975539	9.67565605967671	0.913635913534048	0.339151540870105	0.673883406507908
"Predict-miR-577"	3.89933339162054	8.36788698230284	0.913581269901124	0.339165984686481	0.673883406507908
"Predict-miR-561"	3.90033321954741	8.50699400533224	0.913303239870491	0.339239488481341	0.673883406507908
"rna15526"	3.90061608157652	8.11462466574028	0.913223924978201	0.339260461167966	0.673883406507908
"Predict-miR-403"	3.90071527605489	8.15905334805291	0.913196041739921	0.339267834553157	0.673883406507908
"Predict-miR-585"	3.9009118576452	9.8469826107126	0.913140677276591	0.339282475654374	0.673883406507908
"Predict-miR-247"	3.901070914126	9.60612511349757	0.913095777921281	0.339294349887228	0.673883406507908
"Predict-miR-113"	3.92888095414156	8.90252197156267	0.912985991844534	0.339323386630864	0.673883406507908
"Predict-miR-359"	3.93131789224541	8.48468175203515	0.912761651375986	0.339382731651028	0.673883406507908
"Predict-miR-293"	3.90327602091938	9.81565778300622	0.912463701906473	0.33946157010729	0.673883406507908
"Predict-miR-194"	3.90483470811377	8.3071952701806	0.912005959183965	0.339582738380551	0.673883406507908
"Predict-miR-41"	3.90558153684081	10.1897174483946	0.911783369813268	0.339641680634771	0.673883406507908
"Predict-miR-326"	3.90568764672549	8.93918098402327	0.911751571020991	0.339650102161942	0.673883406507908
"Predict-miR-421"	3.89004666849762	9.04476093733953	0.91174353522327	0.33965223039063	0.673883406507908
"Predict-miR-540"	3.9065533479722	9.02187584702235	0.911490520146003	0.339719248956921	0.673883406507908
"rna44066"	0.492618251495907	16.7748748989471	0.911421625423053	0.339737500852737	0.673883406507908
"Predict-miR-378"	3.909633097321	9.97189869107035	0.910538102479718	0.339971684609597	0.673883406507908
"Predict-miR-305"	3.95139509094315	8.63444162009376	0.910516280612475	0.339977471390609	0.673883406507908
"Predict-miR-99"	3.90970633725491	8.9845760504042	0.910514995610372	0.339977812155028	0.673883406507908
"Predict-miR-496"	3.9097462029873	8.17711667159242	0.910502409120877	0.339981149938658	0.673883406507908
"Predict-miR-45"	3.90976079494654	9.21376432874003	0.910497800525869	0.339982372092916	0.673883406507908
"Predict-miR-21"	3.90992286110547	8.45670288435213	0.910446557578195	0.339995961618898	0.673883406507908
"Predict-miR-262"	3.91018739394439	8.9433086137	0.910362689526025	0.340018204833055	0.673883406507908
"Predict-miR-423"	3.95781642679164	8.0400132059534	0.909638874723228	0.34021025403232	0.673883406507908
"Predict-miR-40"	3.91385136632894	10.0462189404975	0.90917172159681	0.340334280890055	0.673883406507908
"rna19198"	3.88720903777229	9.24134423911573	0.90859858248113	0.340486529633797	0.673883406507908
"Predict-miR-356"	3.88715687095096	9.23844180653295	0.908540699255262	0.340501910836346	0.673883406507908
"Predict-miR-616"	3.88658806337774	9.30848810980508	0.907909406003578	0.340669723960244	0.673883406507908
"Predict-miR-317"	3.91898772456386	7.76436023592968	0.907406966997676	0.340803364058369	0.673883406507908
"rna11484"	3.91899582502923	7.76178388046727	0.907404093229697	0.340804128633996	0.673883406507908
"Predict-miR-228"	3.88575553041539	7.86448897830629	0.906984900332344	0.340915681055291	0.673883406507908
"Predict-miR-397"	3.88569577249153	9.47607951943754	0.906918517172563	0.340933350945198	0.673883406507908
"Predict-miR-200"	3.88465316701952	8.50275290803005	0.905759811889766	0.341241974217714	0.673883406507908
"rna34999"	3.88437196448365	7.94513371316303	0.905447131246765	0.341325321747058	0.673883406507908
"Predict-miR-209"	3.88403636501679	7.82488495424953	0.905073872837462	0.341424852677685	0.673883406507908
"Predict-miR-114"	3.88369694689549	8.5436211331007	0.904696265884454	0.341525582958664	0.673883406507908
"Predict-miR-349"	3.92983552552172	9.52280702028295	0.903287201616259	0.341901818127582	0.673883406507908
"Predict-miR-28"	3.9309989369719	8.43466299545762	0.902811623316873	0.342028928694845	0.673883406507908
"Predict-miR-251"	3.88133531867591	9.66930443429034	0.902066100758192	0.342228317085862	0.673883406507908
"Predict-miR-625"	3.88089482627071	9.02992003969963	0.901574974003864	0.342359753518813	0.673883406507908
"Predict-miR-307"	3.88078558954785	8.16756120365871	0.901453153973998	0.342392365803372	0.673883406507908
"Predict-miR-142"	3.88029139336058	8.19426413268608	0.900901897678344	0.342539994317335	0.673883406507908
"Predict-miR-334"	3.88027804306074	8.99603621291798	0.900887002943806	0.342543984374641	0.673883406507908
"Predict-miR-439"	3.88018790892546	9.84266059903139	0.900786437470952	0.34257092587126	0.673883406507908
"Predict-miR-67"	3.88004532934399	7.95784231109425	0.900627342265697	0.34261355332575	0.673883406507908
"Predict-miR-178"	3.93917548795139	7.98520989494429	0.899269984213065	0.342977530634914	0.673883406507908
"Predict-miR-246"	3.87756442312031	9.07568171094338	0.897856175105128	0.34335720049742	0.673883406507908
"rna44409"	3.87743787163569	8.06635018844755	0.897714670935335	0.343395231817635	0.673883406507908
"Predict-miR-523"	3.87708492040368	8.76466404709007	0.897319941625003	0.343501351178091	0.673883406507908
"rna50694"	3.8749478887092	7.84829187730379	0.894927590268159	0.344145461722236	0.673883406507908
"Predict-miR-51"	3.87486919787689	9.75104523729322	0.894839420432467	0.344169231513162	0.673883406507908
"rna11058"	4.0312947296452	8.36653747536515	0.892616723870304	0.34476918435548	0.673883406507908
"Predict-miR-447"	3.86902451249441	7.98977338218814	0.888275274001421	0.345945120584151	0.673883406507908
"Predict-miR-55"	3.86499486737062	7.96228813184194	0.883731826196721	0.347181595506819	0.673883406507908
"Predict-miR-266"	3.96784222961929	8.13960898545537	0.88362502958536	0.347210731651155	0.673883406507908
"Predict-miR-395"	3.86357020967288	8.84697954406906	0.882122035129155	0.347621129160947	0.673883406507908
"Predict-miR-433"	3.86316881083391	8.21679753728616	0.881668145736386	0.347745194526036	0.673883406507908
"Predict-miR-205"	3.85911783884004	8.25016734276288	0.877079318490569	0.349002880250881	0.673883406507908
"Predict-miR-443"	3.85656800584665	7.85849158200692	0.874183348080335	0.349799778520798	0.673883406507908
"Predict-miR-134"	3.98294449493308	8.72041557931517	0.872853639875927	0.350166510083429	0.673883406507908
"Predict-miR-139"	3.9862382647228	8.1388722143488	0.870218745615841	0.35089475773299	0.673883406507908
"Predict-miR-48"	3.98857170527066	8.01831174123971	0.868283761751195	0.351430874466204	0.673883406507908
"Predict-miR-16"	3.85035422617073	8.63003059318651	0.86710136212141	0.35175902598139	0.673883406507908
"rna6961"	3.84941363104102	8.36202812572678	0.866026279789072	0.352057756511367	0.673883406507908
"Predict-miR-459"	-1.69447193481624	8.3683043177155	0.839099157877055	0.359654539252946	0.686522891225927
"rna69978"	3.81161348716624	7.8668592686531	0.822136794761048	0.364556157148142	0.693962271596051
"rna11056"	4.03631035838547	7.93271859662945	0.811894396801041	0.367560763806431	0.697759581841328
"rna69979"	3.79482558792881	8.28645534779083	0.802197772123963	0.370437083087047	0.701293217570273
"Predict-miR-80"	-0.826643417848702	10.0637511033776	0.754803985218853	0.384959509847041	0.726795140175697
"Predict-miR-520"	-1.06289048907025	9.86424645046652	0.729870782164777	0.392925076224738	0.73822136585933
"Predict-miR-611"	-1.03391080866976	10.2616902536658	0.729182557875284	0.393148281673276	0.73822136585933
"Predict-miR-351"	0.815708111760156	9.07358579562581	0.707571976360459	0.400251037175155	0.747986693620441
"Predict-miR-54"	0.572381579661282	11.5211791509614	0.706782975731709	0.400513859102117	0.747986693620441
"Predict-miR-278"	1.23307469691866	10.7637922445449	0.665656511529896	0.414570055984293	0.772150697264546
"Predict-miR-494"	1.19746755761533	10.0053784632134	0.654149722841904	0.418632940831722	0.777621941168602
"Predict-miR-347"	1.19982088033747	9.24501701015422	0.648833637458228	0.420529993461643	0.779051542847172
"rna34405"	1.19924991589761	8.33814228444226	0.622690486454861	0.43004923808585	0.794556212613161
"Predict-miR-610"	1.16741182268499	9.07940179293748	0.615195502462495	0.432838290984945	0.797576690854925
"rna40590"	-0.620164857261743	10.5120068945259	0.532343185430449	0.465623398261395	0.853809346532755
"rna21851"	0.564253122232825	13.2688130789	0.528522343591783	0.467228760204413	0.853809346532755
"Predict-miR-465"	1.13822649497018	8.33697533479827	0.526957711498129	0.467888716481219	0.853809346532755
"rna7683"	0.573356694513379	11.8141607382242	0.525989756956305	0.468297745782799	0.853809346532755
"rna38013"	0.508701222544074	12.994935840491	0.486393953152668	0.485540304200891	0.882916711060041
"Predict-miR-490"	-0.78613191923086	12.0693855699734	0.472404777220344	0.491882933908706	0.892102643913165
"rna66916"	0.881490942915896	11.7497090514342	0.466539153298509	0.494583643234098	0.894652611190476
"rna48654"	0.536120906909956	13.624955637025	0.450309870297197	0.502187838629784	0.906036022175406
"Predict-miR-495"	0.7717408391732	11.3447282189518	0.433844835058878	0.510108351855396	0.917929351906456
"Predict-miR-483"	-0.787119581234164	9.25806404806385	0.410856152791075	0.521535275614331	0.936054221946761
"Predict-miR-348"	-0.743462357163101	8.8185591654878	0.395175790428347	0.52959125610652	0.948050668315039
"rna51016"	0.488770476913228	11.2578142947779	0.37711383576182	0.539151924404548	0.962671782334735
"Predict-miR-135"	-0.766190543893105	9.05910585297082	0.3486738041018	0.554864819110281	0.988174201044341
"rna41499"	0.292396399150457	12.3857470109457	0.300740405072693	0.583418625229968	1
"Predict-miR-571"	0.61672192648755	8.1917847805543	0.28803122813486	0.591484936520866	1
"Predict-miR-239"	-0.759806996141915	9.63838728847048	0.27586985714832	0.599421125898749	1
"Predict-miR-150"	-0.761961380200524	9.08604765716523	0.270688926387599	0.602870008689363	1
"rna29819"	-0.744648938214757	9.53040729337849	0.263713710967203	0.607580188424917	1
"Predict-miR-214"	0.842587751811505	9.17215755291932	0.255857390356466	0.612980575569852	1
"Predict-miR-406"	-0.740174798663351	10.1705041828197	0.252414507296274	0.615380056666154	1
"rna505"	0.817910149189765	11.7160050827304	0.250010372077984	0.617067774248611	1
"rna63727"	0.787185870556928	11.0986476727301	0.249167734097231	0.617661712011701	1
"rna60851"	0.77770865256537	8.89542343405765	0.245660579276098	0.620147308702214	1
"Predict-miR-381"	0.784161851003734	8.56324781714602	0.243686250268428	0.621556296036433	1
"Predict-miR-357"	0.768801003928619	9.14900753825055	0.241016381379085	0.623472992473287	1
"Predict-miR-340"	0.781264227302633	8.93848618265588	0.238294139575341	0.625440900818459	1
"rna10531"	0.751708716671183	9.20479482306239	0.219658644037164	0.639300137642805	1
"Predict-miR-298"	0.937350018825473	8.68997740408605	0.218760859178278	0.63998570776036	1
"rna35737"	0.282677814258755	11.7454064077172	0.213223537933914	0.644252475339259	1
"Predict-miR-198"	-0.792678986629258	8.4596333049457	0.149463530722295	0.69904855553207	1
"Predict-miR-575"	-0.785419550895726	7.88679136099305	0.149194367390249	0.69930644145544	1
"Predict-miR-82"	-0.752794127023818	8.2909382940745	0.147108120050587	0.70131440375213	1
"rna37802"	-0.744413601931015	8.23377221864856	0.146357468544199	0.702040881980024	1
"rna55115"	-0.751378697730855	9.1164473076074	0.144398904669742	0.703946484985771	1
"rna39357"	-0.749973997477466	8.79238484301414	0.138996672545773	0.709280499730658	1
"Predict-miR-541"	-0.733610039441943	10.2358951540259	0.137735833623115	0.710542356235229	1
"Predict-miR-437"	-0.73044062046783	9.58074966316415	0.137214892126854	0.711065636552909	1
"rna11055"	-0.729450369685304	8.31512831619092	0.134341002527728	0.713972926781304	1
"Predict-miR-379"	-0.722370623366525	9.83491003105417	0.134271464060433	0.714043708788072	1
"Predict-miR-215"	-0.717944613841333	9.86732008207768	0.132753877403879	0.715593639683542	1
"Predict-miR-402"	-0.727423619400531	8.95035091550379	0.132706251511047	0.715642442690122	1
"Predict-miR-149"	-0.715884914626696	10.0294972134368	0.127818279077566	0.720704933980874	1
"Predict-miR-63"	-0.680747441853847	7.94529799737071	0.0982593353579766	0.753928584027988	1
"Predict-miR-365"	-0.317915223140866	10.4365161510492	0.0732952507628095	0.786597965860073	1
"rna848"	0.180901965337937	11.7377319978968	0.0632535733463762	0.801425528392726	1
"rna63728"	0.260243216179216	11.7005433356215	0.04777666274531	0.826978220422376	1
"Predict-miR-225"	-0.212360508281754	10.5203200424509	0.0424647967385283	0.836736323642014	1
"Predict-miR-580"	0.163829060954321	11.6397824479057	0.0411747572519978	0.839200969059881	1
"rna21855"	-0.139479079799652	13.2825033617394	0.0364971200960191	0.848492535440152	1
"rna9029"	0.226164467652736	11.7347930771964	0.0284739015997371	0.865999490243087	1
"Predict-miR-182"	-0.225810926893937	9.770953324995	0.0284388066845107	0.866081315134423	1
"Predict-miR-538"	-0.242900987568072	9.2363806286478	0.0283713253685676	0.866238795967563	1
"Predict-miR-346"	0.190100291783356	10.3018273369294	0.0221056347219282	0.881806429247826	1
"Predict-miR-479"	0.147781046954186	10.0802436202508	0.0207807620370133	0.885377806064526	1
"Predict-miR-467"	0.225393985289667	9.35295196671524	0.0165607301219808	0.897604135135949	1
"Predict-miR-245"	0.224200433896464	9.6300089799721	0.0164644165267234	0.897900690024924	1
"Predict-miR-440"	0.216738176035638	10.0014613845614	0.0158536941931899	0.8998020160306	1
"Predict-miR-486"	0.217436607946535	10.8419276572925	0.0155222389794041	0.900849508999668	1
"Predict-miR-366"	0.212717958017207	8.8738988218021	0.0155189288341564	0.900860026991696	1
"rna31209"	0.207249616389769	7.873389427655	0.0150576851385935	0.902336935114153	1
"rna29820"	-0.0810292217392197	12.9306049202199	0.0139495637703604	0.905981869707301	1
"rna38012"	0.195081779547441	8.35991745508123	0.0130251187862598	0.909136609824993	1
"Predict-miR-24"	0.192261885064694	8.34187619310046	0.0126623145182148	0.91040560228328	1
"Predict-miR-560"	0.188219301710331	8.90370222779177	0.0119267274577073	0.913036279834288	1
"Predict-miR-504"	0.18620395868981	9.25786459173155	0.0118924087868368	0.913160991334272	1
"rna6960"	-0.0658233781366603	11.7561090704988	0.0102632877489928	0.919306056347106	1
"Predict-miR-394"	0.17117576188852	8.97970614573142	0.00969550753154991	0.921562452754923	1
"Predict-miR-503"	0.16118372979814	9.69309841591149	0.00864985063610035	0.925899928084317	1
"Predict-miR-597"	0.159804647813017	8.91529615940744	0.00809749792060543	0.928298261809558	1
"rna49430"	0.129818430150619	9.76569547251887	0.00569304890601074	0.939854851910029	1
"Predict-miR-369"	-0.0285077959024221	12.547926138088	0.00152621378314777	0.968837141525076	1
"rna21373"	0.0123183128607254	12.4273811584204	0.000385738466093244	0.984330374534881	1
"Predict-miR-106"	0	10.0620558254681	0	1	1
"Predict-miR-110"	0	9.05418476358546	0	1	1
"Predict-miR-117"	0	8.03399555084624	0	1	1
"Predict-miR-118"	0	9.0574605571816	0	1	1
"Predict-miR-12"	0	8.56641582784659	0	1	1
"Predict-miR-122"	0	8.17828613666435	0	1	1
"Predict-miR-125"	0	8.26535259265327	0	1	1
"Predict-miR-13"	0	8.75760431973649	0	1	1
"Predict-miR-130"	0	10.5486592965734	0	1	1
"Predict-miR-141"	0	7.90412895194068	0	1	1
"Predict-miR-148"	0	8.78843465818496	0	1	1
"Predict-miR-151"	0	8.70361939456458	0	1	1
"Predict-miR-152"	0	8.59503021618406	0	1	1
"Predict-miR-155"	0	8.07310372201381	0	1	1
"Predict-miR-156"	0	8.29047675131669	0	1	1
"Predict-miR-18"	0	8.96626216967296	0	1	1
"Predict-miR-185"	0	8.80815921165808	0	1	1
"Predict-miR-186"	0	8.47799576453789	0	1	1
"Predict-miR-19"	0	8.58784750849343	0	1	1
"Predict-miR-191"	0	8.12519570262024	0	1	1
"Predict-miR-20"	0	10.3848370841291	0	1	1
"Predict-miR-218"	0	8.28802082847187	0	1	1
"Predict-miR-220"	0	8.45651002025239	0	1	1
"Predict-miR-230"	0	8.82600566427128	0	1	1
"Predict-miR-254"	0	8.25616737546081	0	1	1
"Predict-miR-255"	0	8.43715386445947	0	1	1
"Predict-miR-256"	0	8.03761250415586	0	1	1
"Predict-miR-257"	0	8.37893115818652	0	1	1
"Predict-miR-267"	0	8.65065054542607	0	1	1
"Predict-miR-271"	0	7.96266461445973	0	1	1
"Predict-miR-274"	0	10.0406619368336	0	1	1
"Predict-miR-285"	0	8.68509886773635	0	1	1
"Predict-miR-3"	0	8.89960979254248	0	1	1
"Predict-miR-308"	0	8.20162375587807	0	1	1
"Predict-miR-310"	0	8.60079640502422	0	1	1
"Predict-miR-330"	0	8.01255479408016	0	1	1
"Predict-miR-335"	0	8.17877112763836	0	1	1
"Predict-miR-336"	0	8.33334522400614	0	1	1
"Predict-miR-339"	0	9.20156910547839	0	1	1
"Predict-miR-34"	0	8.03990586423498	0	1	1
"Predict-miR-355"	0	8.62352242635779	0	1	1
"Predict-miR-360"	0	7.84159848406661	0	1	1
"Predict-miR-382"	0	7.84882674205982	0	1	1
"Predict-miR-383"	0	7.98720374187236	0	1	1
"Predict-miR-384"	0	8.09372508779263	0	1	1
"Predict-miR-388"	0	9.3274632917553	0	1	1
"Predict-miR-39"	0	8.53140023471492	0	1	1
"Predict-miR-391"	0	8.79967879751343	0	1	1
"Predict-miR-414"	0	8.12891795781309	0	1	1
"Predict-miR-420"	0	8.21634866937664	0	1	1
"Predict-miR-427"	0	8.60324184543566	0	1	1
"Predict-miR-428"	0	7.79949451854899	0	1	1
"Predict-miR-429"	0	7.79085912305872	0	1	1
"Predict-miR-436"	0	8.20430173044795	0	1	1
"Predict-miR-450"	0	8.36096832390371	0	1	1
"Predict-miR-454"	0	8.17788535015074	0	1	1
"Predict-miR-456"	0	8.43688171310676	0	1	1
"Predict-miR-458"	0	8.88667087147664	0	1	1
"Predict-miR-46"	0	8.19209768949801	0	1	1
"Predict-miR-472"	0	9.64571662452403	0	1	1
"Predict-miR-475"	0	8.78491103897303	0	1	1
"Predict-miR-476"	0	8.53917755388688	0	1	1
"Predict-miR-478"	0	8.82362795697825	0	1	1
"Predict-miR-489"	0	8.90118925680199	0	1	1
"Predict-miR-498"	0	8.84118944727881	0	1	1
"Predict-miR-501"	0	8.36907824054757	0	1	1
"Predict-miR-506"	0	8.78804373669002	0	1	1
"Predict-miR-517"	0	8.5631631614969	0	1	1
"Predict-miR-52"	0	8.45193787189683	0	1	1
"Predict-miR-521"	0	8.89321174652108	0	1	1
"Predict-miR-528"	0	7.85745859542837	0	1	1
"Predict-miR-549"	0	8.38674168978745	0	1	1
"Predict-miR-564"	0	9.74596886338653	0	1	1
"Predict-miR-569"	0	9.79995630201463	0	1	1
"Predict-miR-579"	0	8.70842508470495	0	1	1
"Predict-miR-586"	0	7.98678758202419	0	1	1
"Predict-miR-595"	0	9.03523188013504	0	1	1
"Predict-miR-6"	0	8.9221147156059	0	1	1
"Predict-miR-601"	0	7.96386648228463	0	1	1
"Predict-miR-604"	0	7.79006261915374	0	1	1
"Predict-miR-615"	0	8.00436246573449	0	1	1
"Predict-miR-623"	0	9.09225778229754	0	1	1
"Predict-miR-630"	0	8.57215146914719	0	1	1
"Predict-miR-74"	0	8.03406668685739	0	1	1
"Predict-miR-8"	0	8.97547443093246	0	1	1
"Predict-miR-84"	0	8.17997129106796	0	1	1
"Predict-miR-95"	0	7.95587645426544	0	1	1
"rna11059"	0	8.10243069958928	0	1	1
"rna11800"	0	7.78935512496392	0	1	1
"rna18860"	0	8.54074603229351	0	1	1
"rna23853"	0	8.28629807167707	0	1	1
"rna35738"	0	8.28950593087874	0	1	1
"rna39993"	0	9.43751705232614	0	1	1
"rna438"	0	8.24830671526805	0	1	1
"rna44328"	0	8.64055710362936	0	1	1
"rna44329"	0	7.86255977581759	0	1	1
"rna51238"	0	7.82000452722587	0	1	1
"rna57202"	0	7.79107845191255	0	1	1
"rna61260"	0	8.21412192663205	0	1	1
"rna63088"	0	8.19862737167404	0	1	1
"rna68981"	0	9.4707251316082	0	1	1
"rna69972"	0	7.82825652688166	0	1	1
"rna7820"	0	7.85809979643892	0	1	1
"rna847"	0	8.1560561558784	0	1	1
"rna9028"	0	7.92849416487513	0	1	1
"Predict-miR-102"	0	9.53580799578378	0	1	1
"Predict-miR-108"	0	8.02841726071589	0	1	1
"Predict-miR-136"	0	7.79032755701742	0	1	1
"Predict-miR-153"	0	8.5068171064924	0	1	1
"Predict-miR-190"	0	8.49926054458513	0	1	1
"Predict-miR-192"	0	8.2169603059316	0	1	1
"Predict-miR-195"	0	8.45591962502155	0	1	1
"Predict-miR-202"	0	7.75701835372071	0	1	1
"Predict-miR-204"	0	8.10722541830559	0	1	1
"Predict-miR-212"	0	8.21869757277845	0	1	1
"Predict-miR-213"	0	8.17122573937028	0	1	1
"Predict-miR-273"	0	8.59488216673147	0	1	1
"Predict-miR-300"	0	7.75948521824825	0	1	1
"Predict-miR-309"	0	10.2510895405668	0	1	1
"Predict-miR-31"	0	8.57226987662962	0	1	1
"Predict-miR-313"	0	9.02553142826858	0	1	1
"Predict-miR-318"	0	8.38931844763548	0	1	1
"Predict-miR-321"	0	7.90380735784794	0	1	1
"Predict-miR-322"	0	7.92137819536356	0	1	1
"Predict-miR-33"	0	7.90463644198025	0	1	1
"Predict-miR-332"	0	8.60202604329664	0	1	1
"Predict-miR-333"	0	8.07428174374096	0	1	1
"Predict-miR-377"	0	8.10966882151193	0	1	1
"Predict-miR-387"	0	8.18101444914108	0	1	1
"Predict-miR-392"	0	8.1726538280074	0	1	1
"Predict-miR-393"	0	7.81894516893771	0	1	1
"Predict-miR-404"	0	8.21629091030848	0	1	1
"Predict-miR-408"	0	7.89796799874375	0	1	1
"Predict-miR-409"	0	8.05978441657104	0	1	1
"Predict-miR-442"	0	8.46857989577417	0	1	1
"Predict-miR-460"	0	8.0081306695197	0	1	1
"Predict-miR-485"	0	8.42539409225206	0	1	1
"Predict-miR-487"	0	8.53052590601621	0	1	1
"Predict-miR-488"	0	8.38928631161834	0	1	1
"Predict-miR-530"	0	8.38189715419771	0	1	1
"Predict-miR-532"	0	7.82057804500805	0	1	1
"Predict-miR-551"	0	8.24256501532166	0	1	1
"Predict-miR-578"	0	8.06244789375644	0	1	1
"Predict-miR-619"	0	7.75966252141236	0	1	1
"rna11272"	0	8.06113085223675	0	1	1
"rna20046"	0	8.88936493406554	0	1	1
"rna34998"	0	7.78913933372262	0	1	1
"rna38812"	0	7.75731242034323	0	1	1
"rna69774"	0	7.76411619977462	0	1	1
"rna9093"	0	8.57918591446487	0	1	1
"Predict-miR-100"	0	8.10438464727125	0	1	1
"Predict-miR-101"	0	8.48791799616583	0	1	1
"Predict-miR-11"	0	8.19975821441776	0	1	1
"Predict-miR-112"	0	7.78677455391376	0	1	1
"Predict-miR-115"	0	8.50713443471732	0	1	1
"Predict-miR-164"	0	8.02864672350456	0	1	1
"Predict-miR-170"	0	8.43439637972942	0	1	1
"Predict-miR-187"	0	7.89950862956653	0	1	1
"Predict-miR-2"	0	8.0721339273452	0	1	1
"Predict-miR-206"	0	8.31765376067295	0	1	1
"Predict-miR-22"	0	8.31830211311109	0	1	1
"Predict-miR-23"	0	7.92666770659124	0	1	1
"Predict-miR-253"	0	8.36876293165003	0	1	1
"Predict-miR-26"	0	7.81572160887228	0	1	1
"Predict-miR-272"	0	8.65897170990676	0	1	1
"Predict-miR-29"	0	8.40697061768428	0	1	1
"Predict-miR-316"	0	7.81741565715183	0	1	1
"Predict-miR-331"	0	7.78887641616848	0	1	1
"Predict-miR-337"	0	8.15558268261738	0	1	1
"Predict-miR-36"	0	7.78608387917059	0	1	1
"Predict-miR-371"	0	8.05411131806543	0	1	1
"Predict-miR-401"	0	8.05878693136764	0	1	1
"Predict-miR-434"	0	7.75472430152151	0	1	1
"Predict-miR-484"	0	8.40989304691851	0	1	1
"Predict-miR-502"	0	8.48757844042982	0	1	1
"Predict-miR-507"	0	7.84527138635924	0	1	1
"Predict-miR-519"	0	8.14960470954338	0	1	1
"Predict-miR-546"	0	8.67961928743108	0	1	1
"Predict-miR-557"	0	8.39987943434986	0	1	1
"Predict-miR-583"	0	7.9571884512259	0	1	1
"Predict-miR-584"	0	7.93545615669858	0	1	1
"Predict-miR-599"	0	7.81991151237048	0	1	1
"Predict-miR-603"	0	8.95676079672592	0	1	1
"Predict-miR-617"	0	7.93190382184165	0	1	1
"Predict-miR-624"	0	7.81676970776838	0	1	1
"Predict-miR-626"	0	8.41626690384792	0	1	1
"Predict-miR-629"	0	7.78586509587188	0	1	1
"Predict-miR-71"	0	7.79155753875847	0	1	1
"Predict-miR-79"	0	8.01888116553651	0	1	1
"Predict-miR-85"	0	8.2617766648036	0	1	1
"Predict-miR-86"	0	8.05121961084563	0	1	1
"Predict-miR-93"	0	7.89782772870843	0	1	1
"Predict-miR-94"	0	7.97912037611263	0	1	1
"rna34589"	0	8.94291903570432	0	1	1
"rna38809"	0	7.78377407993715	0	1	1
"rna799"	0	7.84545715006563	0	1	1
"Predict-miR-124"	0	7.84621925674338	0	1	1
"Predict-miR-193"	0	7.78537206825331	0	1	1
"Predict-miR-216"	0	8.13157159331142	0	1	1
"Predict-miR-236"	0	8.17776070086664	0	1	1
"Predict-miR-238"	0	7.95152939290969	0	1	1
"Predict-miR-250"	0	7.81298636314671	0	1	1
"Predict-miR-32"	0	8.04922214039336	0	1	1
"Predict-miR-324"	0	8.05483746652429	0	1	1
"Predict-miR-345"	0	7.93460269760794	0	1	1
"Predict-miR-44"	0	8.1014955968084	0	1	1
"Predict-miR-47"	0	7.8945984550988	0	1	1
"Predict-miR-491"	0	7.95261509982316	0	1	1
"Predict-miR-50"	0	7.90120876225306	0	1	1
"Predict-miR-512"	0	7.87164917792947	0	1	1
"Predict-miR-598"	0	7.9811309993434	0	1	1
"Predict-miR-628"	0	7.81529220500055	0	1	1
"Predict-miR-632"	0	8.17198929522944	0	1	1
"rna27274"	0	8.08210343939581	0	1	1
"rna62714"	0	7.78456141992373	0	1	1
"Predict-miR-145"	0	7.75828128901194	0	1	1
"Predict-miR-199"	0	7.90217727336594	0	1	1
"Predict-miR-201"	0	8.44521774216914	0	1	1
"Predict-miR-4"	0	7.75723087868409	0	1	1
"Predict-miR-556"	0	7.84622380878692	0	1	1
"Predict-miR-581"	0	7.84895581777585	0	1	1
"Predict-miR-264"	0	7.91367463937715	0	1	1
"Predict-miR-160"	0	7.85663465256246	0	1	1
"Predict-miR-232"	0	9.29758285952353	0	1	1
"Predict-miR-258"	0	7.87776618653078	0	1	1
"Predict-miR-289"	0	8.91238309826627	0	1	1
"Predict-miR-314"	0	8.06929597280799	0	1	1
"Predict-miR-328"	0	7.9973702818076	0	1	1
"Predict-miR-375"	0	7.87769564624724	0	1	1
"Predict-miR-457"	0	7.82174816495871	0	1	1
"Predict-miR-463"	0	7.76108248004421	0	1	1
"Predict-miR-91"	0	8.00963906059398	0	1	1
"Predict-miR-17"	0	7.75852390214921	0	1	1
"Predict-miR-196"	0	7.78808431441778	0	1	1
"Predict-miR-376"	0	7.92892932281108	0	1	1
"Predict-miR-482"	0	7.87632652991522	0	1	1
"Predict-miR-602"	0	7.78905283859549	0	1	1
"Predict-miR-109"	0	7.78612395573406	0	1	1
"Predict-miR-144"	0	7.75746873328363	0	1	1
"Predict-miR-184"	0	7.95458517039464	0	1	1
"Predict-miR-219"	0	7.78830756321825	0	1	1
"Predict-miR-537"	0	7.81521322073461	0	1	1
"Predict-miR-618"	0	7.92740616265619	0	1	1
"Predict-miR-622"	0	7.78583138753326	0	1	1
