"logFC"	"logCPM"	"LR"	"PValue"	"FDR"
"all-m0236-5p"	0.0121420408824612	19.9241469580013	174.443951260073	7.91834651753601e-40	5.46365909709985e-38
"all-m0212-3p"	-8.04828714915766	7.65662989199862	35.6023138419179	2.41999921504983e-09	8.34899729192192e-08
"all-m0178-3p"	-8.92793995393211	5.08773645088496	25.7937987027017	3.79907133320625e-07	8.73786406637438e-06
"all-m0156-5p"	-4.50429619658342	5.07865728331819	3.82817117001184	0.0503978945057286	0.869363680223819
"Afl-milR-33"	7.63055177210929	8.46246830107616	1.6515442130682	0.198748885701712	1
"Afl-milR-3"	6.2882270064741	7.91458410782815	0.542452473371679	0.4614181154466	1
"all-m0170-3p"	0.629483218793267	10.2515391975889	0.49873585968497	0.480056101686923	1
"all-m0048-5p"	5.02070087092108	5.72395529508272	0.266327186490856	0.605806236136205	1
"all-m0144-3p"	4.50759387722607	6.11441394415366	0.189335827711414	0.663469978084592	1
"all-m0184-3p"	3.35119304418519	7.12309076025727	0.0805685302178905	0.776528429784465	1
"Afl-milR-9"	3.19961751004328	4.97883599504984	0.0710061631567083	0.78987740216648	1
"all-m0123-3p"	2.66363079560496	4.33351428406843	0.0456262892165176	0.830856572820859	1
"all-m0185-5p"	2.36105597388081	4.41979744622396	0.0363192442621998	0.848857727992934	1
"all-m0091-5p"	2.29124824207141	4.3581545562044	0.0339745299436167	0.853761004500819	1
"all-m0221-3p"	2.27248835584644	4.30127133310698	0.032567065202838	0.856788727648538	1
"all-m0073-3p"	2.27075097943383	4.33129399176074	0.0325196302382347	0.856891935055007	1
"all-m0224-3p"	2.08223690826611	4.50731912367337	0.0289520831071917	0.864889721457693	1
"all-m0214-3p"	2.03895436506482	4.32222312385201	0.0276362328026043	0.867966909857567	1
"all-m0007-5p"	1.97117388850346	4.32714283629906	0.0252247408849993	0.873808338456443	1
"all-m0140-3p"	1.97053673933647	4.35839350753428	0.0252145125666572	0.87383371126864	1
"all-m0233-3p"	1.95159143345249	4.3276272605346	0.0249856040918695	0.874402938032663	1
"all-m0235-5p"	1.95350144408071	4.48939895366536	0.0249182857244321	0.874570846769331	1
"all-m0236-3p"	1.94164567669292	5.05726159287729	0.0247033490690818	0.875108513855053	1
"all-m0188-5p"	1.64177289987813	4.36671416904758	0.0191228395404384	0.890014898945353	1
"all-m0110-5p"	1.64144217307849	4.3593183928111	0.0191153352959228	0.890036344229645	1
"all-m0229-3p"	1.63980471050518	4.32254899235338	0.0190780862467186	0.890142856398104	1
"all-m0067-3p"	1.63847470360202	4.29249201146229	0.0190477129744684	0.890229786011307	1
"all-m0029-3p"	1.49939350070023	4.29869077291164	0.0151958632178197	0.901892106760029	1
"all-m0173-5p"	1.49758948932962	4.3287210598302	0.0151636438907103	0.901995644335675	1
"all-m0195-5p"	1.49621589143885	4.35145977022631	0.015139201745582	0.902074264259982	1
"Afl-milR-2"	1.24525797152245	4.41447689842194	0.0120012352522352	0.912766147547355	1
"all-m0002-3p"	1.12448010511736	4.44553613280064	0.0108487201216123	0.91704460696303	1
"all-m0187-3p"	1.0841736244015	4.51539840460507	0.0103679481860004	0.918897072285689	1
"all-m0225-3p"	1.08299912472437	4.40415368997189	0.0103529499416313	0.918955552840873	1
"all-m0141-3p"	1.06592466573206	4.32287489573716	0.0101274157636668	0.919840162294975	1
"all-m0036-3p"	1.05423718263768	4.38871417051524	0.00996400295984845	0.920487346724754	1
"all-m0027-3p"	5.12548240610387e-15	4.35784984845904	0	1	1
"all-m0036-5p"	5.12548240610387e-15	4.35441035792269	0	1	1
"all-m0107-3p"	5.12548240610387e-15	5.4972762646114	0	1	1
"all-m0164-5p"	5.12548240610387e-15	5.66569509936743	0	1	1
"all-m0191-5p"	5.12548240610387e-15	4.56105989033472	0	1	1
"Afl-milR-43"	5.12548240610387e-15	4.26241567039914	0	1	1
"all-m0013-3p"	5.12548240610387e-15	4.33058015011355	0	1	1
"all-m0121-3p"	5.12548240610387e-15	4.32342634910677	0	1	1
"all-m0140-5p"	5.12548240610387e-15	4.26241567039914	0	1	1
"all-m0145-5p"	5.12548240610387e-15	4.32320083399734	0	1	1
"all-m0217-3p"	5.12548240610387e-15	4.43608701219237	0	1	1
"Afl-milR-92"	5.12548240610387e-15	4.26264381567658	0	1	1
"all-m0130-5p"	5.12548240610387e-15	4.35907445998803	0	1	1
"all-m0133-5p"	5.12548240610387e-15	4.32387743243524	0	1	1
"Afl-milR-7"	5.12548240610387e-15	4.30044104251567	0	1	1
"all-m0136-5p"	5.12548240610387e-15	4.34008150864033	0	1	1
"all-m0233-5p"	5.12548240610387e-15	4.26607362254598	0	1	1
"all-m0063-3p"	5.12548240610387e-15	4.31540141898848	0	1	1
"all-m0079-3p"	5.12548240610387e-15	4.31540141898848	0	1	1
"all-m0118-5p"	5.12548240610387e-15	4.31540141898848	0	1	1
"all-m0119-5p"	5.12548240610387e-15	4.28790849251451	0	1	1
"all-m0162-3p"	5.12548240610387e-15	4.31540141898848	0	1	1
"all-m0168-3p"	5.12548240610387e-15	4.29200857952658	0	1	1
"all-m0193-3p"	5.12548240610387e-15	4.31540141898848	0	1	1
"all-m0234-5p"	5.12548240610387e-15	4.28790849251451	0	1	1
"all-m0029-5p"	5.12548240610387e-15	4.33354189456397	0	1	1
"all-m0171-5p"	5.12548240610387e-15	4.34543843109638	0	1	1
"all-m0049-5p"	5.12548240610387e-15	4.32762839511752	0	1	1
"all-m0071-5p"	5.12548240610387e-15	4.38869133617685	0	1	1
"all-m0099-5p"	5.12548240610387e-15	4.32762839511752	0	1	1
"all-m0201-5p"	5.12548240610387e-15	4.26390586121915	0	1	1
"all-m0202-3p"	5.12548240610387e-15	4.32762839511752	0	1	1
"all-m0059-3p"	5.12548240610387e-15	4.34835654639111	0	1	1
