"logFC"	"logCPM"	"LR"	"PValue"	"FDR"
"Afl-milR-3"	2.52178443347852	18.9910421561875	9.66226060375577	0.00188092023584418	0.122259815329872
"Afl-milR-103"	-6.23667307156407	12.3796948567904	6.57133117898054	0.0103634408310354	0.243758178837217
"Afl-milR-7"	-6.29737274749794	12.6117935487958	6.42533365095188	0.0112503774847946	0.243758178837217
"Afl-milR-107"	-5.30083455527621	13.0413193539921	5.53384119792812	0.0186521134904252	0.30309684421941
"Afl-milR-53"	-5.13813752943976	12.376831062959	4.31738514480396	0.0377248503491877	0.411571912252396
"Afl-milR-50"	-5.13912671170194	12.3443513505172	4.30541372227778	0.0379912534386827	0.411571912252396
"Afl-milR-11"	-1.66033026908176	16.0647183578723	3.24766496209387	0.0715252852996318	0.664163363496581
"Afl-milR-9"	2.44319664443239	15.8429076591393	2.99191749340989	0.0836810258978496	0.679908335420028
"Afl-milR-33"	2.14750037431279	15.7614538847118	2.26979673519834	0.131917203121409	0.786917124097555
"Afl-milR-132"	-3.47692281663322	12.9252142184771	2.16974675908513	0.140749410325861	0.786917124097555
"Afl-milR-122"	-2.49839033912952	12.9724261196938	2.08683667630066	0.148573432709856	0.786917124097555
"Afl-milR-24"	-2.50769523290127	13.3347328350753	2.02563277599041	0.154664488496356	0.786917124097555
"Afl-milR-19"	3.29358149467617	16.416749236667	1.99918871955234	0.157383424819511	0.786917124097555
"Afl-milR-51"	-2.63850979575724	12.5384951220356	1.59377054563727	0.206788254171966	0.960088322941273
"Afl-milR-14"	-2.39816370839126	12.5457979139751	1.39920212974156	0.236857205789857	1
"Afl-milR-48"	4.55097268064376	12.4121779538585	0.993500142089974	0.318888411273726	1
"Afl-milR-100"	4.0253327632452	12.6769207175762	0.726750555586605	0.393938491913913	1
"Afl-milR-126"	3.19599738576249	12.8566768228607	0.51832815295981	0.471555716899618	1
"Afl-milR-58"	-0.584056419690344	15.7881677096301	0.286855308453639	0.592242806001033	1
"Afl-milR-99"	2.59092213052486	12.3436149395678	0.257953581120671	0.611529570463564	1
"Afl-milR-57"	2.59092213052486	12.3436149395678	0.257953581120671	0.611529570463564	1
"Afl-milR-81"	2.43381960616476	12.5080215535293	0.257471973846749	0.611862286371248	1
"Afl-milR-69"	2.58444778602381	12.3788314800978	0.256795255790885	0.612330455378063	1
"Afl-milR-116"	1.5328743042952	12.4062387224109	0.121539336071784	0.727370915367148	1
"Afl-milR-127"	1.53239136049767	12.3391522738577	0.121407252328299	0.727513194581067	1
"Afl-milR-49"	1.51003604955393	12.5286870026733	0.115571256521286	0.733888362453039	1
"Afl-milR-80"	1.40224797717314	12.4251911277414	0.109035248652402	0.741245175905816	1
"Afl-milR-82"	1.40160875355025	12.3927529640138	0.108933128640992	0.741362037974464	1
"Afl-milR-131"	1.40112957864718	12.3684920933831	0.108856481990499	0.741449789255614	1
"Afl-milR-95"	1.40052484731478	12.3379412634506	0.108759635085823	0.741560716422689	1
"Afl-milR-76"	1.40052484731478	12.3379412634506	0.108759635085823	0.741560716422689	1
"Afl-milR-71"	1.40052484731478	12.3379412634506	0.108759635085823	0.741560716422689	1
"Afl-milR-104"	1.40052484731478	12.3379412634506	0.108759635085823	0.741560716422689	1
"Afl-milR-36"	1.38873124304629	12.8602149871881	0.10684465400756	0.743765452057175	1
"Afl-milR-114"	0	12.3668463311819	0	1	1
"Afl-milR-27"	0	12.3396111845518	0	1	1
"Afl-milR-67"	0	12.3362880778817	0	1	1
"Afl-milR-62"	0	12.5326871905676	0	1	1
"Afl-milR-43"	0	12.3362880778817	0	1	1
"Afl-milR-40"	0	12.366201929524	0	1	1
"Afl-milR-6"	0	12.3625603488486	0	1	1
"Afl-milR-83"	0	12.341627394403	0	1	1
"Afl-milR-110"	0	12.4086933032311	0	1	1
"Afl-milR-29"	0	12.3688672087211	0	1	1
"Afl-milR-102"	0	12.3389645415004	0	1	1
"Afl-milR-97"	0	12.3389645415004	0	1	1
"Afl-milR-37"	0	12.3389645415004	0	1	1
"Afl-milR-18"	0	12.3706425105829	0	1	1
"Afl-milR-133"	0	12.3442772149639	0	1	1
"Afl-milR-41"	0	12.4140995376824	0	1	1
"Afl-milR-128"	0	12.4144487622879	0	1	1
"Afl-milR-87"	0	12.3402500926004	0	1	1
"Afl-milR-94"	0	12.5475514642453	0	1	1
"Afl-milR-16"	0	12.3442310393377	0	1	1
"Afl-milR-79"	0	12.3442310393377	0	1	1
"Afl-milR-20"	0	12.3444724937198	0	1	1
"Afl-milR-121"	0	12.3441849854973	0	1	1
"Afl-milR-45"	0	12.3415328430536	0	1	1
"Afl-milR-31"	0	12.3415328430536	0	1	1
"Afl-milR-117"	0	12.3415328430536	0	1	1
"Afl-milR-78"	0	12.3415328430536	0	1	1
"Afl-milR-123"	0	12.3353019879471	0	1	1
"Afl-milR-85"	0	12.3442587300675	0	1	1
"Afl-milR-42"	0	12.3442587300675	0	1	1
"Afl-milR-96"	0	12.3444351297399	0	1	1
