"logFC"	"logCPM"	"LR"	"PValue"	"FDR"
"stu-miR171b-3p"	4.42465228849446	11.6019998982094	24.3322495378381	8.10703503310075e-07	0.000150790851615674
"sly-miR164b-5p"	8.38456664135872	10.4206261405454	20.3271701139891	6.52671727617028e-06	0.000606984706683836
"osa-miR166f"	7.04265287647353	10.8726901556929	9.57872674125702	0.00196844872753442	0.122043821107134
"mdm-miR390e"	3.37448254768796	9.65230103537073	6.23112231764533	0.0125524154752222	0.485631644837644
"hvu-miR6184"	6.35231429484631	8.83092478944409	6.16169380971673	0.0130546141085388	0.485631644837644
"bra-miR164b-5p"	2.950375471467	10.226941277718	5.8103066674637	0.0159325156288748	0.493907984495119
"ghr-miR167a"	-6.27731193546628	11.0542752465574	5.30361013598885	0.0212812724461537	0.515770873567226
"sbi-miR319a"	2.01169419051155	12.01358335831	5.23131979308328	0.0221836934867624	0.515770873567226
"vvi-miR159c"	5.96820192687486	10.7072353745623	4.84311059599561	0.0277567842751617	0.549240344581214
"hsa-miR-4787-3p"	-6.35859652371863	9.37397673410379	4.73650215891111	0.0295290507839362	0.549240344581214
"bta-miR-2889"	2.56628830258358	10.8663543005036	4.49125544809268	0.0340686495540217	0.576069892458913
"osa-miR529b"	6.4477419214158	8.95754405523306	4.11899667864056	0.0424042197978077	0.65726540686602
"cqu-miR-210-3p"	6.64382182150083	8.9819451568515	3.37063269569349	0.0663682626533073	0.853008390472981
"bdi-miR1432"	1.58368876476878	10.4882297234043	3.10749476920281	0.0779327473182345	0.853008390472981
"gma-miR166q"	2.5454258886851	9.87557177371886	3.07108818775981	0.0796961080501802	0.853008390472981
"zma-miR156g-5p"	-1.02354687894599	13.9084224923607	2.9546975461694	0.0856283264604376	0.853008390472981
"osa-miR160a-3p"	-7.00076799715117	8.84564956176456	2.63326569819341	0.104646275712155	0.853008390472981
"ath-miR168a-3p"	1.65811392019625	10.8840161879333	2.55440377414184	0.10998730061429	0.853008390472981
"zma-miR529-5p"	1.90355819280312	9.63133934688527	2.45999921067187	0.11677884078648	0.853008390472981
"atr-miR167"	-5.2304565067416	9.13836874018649	2.43744606263314	0.118468968043488	0.853008390472981
"zma-miR156h-5p"	-0.919386811740069	13.7910208912156	2.30457601108276	0.128993474838915	0.853008390472981
"mes-miR156f"	-0.789744980067931	13.878283062048	2.08215073166182	0.149030063436731	0.853008390472981
"zma-miR164d-5p"	1.28810078344061	10.5139357948859	2.06748074473519	0.150469896371285	0.853008390472981
"bdi-miR171d-3p"	-4.88259261136191	9.39396822194051	2.01586637612757	0.15566239372837	0.853008390472981
"mes-miR156g"	-4.82511066677434	8.93850546071529	2.00386826868336	0.156898351854244	0.853008390472981
"cme-miR156d"	-0.837950150474613	13.9061871963721	1.94971751355468	0.162617294582045	0.853008390472981
"cme-miR167a"	-4.80170044825492	11.2445094302531	1.94555488591333	0.163066660473061	0.853008390472981
"mes-miR167c"	-4.79891708238612	10.6600330232328	1.93871177281442	0.163808476082211	0.853008390472981
"mtr-miR156i-5p"	-4.76455759442597	9.00331712176544	1.85573494653435	0.173117856692473	0.853008390472981
"hci-miR156a"	4.45820485448981	8.80880922882282	1.85400681466178	0.173318096329839	0.853008390472981
"osa-miR159a.1"	4.45803140124173	8.86044019124598	1.85398306177148	0.173320850446745	0.853008390472981
"mes-miR164d"	4.45822662956008	8.78346334518982	1.85396287318662	0.173323191326632	0.853008390472981
"tcc-miR156d"	4.45823314218254	8.77601842970318	1.85394973013673	0.173324715291586	0.853008390472981
"osa-miR408-5p"	4.47455452315038	8.90842955644831	1.81986871455923	0.177328904810787	0.853008390472981
"ppt-miR166k"	4.44159906073189	9.85066253936386	1.80348673426215	0.179291536639004	0.853008390472981
"cpa-miR156b"	4.48645696007376	8.95479870997942	1.77947571281699	0.182213719062071	0.853008390472981
"ptc-miR167g-5p"	-4.72120173683994	8.96809843190016	1.75474861327673	0.185280877483743	0.853008390472981
"bna-miR156a"	-4.69980988296941	8.92241381445059	1.70634214128722	0.191460647578133	0.853008390472981
"gga-miR-6572-3p"	-4.68500740236005	8.96091365453003	1.67336662881189	0.195808208437573	0.853008390472981
"gso-miR167a"	-1.80516067106326	11.0378619360053	1.66101832028487	0.197465888381366	0.853008390472981
"rco-miR319c"	4.54536369446274	9.07531040263019	1.63955128844694	0.200387044254822	0.853008390472981
"tca-miR-125-3p"	2.56827367184393	9.04722713086589	1.58797381012516	0.207615858831031	0.853008390472981
"ccl-miR396"	0.921317472790813	12.0344212277124	1.57666708815441	0.209241426455456	0.853008390472981
"tae-miR164"	1.06836947873047	10.1995154810162	1.22353334280868	0.26866834504527	0.853008390472981
"ath-miR167d"	-0.493458378723289	17.1479040649772	1.2064586587678	0.272034611262556	0.853008390472981
"zma-miR827-3p"	-0.697827178604123	15.4647377493778	1.14495257441637	0.284608250671323	0.853008390472981
"bna-miR167b"	-4.16090674069534	9.10794596045256	1.10768204569125	0.292586375916259	0.853008390472981
"csi-miR166a"	-4.20357853382616	8.80918510476594	1.09822887726736	0.294655120493125	0.853008390472981
"pma-miR-23a-3p"	-4.19158847787183	8.76344130534338	1.09517344145099	0.295327777504568	0.853008390472981
"han-miR156b"	-0.636284740126844	13.8961537451081	1.08980208691338	0.2965150641635	0.853008390472981
"ptc-miR167b"	-4.1091177093272	8.78613401203808	1.08903643731422	0.296684801830115	0.853008390472981
"hvu-miR168-3p"	0.776848627838946	13.8569743424042	1.08820115382077	0.296870118932006	0.853008390472981
"gma-miR156k"	-4.0887892435088	8.98419179419935	1.08172127193907	0.298312814638356	0.853008390472981
"ghr-miR167b"	-3.93835963599902	8.85808689989512	1.02417706084872	0.311530243507646	0.853008390472981
"zma-miR159c-5p"	-3.88354252493559	8.83813374873811	1.00767370476546	0.315460793061036	0.853008390472981
"mes-miR169w"	-3.88334691608661	8.88703968007142	1.00761426697219	0.315475065956107	0.853008390472981
"osa-miR164e"	-3.87643976569791	8.78123755376452	1.00372869386249	0.316409952056921	0.853008390472981
"vvi-miR166h"	-0.494605386872955	15.8506331714026	1.00212264234688	0.316797435091443	0.853008390472981
"osa-miR156b-5p"	-3.86758011770598	9.06415183661126	0.992590282240878	0.319110109924581	0.853008390472981
"zma-miR164e-5p"	-3.86624267918387	8.78150220338267	0.990916691739368	0.319518430198056	0.853008390472981
"mdm-miR156f"	-3.86087498608863	8.83524841628289	0.984220331547467	0.321159090669949	0.853008390472981
"ptc-miR171f"	-3.84975666138858	9.82807999378132	0.970452578875694	0.324567332976262	0.853008390472981
"stu-miR171c-3p"	-3.84496716122058	9.38652360888542	0.964563758065555	0.326039714434349	0.853008390472981
"bra-miR156g-5p"	-3.83614027353308	9.12494893381021	0.953775860322747	0.328760043239311	0.853008390472981
"zma-miR156f-5p"	-3.83497510891829	9.05164789511011	0.952358066174504	0.329119797324486	0.853008390472981
"zma-miR159d-5p"	-3.83276176778771	9.09511574129263	0.949668794949757	0.329803617032344	0.853008390472981
"ptc-miR167d"	-3.82807425003195	9.52842889370834	0.943990376185873	0.331253727484798	0.853008390472981
"dpr-miR167c"	-3.82594611124416	9.72105891113374	0.941419960644552	0.331912931475753	0.853008390472981
"bdi-miR162"	-3.82517993484424	9.9758962336206	0.94049570957376	0.332150390442765	0.853008390472981
"mdm-miR156z"	-3.81883643246986	8.85832198311006	0.932866767342252	0.334119103676214	0.853008390472981
"tcc-miR156g"	-3.80298428377944	9.14621070761718	0.913981445043646	0.339060226515433	0.853008390472981
"mdm-miR166e"	-0.669377093963998	12.840123425212	0.913895012035773	0.339083065253635	0.853008390472981
"bra-miR156f-5p"	-3.80262655456576	9.02083462739696	0.913558173095337	0.339172090056578	0.853008390472981
"tni-miR-135b"	1.54719630352564	8.88225415965283	0.895902888742517	0.34388267800534	0.853008390472981
"sbi-miR156h"	-0.598779739066827	13.8771221654452	0.877606613124861	0.348858047718864	0.853008390472981
"ath-miR156b-5p"	1.63622397318578	9.00907508927491	0.865948501948846	0.35207938187348	0.853008390472981
"ppe-miR171c"	1.66035632495524	9.64976349633445	0.855375075242808	0.355036188758019	0.853008390472981
"mes-miR319b"	1.56839298300735	9.51039684439842	0.845905649551549	0.357713196004799	0.853008390472981
"vvi-miR167d"	-1.35559920596304	10.5313909681915	0.81830396959738	0.365676512332814	0.860959889796245
"zma-miR408b-5p"	1.60541421478742	9.00284660078911	0.767377749271851	0.381029490990834	0.8798682140417
"bdi-miR156d-5p"	-0.619799720535395	13.8680514902476	0.754827070066391	0.384952241920077	0.8798682140417
"sly-miR156d-5p"	-0.543594643298254	13.7888792872004	0.743829806710711	0.388436809657945	0.8798682140417
"mmu-miR-7666-5p"	-3.63783878343504	8.87530547902404	0.730783435656383	0.392629364330436	0.8798682140417
"mdm-miR156w"	-0.671502907786006	12.7127993177614	0.711749349800353	0.398863681173346	0.883198151169552
"ptc-miR166k"	1.12559655250763	11.9832436724833	0.671593620360579	0.41249654964685	0.902639508638989
"cme-miR156c"	-0.540676794175433	13.9077170093796	0.637624219559083	0.424572413264416	0.918261265897458
"cpa-miR171b"	-1.23240651250551	11.2308374023513	0.606558830797283	0.436086420912979	0.932322692986369
"mdo-miR-7380-5p"	-1.69379159327645	8.83181603150626	0.561974051680317	0.453465958887177	0.95846214037517
"zma-miR398b-5p"	0.784156399074496	11.3669369316634	0.517990519068331	0.471700130326738	0.985800272368239
"ath-miR166d"	-0.334496771144317	15.8781212205888	0.483734676967117	0.486735513714495	1
"hbr-miR319"	0.298233859491116	17.2712646837582	0.426047548696708	0.513934756419067	1
"pab-miR3711"	0.925979889142417	10.2265191161532	0.370141232440648	0.542927294428781	1
"sbi-miR528"	0.400507743431766	13.2929038041427	0.339634486581939	0.560040279192413	1
"ata-miR167e-3p"	1.10331554671684	9.25976667767165	0.32731436753094	0.567244781467161	1
"ata-miR167b-5p"	-0.875969793630755	11.2143793321707	0.303087911724147	0.581953022243068	1
"aau-miR160"	1.62808491337178	9.21599808294964	0.286625606056026	0.59239108041591	1
"smo-miR166b"	-0.248347684205271	15.8589559585094	0.278207987706944	0.597878177644055	1
"ghr-miR156b"	-0.278355492312975	13.8551524648205	0.242589181033104	0.622342294285699	1
"vvi-miR166b"	-0.585402246481644	10.4279974129872	0.217900907617709	0.640643997012395	1
"dre-miR-23a-3p"	-0.606880070058021	9.68114622072314	0.122752394321957	0.726068258140083	1
"ath-miR166f"	0.160462013541565	16.0721621926836	0.116062097905466	0.73334534138535	1
"osa-miR319b"	0.748859767318505	9.40852578485498	0.114656117703159	0.734904231829914	1
"bna-miR167a"	-0.22291061626953	15.0375281991962	0.113757835403241	0.735905793667271	1
"mtr-miR171g"	0.730188743677028	8.76334656211994	0.110932139016137	0.739085394294801	1
"ata-miR395f-3p"	-0.349064131543972	10.9523748262964	0.11018013401269	0.739939148952495	1
"rno-miR-6314"	-0.669769209913243	8.92586083515435	0.098924577660882	0.753124019519476	1
"osa-miR156h-5p"	0.618264816882097	9.01329406960671	0.095722805091663	0.757024098278475	1
"osa-miR167f"	0.612730191396622	9.75060533585626	0.0951193801942782	0.757767102447085	1
"zma-miR164b-5p"	0.266330198090077	10.2148992314408	0.0792443607931652	0.778324052888591	1
"ath-miR8175"	-0.204672523674524	12.2319323738854	0.0662649706900353	0.796854693712177	1
"tae-miR171a"	0.439334242440771	8.83992253369901	0.0490244714421806	0.824769543880993	1
"ptc-miR156i"	-0.161463280376036	12.7026246293332	0.0408407416492444	0.839845642915987	1
"mmu-miR-5120"	0.422149391620123	9.04974500765332	0.0357089948501468	0.850117710918568	1
"ptc-miR393c"	-0.310030802255048	9.82423493781285	0.0296143228337318	0.8633682482157	1
"ptc-miR156f"	-0.0893421879109323	13.8854843617687	0.0247773010286849	0.874923252480621	1
"hsa-miR-340-5p"	-0.266680577004668	9.30502778950744	0.0227891446992015	0.880006686687345	1
"ptc-miR166a"	-0.0624065404654466	15.7871040269299	0.0204264528347675	0.886352461069648	1
"nta-miR167c"	-0.239797692165572	10.3205754522496	0.0179640052984453	0.893378956907425	1
"vun-miR156a"	-0.0208523051750076	13.8691019060843	0.00133422312874032	0.970862134906097	1
"ptc-miR473a-5p"	-0.0932440553687216	8.89830526054569	0.000806061206667152	0.977350129142705	1
"bdi-miR156f-5p"	0	8.83391647498297	0	1	1
"csi-miR166d"	0	8.77925142543901	0	1	1
"mmu-miR-8109"	0	8.75066028947331	0	1	1
"aly-miR156c-5p"	0	8.95724865640647	0	1	1
"aly-miR393b-5p"	0	8.8062672825188	0	1	1
"ata-miR166d-3p"	0	10.5099901211072	0	1	1
"bna-miR156d"	0	8.87830522251405	0	1	1
"cme-miR156a"	0	8.90506201931679	0	1	1
"cme-miR167f"	0	8.92868492029559	0	1	1
"cpa-miR167a"	0	8.87985885628545	0	1	1
"gma-miR156v"	0	8.88923232705875	0	1	1
"gma-miR164h"	0	8.77973236168567	0	1	1
"lus-miR166e"	0	8.77256939743763	0	1	1
"lus-miR166f"	0	8.83287558902849	0	1	1
"mes-miR156c"	0	8.9789301076551	0	1	1
"osa-miR167j"	0	9.63437776711757	0	1	1
"ptc-miR167c"	0	8.85029011913825	0	1	1
"rco-miR156c"	0	8.9560718858206	0	1	1
"sbi-miR156e"	0	8.83298441909271	0	1	1
"sbi-miR156i"	0	8.88032307536738	0	1	1
"stu-miR399b-3p"	0	9.09991266102806	0	1	1
"vvi-miR156c"	0	8.98312037276211	0	1	1
"zma-miR156b-5p"	0	9.07010594503565	0	1	1
"zma-miR167h-5p"	0	8.95864912458951	0	1	1
"ama-miR156"	0	8.82744606734282	0	1	1
"bdi-miR396d-3p"	0	8.77496865516347	0	1	1
"bna-miR156f"	0	8.83172777220872	0	1	1
"gma-miR156f"	0	8.82518892231758	0	1	1
"lus-miR156c"	0	8.74816871247791	0	1	1
"mdm-miR156a"	0	8.80154449308157	0	1	1
"mdm-miR156m"	0	8.85374989509524	0	1	1
"mdm-miR156o"	0	8.90831812961646	0	1	1
"mtr-miR156d-5p"	0	8.7536162267602	0	1	1
"mtr-miR156j"	0	8.82858657146202	0	1	1
"nta-miR319b"	0	8.80126066122142	0	1	1
"oar-miR-369-3p"	0	8.77562824122559	0	1	1
"ptc-miR156j"	0	8.82782495225647	0	1	1
"rco-miR156b"	0	8.79978167141233	0	1	1
"sly-miR167b-5p"	0	8.93133188266858	0	1	1
"sof-miR156"	0	8.8799218264935	0	1	1
"vvi-miR166c"	0	8.74889573583564	0	1	1
"dya-miR-33"	0	8.89623536660078	0	1	1
"aly-miR157d-5p"	0	8.77281877293297	0	1	1
"bdi-miR156a"	0	8.84761521466967	0	1	1
"bdi-miR156b-5p"	0	8.74752086064947	0	1	1
"bdi-miR167f"	0	8.92278585385049	0	1	1
"bra-miR156e-5p"	0	8.84628132680692	0	1	1
"mdm-miR156k"	0	8.80325778650887	0	1	1
"mdm-miR156l"	0	8.74676920376277	0	1	1
"mes-miR156d"	0	8.80384669415739	0	1	1
"mes-miR166e"	0	8.98315288498236	0	1	1
"nta-miR156d"	0	8.95572539268784	0	1	1
"osa-miR156i"	0	8.82319817565967	0	1	1
"ppe-miR167a"	0	9.01584545812828	0	1	1
"sbi-miR5565b"	0	8.79880146927041	0	1	1
"stu-miR167c-5p"	0	8.86955464257209	0	1	1
"tae-miR167b"	0	8.97185805432705	0	1	1
"ata-miR156d-5p"	0	8.90829822842829	0	1	1
"ath-miR166c"	0	8.93911285908367	0	1	1
"gma-miR156y"	0	8.89871200209649	0	1	1
"gma-miR166i-3p"	0	8.84919463013745	0	1	1
"lus-miR167e"	0	8.77181818712041	0	1	1
"mdm-miR166a"	0	8.85347961054065	0	1	1
"osa-miR156g-5p"	0	8.84847497082129	0	1	1
"bdi-miR827-3p"	0	8.74864984605228	0	1	1
"vvi-miR156b"	0	8.77537670278251	0	1	1
