"logFC"	"logCPM"	"LR"	"PValue"	"FDR"
"sbi-miR528"	4.94522728734284	13.2929038041427	41.7046088918558	1.06158442570806e-10	1.97454703181699e-08
"bdi-miR1432"	5.3227014684205	10.4882297234043	36.5265259415355	1.50602751344205e-09	1.4006055875011e-07
"stu-miR171b-3p"	2.834585174309	11.6019998982094	29.3245983933794	6.12136863137848e-08	3.79524855145466e-06
"sly-miR164b-5p"	3.78506212065625	10.4206261405454	28.6789926550355	8.542540520385e-08	3.97228134197903e-06
"bta-miR-2889"	6.16733611964888	10.8663543005036	25.6377967500128	4.11892013390397e-07	1.53223828981228e-05
"hvu-miR6184"	6.35231429484631	8.83092478944409	21.2090250785283	4.118207382968e-06	0.000127664428872008
"zma-miR529-5p"	4.73791866162519	9.63133934688527	19.6242706244569	9.42641334857604e-06	0.000220084970692475
"hvu-miR168-3p"	3.33253609038307	13.8569743424042	19.6162593931584	9.46602024483763e-06	0.000220084970692475
"mdm-miR390e"	3.64066158558028	9.65230103537073	15.8189858999992	6.96996037064041e-05	0.00144045847659902
"bra-miR164b-5p"	3.48721202367772	10.226941277718	14.9883383496771	0.000108177626029633	0.00201210384415118
"zma-miR164d-5p"	2.82769940169502	10.5139357948859	13.8247256943048	0.000200677885167484	0.00339328060374109
"tca-miR-125-3p"	6.27119916685307	9.04722713086589	13.3585003254016	0.000257253939156384	0.00398743605692396
"ata-miR167e-3p"	7.81672369563364	9.25976667767165	12.6460046276498	0.00037636916221202	0.00525449473356548
"dre-miR-23a-3p"	6.75704743142057	9.68114622072314	12.5533360664788	0.000395499603601703	0.00525449473356548
"tae-miR164"	2.8466030801881	10.1995154810162	11.6055166490072	0.000657564763018433	0.00815380306142857
"ath-miR167d"	-1.47039224757596	17.1479040649772	11.1949820178327	0.000820188324821666	0.00953468927605186
"zma-miR164b-5p"	2.98166215824864	10.2148992314408	10.9682325249485	0.000926871220606829	0.0101410615901688
"ata-miR395f-3p"	3.21835968053921	10.9523748262964	9.70424932111287	0.00183842406782576	0.0189970487008662
"zma-miR408b-5p"	5.06998162218614	9.00284660078911	9.15899998898182	0.0024749778270765	0.0242287303071699
"mmu-miR-5120"	5.39994105091328	9.04974500765332	8.44200916859949	0.00366650937380252	0.0340985371763634
"tni-miR-135b"	4.33646533359366	8.88225415965283	8.17376834759939	0.00425005179271954	0.037643315878373
"osa-miR529b"	4.3424799567488	8.95754405523306	6.74829807649674	0.00938371523448209	0.0793350469824395
"cme-miR167a"	-6.2235085592619	11.2445094302531	6.40227388103663	0.0113974294188253	0.0916902512527009
"cqu-miR-210-3p"	5.53221478490618	8.9819451568515	6.3360208476163	0.0118310001616388	0.0916902512527009
"hci-miR156a"	4.45820485448981	8.80880922882282	5.94890646120248	0.0147264188001707	0.10956455587327
"mtr-miR171g"	4.50828174171073	8.76334656211994	5.66530962744669	0.0173036622825453	0.118057814490853
"ghr-miR167a"	-6.06643045043815	11.0542752465574	5.62618530073349	0.0176940964022983	0.118057814490853
"gma-miR166q"	2.36767090654179	9.87557177371886	5.61847127807314	0.0177721441169026	0.118057814490853
"ccl-miR396"	1.38672520100409	12.0344212277124	5.50459399706515	0.0189665828924628	0.121647738551658
"rno-miR-6314"	4.33295941916397	8.92586083515435	4.96953668163301	0.0257975570258445	0.156048548942951
"mdo-miR-7380-5p"	4.33166825266903	8.83181603150626	4.95548081920744	0.0260080914904918	0.156048548942951
"ata-miR166d-3p"	-5.88748278627972	10.5099901211072	4.89732790648865	0.0268982857624136	0.156346285994029
"mes-miR167c"	-5.67113334752273	10.6600330232328	4.40438282835016	0.0358466932941463	0.202044998567006
"ath-miR168a-3p"	1.51834980470934	10.8840161879333	3.95099124620526	0.046843766690479	0.256262958953797
"pab-miR3711"	2.54099110697102	10.2265191161532	3.85037176843025	0.049734965572085	0.264305817040223
"sbi-miR319a"	1.19730160961072	12.01358335831	3.7293079011393	0.0534655430211275	0.276238638942492
"ath-miR156b-5p"	2.70748519863437	9.00907508927491	3.66996635917434	0.0554013023772515	0.27850384438294
"ptc-miR166k"	-1.62328320414762	11.9832436724833	3.58341128258466	0.058359194328448	0.284662514817838
"ptc-miR473a-5p"	4.62982832474327	8.89830526054569	3.54605214959251	0.0596873014940628	0.284662514817838
"mes-miR164d"	3.37098194132941	8.78346334518982	3.2825144188804	0.0700215766116979	0.317661741668443
"tcc-miR156d"	3.37099385961273	8.77601842970318	3.28249952758087	0.0700222118731515	0.317661741668443
"zma-miR156h-5p"	-0.963077633261558	13.7910208912156	3.03859240476606	0.0813063907047525	0.360071158835333
"osa-miR159a.1"	2.75725309535647	8.86044019124598	2.34068914189514	0.126033786673504	0.535755262602349
"osa-miR408-5p"	2.78220643799548	8.90842955644831	2.3015093815075	0.129248346252193	0.535755262602349
"osa-miR156h-5p"	2.76154965162844	9.01329406960671	2.28543026073033	0.130593921721535	0.535755262602349
"zma-miR398b-5p"	1.43252970520741	11.3669369316634	2.2300586221363	0.135348712322458	0.535755262602349
"tae-miR171a"	2.72736603709837	8.83992253369901	2.21636865692848	0.136553912615049	0.535755262602349
"mes-miR319b"	1.92792938602471	9.51039684439842	2.19722516914452	0.138259422607058	0.535755262602349
"osa-miR166f"	1.15178478944737	10.8726901556929	1.97100490138321	0.160341237746001	0.608642249403189
"ghr-miR156b"	-0.679690884239978	13.8551524648205	1.89416686538411	0.168732688251298	0.62768560029483
"cpa-miR171b"	-1.77797159734247	11.2308374023513	1.85627465673054	0.173055374706799	0.631143131283619
"zma-miR156g-5p"	-0.748492190416863	13.9084224923607	1.81901615031093	0.177430431711504	0.634655005737303
"ata-miR167b-5p"	-1.64082135951884	11.2143793321707	1.78053070174461	0.182084172824228	0.639012380100123
"gso-miR167a"	-1.63427618704874	11.0378619360053	1.74699608250199	0.186254812704749	0.641544354871915
"cpa-miR156b"	2.36508102498748	8.95479870997942	1.68228341825968	0.19462131605915	0.65428740223201
"ath-miR8175"	0.929730201964563	12.2319323738854	1.66455263568815	0.196989755510713	0.65428740223201
"mes-miR156f"	-0.609268411059842	13.878283062048	1.53372254596926	0.215554615606689	0.693463388657934
"bdi-miR162"	-4.20462535292038	9.9758962336206	1.51689749066292	0.218089599790446	0.693463388657934
"dpr-miR167c"	-4.16869099344877	9.72105891113374	1.48306069180884	0.22329626201346	0.693463388657934
"cme-miR156d"	-0.650801294385652	13.9061871963721	1.46066721313818	0.226823990005926	0.693463388657934
"sbi-miR156h"	-0.719455700220507	13.8771221654452	1.45688647781528	0.227426165097494	0.693463388657934
"osa-miR167j"	-4.11487023439266	9.63437776711757	1.42403770422594	0.232739958406829	0.697910349646003
"aau-miR160"	3.34043396053446	9.21599808294964	1.40200001754994	0.236388989396227	0.697910349646003
"sly-miR156d-5p"	-0.660286904111467	13.7888792872004	1.30535592130731	0.253237215656883	0.735970658002815
"ptc-miR167d"	-3.94483335778517	9.52842889370834	1.26455505002616	0.260790639616357	0.746262445671423
"bna-miR167a"	-0.692006385140733	15.0375281991962	1.1915254048108	0.275022079891891	0.775062225149875
"ppe-miR171c"	1.36880336646064	9.64976349633445	1.08219968116902	0.298205993010777	0.827855443283651
"rco-miR319c"	1.98379310291857	9.07531040263019	1.0360428815128	0.308743582204014	0.844504504263921
"ptc-miR171f"	-3.59722155121926	9.82807999378132	1.00870393990644	0.315213535208199	0.849706051430798
"bdi-miR171d-3p"	-3.49805508490988	9.39396822194051	0.941912791119229	0.331786405748889	0.859290572577921
"bna-miR167b"	-3.54015095699383	9.10794596045256	0.934948410966669	0.333580376149241	0.859290572577921
"stu-miR171c-3p"	-3.49109081094874	9.38652360888542	0.927048972993466	0.33563092345238	0.859290572577921
"osa-miR156b-5p"	-3.32072968148999	9.06415183661126	0.829800639489992	0.362330182503915	0.859290572577921
"atr-miR167"	-3.36459886167156	9.13836874018649	0.822173335332186	0.364545499047308	0.859290572577921
"han-miR156b"	-0.505095761239363	13.8961537451081	0.80184552151124	0.370542161134633	0.859290572577921
"stu-miR399b-3p"	-3.37970778738137	9.09991266102806	0.773389274014781	0.379170591212928	0.859290572577921
"tcc-miR156g"	-3.25947682383491	9.14621070761718	0.760259703368014	0.383247261368693	0.859290572577921
"vvi-miR167d"	-1.11795167875345	10.5313909681915	0.744228210961824	0.388309788737498	0.859290572577921
"tae-miR167b"	-3.22005139078643	8.97185805432705	0.731026470143916	0.392550671796863	0.859290572577921
"mes-miR166e"	-3.22570966551261	8.98315288498236	0.726208217807928	0.394115020602103	0.859290572577921
"ath-miR166c"	-3.23797213249899	8.93911285908367	0.701991766765655	0.402115240025072	0.859290572577921
"cme-miR156c"	-0.535172566614863	13.9077170093796	0.701077993234446	0.402421709821089	0.859290572577921
"bra-miR156f-5p"	-3.13706474727761	9.02083462739696	0.692687341711602	0.405251817569232	0.859290572577921
"bra-miR156g-5p"	-2.99002641895987	9.12494893381021	0.629272762531482	0.427622194881796	0.859290572577921
"mes-miR156c"	-2.95701068363061	8.9789301076551	0.615271474893788	0.432809882383561	0.859290572577921
"zma-miR156f-5p"	-2.92361204857612	9.05164789511011	0.600666102811207	0.438323990490968	0.859290572577921
"zma-miR159d-5p"	-2.91742173026406	9.09511574129263	0.597259868425008	0.439625424373004	0.859290572577921
"cme-miR167f"	-2.73841640402091	8.92868492029559	0.524334211858249	0.468998663696643	0.859290572577921
"ppe-miR167a"	-2.72957207651692	9.01584545812828	0.523023687956073	0.469554705107849	0.859290572577921
"osa-miR156i"	-2.72965658887523	8.82319817565967	0.523000462093736	0.469564569161517	0.859290572577921
"zma-miR156b-5p"	-2.74023489242336	9.07010594503565	0.518478620783942	0.471491381511096	0.859290572577921
"aly-miR156c-5p"	-2.75058230953254	8.95724865640647	0.508521051538946	0.47577978334359	0.859290572577921
"stu-miR167c-5p"	-2.69684891958452	8.86955464257209	0.503959391620183	0.477765546951178	0.859290572577921
"hsa-miR-4787-3p"	-2.70419105998927	9.37397673410379	0.499148701200911	0.479874414479548	0.859290572577921
"zma-miR827-3p"	-0.421997146305611	15.4647377493778	0.456476618143281	0.499275250441479	0.859290572577921
"bdi-miR156d-5p"	-0.447528810952491	13.8680514902476	0.43924344011749	0.507487840780789	0.859290572577921
"nta-miR156d"	-2.49632751984213	8.95572539268784	0.420880703192076	0.516497917347832	0.859290572577921
"mes-miR156g"	-2.46187802337129	8.93850546071529	0.418696223044371	0.517588321518704	0.859290572577921
"bdi-miR167f"	-2.46120118817406	8.92278585385049	0.418501962202877	0.517685483990817	0.859290572577921
"cme-miR156a"	-2.46121058220049	8.90506201931679	0.418501484680284	0.517685722870311	0.859290572577921
"bra-miR156e-5p"	-2.45936039903075	8.84628132680692	0.417967071759243	0.517953182853894	0.859290572577921
"mtr-miR156i-5p"	-2.47192599721759	9.00331712176544	0.417036346473403	0.518419566373803	0.859290572577921
"ptc-miR156f"	-0.320215875876439	13.8854843617687	0.411663683419693	0.521126290981532	0.859290572577921
"hsa-miR-340-5p"	1.02988934323735	9.30502778950744	0.391880836440439	0.531312407570766	0.859290572577921
"mdm-miR156w"	-0.435270838341521	12.7127993177614	0.388222689199441	0.533235114209383	0.859290572577921
"bdi-miR156f-5p"	-2.24320262718702	8.83391647498297	0.327678703388963	0.567029159164562	0.859290572577921
"lus-miR166f"	-2.25479257773612	8.83287558902849	0.327545818632167	0.567107784961865	0.859290572577921
"bna-miR156d"	-2.18096098124754	8.87830522251405	0.316467915907245	0.573738070187802	0.859290572577921
"vvi-miR156c"	-2.14723378625258	8.98312037276211	0.315966285674243	0.574041903553389	0.859290572577921
"mes-miR156d"	-2.13076112554319	8.80384669415739	0.313857933594432	0.575322395885807	0.859290572577921
"bdi-miR156a"	-2.13228931148635	8.84761521466967	0.313699875521969	0.575418618833472	0.859290572577921
"gma-miR156f"	-2.12958228883333	8.82518892231758	0.313609903177755	0.575473406622979	0.859290572577921
"ptc-miR167c"	-2.12697841758532	8.85029011913825	0.311550921506127	0.576730033728628	0.859290572577921
"ptc-miR167g-5p"	-2.12115145102938	8.96809843190016	0.307070959899058	0.579483147917432	0.859290572577921
"bna-miR156a"	-2.11929438832125	8.92241381445059	0.305503232584375	0.580452780681862	0.859290572577921
"zma-miR167h-5p"	-2.09538201644829	8.95864912458951	0.285167969285991	0.593333780344489	0.859290572577921
"gma-miR156y"	-2.00856198097983	8.89871200209649	0.275230794480164	0.59984429908839	0.859290572577921
"osa-miR156g-5p"	-1.96898163303698	8.84847497082129	0.257015069591841	0.612178298226148	0.859290572577921
"oar-miR-369-3p"	-1.85163837489643	8.77562824122559	0.225374821532013	0.634974740661212	0.859290572577921
"vvi-miR156b"	-1.82471286528835	8.77537670278251	0.223273342922582	0.636557034450456	0.859290572577921
"ptc-miR156j"	-1.81687070952953	8.82782495225647	0.222494401421921	0.6371458471413	0.859290572577921
"sbi-miR5565b"	-1.78972712463446	8.79880146927041	0.215179678148773	0.642737565778313	0.859290572577921
"bdi-miR156b-5p"	-1.75962328294118	8.74752086064947	0.21439085006142	0.643347454181126	0.859290572577921
"ptc-miR393c"	0.747149562952589	9.82423493781285	0.213511740886684	0.64402875160994	0.859290572577921
"ghr-miR167b"	-1.72378024274765	8.85808689989512	0.211811700269283	0.645351102766246	0.859290572577921
"mdm-miR156o"	-1.72715135739311	8.90831812961646	0.21170597686009	0.645433550288412	0.859290572577921
"mdm-miR156f"	-1.71381748008597	8.83524841628289	0.210454493741642	0.646411409513586	0.859290572577921
"rco-miR156b"	-1.70151542202696	8.79978167141233	0.209227357394304	0.647373668436673	0.859290572577921
"mes-miR169w"	-1.70078981983687	8.88703968007142	0.209128904747645	0.647451017822853	0.859290572577921
"sbi-miR156i"	-1.70078694410168	8.88032307536738	0.209128188941401	0.647451580277102	0.859290572577921
"mdm-miR156m"	-1.7007753566234	8.85374989509524	0.20912530441426	0.647453846844349	0.859290572577921
"aly-miR157d-5p"	-1.70073791178097	8.77281877293297	0.209115980238912	0.647461173606198	0.859290572577921
"gma-miR166i-3p"	-1.69962088206314	8.84919463013745	0.208961671635653	0.647582455098342	0.859290572577921
"mtr-miR156j"	-1.69594270683756	8.82858657146202	0.207884510380953	0.648430579955974	0.859290572577921
"rco-miR156c"	-1.7102711762736	8.9560718858206	0.206799611323288	0.649287484338901	0.859290572577921
"ata-miR156d-5p"	-1.71391175535911	8.90829822842829	0.205352750001296	0.650434514851502	0.859290572577921
"dya-miR-33"	-1.73539927293993	8.89623536660078	0.195533784859084	0.658350258265729	0.859290572577921
"lus-miR166e"	-1.60854210550185	8.77256939743763	0.189628536177563	0.663225963567186	0.859290572577921
"mdm-miR166e"	0.263102916106246	12.840123425212	0.189220658987903	0.663566049243175	0.859290572577921
"mdm-miR166a"	-1.59795547533346	8.85347961054065	0.186793954396435	0.665598485421423	0.859290572577921
"osa-miR319b"	0.740566840729302	9.40852578485498	0.179382945009927	0.671904064936864	0.859290572577921
"mmu-miR-7666-5p"	-1.56774205441691	8.87530547902404	0.177432021130883	0.673589472729358	0.859290572577921
"ptc-miR166a"	-0.168799264970068	15.7871040269299	0.175525006095711	0.675247525045506	0.859290572577921
"osa-miR167f"	0.510608911198357	9.75060533585626	0.11052237098577	0.739550205890249	0.859290572577921
"lus-miR156c"	-1.14216784956422	8.74816871247791	0.10795564973462	0.742483712104094	0.859290572577921
"bdi-miR827-3p"	-1.14215218402785	8.74864984605228	0.107954600799778	0.742484918791519	0.859290572577921
"gga-miR-6572-3p"	-1.09902490675649	8.96091365453003	0.104729685303255	0.746226000660441	0.859290572577921
"bna-miR156f"	-1.09426470770569	8.83172777220872	0.104722834209515	0.746234015616777	0.859290572577921
"mdm-miR156l"	-1.10112792721994	8.74676920376277	0.104697004829256	0.746264235492199	0.859290572577921
"bdi-miR396d-3p"	-1.08924692956072	8.77496865516347	0.104694124448115	0.746267605737639	0.859290572577921
"csi-miR166d"	-1.08924321541725	8.77925142543901	0.104693916031906	0.746267849601027	0.859290572577921
"zma-miR159c-5p"	-1.08919388683537	8.83813374873811	0.104691148262875	0.746271088134312	0.859290572577921
"nta-miR319b"	-1.08845859135204	8.80126066122142	0.104638641218887	0.74633253495615	0.859290572577921
"mdm-miR156a"	-1.08845852369418	8.80154449308157	0.10463863997321	0.746332536414117	0.859290572577921
"cpa-miR167a"	-1.08844063697621	8.87985885628545	0.104638310511607	0.746332922023165	0.859290572577921
"ama-miR156"	-1.08727573721671	8.82744606734282	0.104555172763342	0.746430249700879	0.859290572577921
"aly-miR393b-5p"	-1.08726097352465	8.8062672825188	0.104553863148023	0.746431783182889	0.859290572577921
"mdm-miR156k"	-1.1105396073632	8.80325778650887	0.103519836938255	0.74764589347101	0.859290572577921
"gma-miR156k"	-1.06541453774238	8.98419179419935	0.102469418563324	0.748886121677479	0.859290572577921
"lus-miR167e"	-1.05507704755509	8.77181818712041	0.101369403939323	0.750192443694112	0.859290572577921
"mmu-miR-8109"	-1.04516938716832	8.75066028947331	0.100235145198617	0.751547632914283	0.859290572577921
"sof-miR156"	-1.04480889779412	8.8799218264935	0.100192268554972	0.75159902617309	0.859290572577921
"ath-miR166f"	0.140360156883229	16.0721621926836	0.0989989871471622	0.753034211452694	0.859290572577921
"nta-miR167c"	-0.39227785804173	10.3205754522496	0.0686773566597658	0.793272370715072	0.899686957030508
"smo-miR166b"	0.106436112217207	15.8589559585094	0.0570206539502145	0.811268441279973	0.914520788351969
"hbr-miR319"	0.0900361837994803	17.2712646837582	0.0415388976574746	0.838501246477782	0.93952549304137
"vun-miR156a"	-0.0969816997013858	13.8691019060843	0.0346618833462884	0.852305943074815	0.949274882706082
"vvi-miR159c"	0.173568438270291	10.7072353745623	0.0284280195654301	0.866106476071173	0.95890359850737
"ptc-miR156i"	0.107976848924197	12.7026246293332	0.0236368447056989	0.877812546291992	0.966113216629056
"vvi-miR166h"	-0.0334434042891271	15.8506331714026	0.00505533396454183	0.943317474367225	1
"vvi-miR166b"	0.0716933490666471	10.4279974129872	0.00408173125899758	0.949059066406685	1
"ppt-miR166k"	-0.0713795947144513	9.85066253936386	0.00230446651503158	0.961712369923865	1
"ath-miR166d"	-0.00849941019163981	15.8781212205888	0.000347225267763207	0.985133094194596	1
"pma-miR-23a-3p"	0	8.76344130534338	0	1	1
"csi-miR166a"	0	8.80918510476594	0	1	1
"gma-miR156v"	0	8.88923232705875	0	1	1
"gma-miR164h"	0	8.77973236168567	0	1	1
"osa-miR160a-3p"	0	8.84564956176456	0	1	1
"osa-miR164e"	0	8.78123755376452	0	1	1
"ptc-miR167b"	0	8.78613401203808	0	1	1
"sbi-miR156e"	0	8.83298441909271	0	1	1
"zma-miR164e-5p"	0	8.78150220338267	0	1	1
"mdm-miR156z"	0	8.85832198311006	0	1	1
"mtr-miR156d-5p"	0	8.7536162267602	0	1	1
"sly-miR167b-5p"	0	8.93133188266858	0	1	1
"vvi-miR166c"	0	8.74889573583564	0	1	1
