"logFC"	"logCPM"	"LR"	"PValue"	"FDR"
"all-m0236-5p"	0.0259845890420906	19.9241469580013	1323.30785229221	9.730451470761e-290	6.71401151482509e-288
"all-m0212-3p"	-21.1078040733839	7.65662989199862	71.3599407293246	2.97654458920408e-17	1.02690788327541e-15
"all-m0178-3p"	-19.1851534520405	5.08773645088496	44.0865263623182	3.14176100399017e-11	7.22605030917738e-10
"all-m0156-5p"	-16.9682558941504	5.07865728331819	21.4570404061163	3.6184499761544e-06	6.24182620886634e-05
"Afl-milR-33"	9.09287128726909	8.46246830107616	2.69052786341169	0.100946367552564	0.999736679227229
"Afl-milR-3"	14.5498347431635	7.91458410782815	1.97210505403846	0.160224599531586	0.999736679227229
"all-m0170-3p"	1.53476413174578	10.2515391975889	1.4646222030508	0.226196109459197	0.999736679227229
"all-m0144-3p"	10.7899791024807	6.11441394415366	0.783000480199013	0.376225054312317	0.999736679227229
"all-m0184-3p"	6.87718364767712	7.12309076025727	0.710896525765218	0.39914634765244	0.999736679227229
"all-m0164-5p"	10.5251573452814	5.66569509936743	0.673431386418046	0.411857821524828	0.999736679227229
"all-m0048-5p"	9.32767893323077	5.72395529508272	0.457859066842498	0.498626244477337	0.999736679227229
"all-m0236-3p"	7.6064371444448	5.05726159287729	0.246256613310951	0.619723332982261	0.999736679227229
"Afl-milR-9"	6.9445866354628	4.97883599504984	0.194729982252268	0.659008708976533	0.999736679227229
"all-m0191-5p"	6.18837375076834	4.56105989033472	0.148354792964249	0.700112560885159	0.999736679227229
"all-m0235-5p"	4.39039462466427	4.48939895366536	0.0699940528965497	0.791345439267399	0.999736679227229
"all-m0036-3p"	4.29358932745919	4.38871417051524	0.0643367976483606	0.799768287486834	0.999736679227229
"all-m0187-3p"	4.17791912325074	4.51539840460507	0.0593356141613102	0.807549127401805	0.999736679227229
"all-m0225-3p"	3.78739812821934	4.40415368997189	0.0538950550587485	0.816419114754385	0.999736679227229
"all-m0107-3p"	2.69042599468352	5.4972762646114	0.0516959204588421	0.820138091661855	0.999736679227229
"all-m0217-3p"	3.77049384527623	4.43608701219237	0.0504870620368081	0.82221790665245	0.999736679227229
"all-m0224-3p"	3.63381345927562	4.50731912367337	0.0449865773524207	0.832028711929219	0.999736679227229
"all-m0036-5p"	3.38491903037105	4.35441035792269	0.0424373548168195	0.8367883426551	0.999736679227229
"all-m0195-5p"	2.76723271866199	4.35145977022631	0.0312265932188724	0.859735809741496	0.999736679227229
"all-m0130-5p"	2.19006511606808	4.35907445998803	0.0230064385349844	0.879440330405875	0.999736679227229
"all-m0173-5p"	1.02257437311719	4.3287210598302	4.45340698540519e-07	0.999467540938621	0.999736679227229
"all-m0221-3p"	5.12548240610387e-15	4.30127133310698	4.41149163865617e-07	0.999470052607345	0.999736679227229
"all-m0110-5p"	1.02294480627412	4.3593183928111	4.31582116711127e-07	0.999475830495572	0.999736679227229
"all-m0171-5p"	5.12548240610387e-15	4.34543843109638	4.24852757419103e-07	0.999479933054872	0.999736679227229
"all-m0067-3p"	5.12548240610387e-15	4.29249201146229	4.20201562434386e-07	0.999482787678457	0.999736679227229
"all-m0229-3p"	1.02249983374463	4.32254899235338	4.19788911631969e-07	0.99948304169997	0.999736679227229
"all-m0185-5p"	5.12548240610387e-15	4.41979744622396	4.12291612628124e-07	0.999487678854127	0.999736679227229
"Afl-milR-2"	2.70186059141222	4.41447689842194	3.57484374990946e-07	0.999522944872879	0.999736679227229
"all-m0133-5p"	2.04457619610755	4.32387743243524	3.24282276586985e-07	0.999545638374433	0.999736679227229
"all-m0063-3p"	2.15085808689624	4.31540141898848	3.144308267089e-07	0.999552593182501	0.999736679227229
"all-m0079-3p"	2.15085808689624	4.31540141898848	3.144308267089e-07	0.999552593182501	0.999736679227229
"all-m0118-5p"	2.15085808689624	4.31540141898848	3.144308267089e-07	0.999552593182501	0.999736679227229
"all-m0162-3p"	2.15085808689624	4.31540141898848	3.144308267089e-07	0.999552593182501	0.999736679227229
"all-m0193-3p"	2.15085808689624	4.31540141898848	3.144308267089e-07	0.999552593182501	0.999736679227229
"all-m0168-3p"	1.14776266163825	4.29200857952658	3.02290371179126e-07	0.999561315594194	0.999736679227229
"all-m0119-5p"	1.74126446665578	4.28790849251451	2.95251172510724e-07	0.999566453329229	0.999736679227229
"all-m0234-5p"	1.74126446665578	4.28790849251451	2.95251172510724e-07	0.999566453329229	0.999736679227229
"all-m0049-5p"	5.12548240610387e-15	4.32762839511752	2.88841931705974e-07	0.999571184810077	0.999736679227229
"all-m0099-5p"	5.12548240610387e-15	4.32762839511752	2.88841931705974e-07	0.999571184810077	0.999736679227229
"all-m0202-3p"	5.12548240610387e-15	4.32762839511752	2.88841931705974e-07	0.999571184810077	0.999736679227229
"all-m0201-5p"	5.12548240610387e-15	4.26390586121915	2.60292276232921e-07	0.999592928513321	0.999736679227229
"all-m0136-5p"	1.80748346543633	4.34008150864033	2.33419994444262e-07	0.999614513590166	0.999736679227229
"Afl-milR-7"	2.65173003242393	4.30044104251567	2.23572098834168e-07	0.999622732975122	0.999736679227229
"all-m0091-5p"	5.12548240610387e-15	4.3581545562044	2.1435774488765e-07	0.9996305891596	0.999736679227229
"all-m0188-5p"	5.12548240610387e-15	4.36671416904758	1.96990925793727e-07	0.999645869642501	0.999736679227229
"all-m0059-3p"	-7.32255087597549	4.34835654639111	1.96111728634207e-07	0.999646660792042	0.999736679227229
"all-m0233-3p"	1.02256115886603	4.3276272605346	1.87044695287852e-07	0.999654925596555	0.999736679227229
"Afl-milR-92"	1.03856810471724	4.26264381567658	1.85679532638261e-07	0.999656187181034	0.999736679227229
"all-m0214-3p"	5.12548240610387e-15	4.32222312385201	1.85023895760139e-07	0.999656794721578	0.999736679227229
"all-m0140-3p"	1.73686367202836	4.35839350753428	1.81176254887561e-07	0.99966038200993	0.999736679227229
"all-m0002-3p"	5.12548240610387e-15	4.44553613280064	1.80228859836262e-07	0.999661271127847	0.999736679227229
"all-m0029-3p"	5.12548240610387e-15	4.29869077291164	1.78525029426169e-07	0.999662876051233	0.999736679227229
"Afl-milR-43"	1.02177696000549	4.26241567039914	1.7617780523338e-07	0.999665099615292	0.999736679227229
"all-m0140-5p"	1.02177696000549	4.26241567039914	1.7617780523338e-07	0.999665099615292	0.999736679227229
"all-m0141-3p"	1.60472305308478	4.32287489573716	1.72931267083953e-07	0.999668199672182	0.999736679227229
"all-m0073-3p"	1.02260546457137	4.33129399176074	1.7033336785488e-07	0.999670701376083	0.999736679227229
"all-m0123-3p"	5.12548240610387e-15	4.33351428406843	1.6941944291915e-07	0.999671585991324	0.999736679227229
"all-m0071-5p"	5.12548240610387e-15	4.38869133617685	1.43453828371776e-07	0.999697798843159	0.999736679227229
"all-m0027-3p"	1.74860453109982	4.35784984845904	1.39219328953999e-07	0.99970229247004	0.999736679227229
"all-m0013-3p"	1.60483144239723	4.33058015011355	1.33034169458313e-07	0.999708980792864	0.999736679227229
"all-m0029-5p"	5.12548240610387e-15	4.33354189456397	1.30591595759455e-07	0.999711664798634	0.999736679227229
"all-m0007-5p"	1.03913592722525	4.32714283629906	1.18877189425604e-07	0.999724900806484	0.999736679227229
"all-m0121-3p"	2.02501311701951	4.32342634910677	1.13784802024952e-07	0.999730857561844	0.999736679227229
"all-m0145-5p"	2.01516933696647	4.32320083399734	1.11681709658029e-07	0.999733356451544	0.999736679227229
"all-m0233-5p"	1.81286955349167	4.26607362254598	1.08915611640725e-07	0.999736679227229	0.999736679227229
