"logFC"	"logCPM"	"LR"	"PValue"	"FDR"
"Predict-miR-529"	-3.09348919915949	10.8927277722526	16.0567194565594	6.14730931538024e-05	0.0424779073692774
"Predict-miR-169"	-3.25363225481059	10.1065966648299	14.0455314943114	0.000178437314587872	0.0616500921901097
"rna19201"	-3.99581006721783	9.91703009894555	10.5136592697353	0.00118495372861543	0.272934342157754
"Predict-miR-574"	-4.82546003928948	8.61567423009946	9.95375187868837	0.00160521918137063	0.277301613581776
"rna24415"	1.87643651200737	13.6768377746363	8.73033422724557	0.00312959123924621	0.354872567530122
"Predict-miR-299"	-3.80112285746243	10.1464152788952	8.44644453914107	0.00365757797302176	0.354872567530122
"Predict-miR-286"	-2.17582202165058	10.8867214982272	8.42771555765232	0.00369544328306059	0.354872567530122
"Predict-miR-368"	-1.5708245381035	11.7891807602104	7.90459893141428	0.00493092730487069	0.354872567530122
"rna41496"	-1.76435313854882	11.2834194671721	7.65696612168646	0.00565535255128163	0.354872567530122
"Predict-miR-468"	-6.2844264051114	8.18882088468909	7.31010171505313	0.0068568045633483	0.354872567530122
"rna55381"	2.15004060198273	12.6919851466835	7.15289357411793	0.00748431412183184	0.354872567530122
"Predict-miR-162"	-2.15233838326592	10.69433215859	7.13874905122451	0.00754357636987381	0.354872567530122
"rna19536"	2.40161562669595	12.9450741068605	7.09164545498535	0.00774441102759824	0.354872567530122
"rna51016"	-2.31461279622669	11.2578142947779	6.9602858618804	0.00833387167114617	0.354872567530122
"rna29820"	1.92704234418844	12.9306049202199	6.93437199194263	0.00845547464689077	0.354872567530122
"rna21851"	1.9257098989541	13.2688130789	6.74845095783328	0.00938291120117253	0.354872567530122
"rna65319"	-6.85110336782326	8.11883429881765	6.71080102012391	0.00958306686822162	0.354872567530122
"Predict-miR-524"	-6.27799153383573	8.91217620534813	6.68028497598287	0.00974850379845551	0.354872567530122
"rna9029"	6.9875761174066	11.7347930771964	6.54413144888633	0.0105230688744351	0.354872567530122
"Predict-miR-548"	6.75589390646945	11.5599412351597	6.4326062220301	0.0112044053586109	0.354872567530122
"Predict-miR-278"	6.76451293727371	10.7637922445449	6.26682352394863	0.0123019490824616	0.354872567530122
"Predict-miR-565"	-6.22197379649648	8.98683019490733	6.21636792450813	0.0126574513879769	0.354872567530122
"Predict-miR-566"	-2.78959707631666	9.3244138918325	6.19047220185099	0.0128439910574238	0.354872567530122
"rna15913"	2.00897322192825	12.8583544652376	6.1582220277438	0.0130802622468519	0.354872567530122
"Predict-miR-349"	7.02721407267759	9.52280702028295	6.08879616355441	0.0136041747252642	0.354872567530122
"Predict-miR-163"	-1.91536427048439	10.8338577848117	6.0723675146659	0.0137312788068008	0.354872567530122
"Predict-miR-510"	-2.60487759663296	9.14756758292003	6.01978072552814	0.0141464042459726	0.354872567530122
"Predict-miR-49"	6.66111779576614	10.5232153485508	5.99090958252359	0.0143797856596866	0.354872567530122
"Predict-miR-573"	6.8536614438112	10.0493204844553	5.91411395587346	0.015020055165988	0.35789165929992
"Predict-miR-87"	-6.27038745751164	8.31748021447382	5.78449300768121	0.0161681604853952	0.372406629846936
"Predict-miR-80"	2.93671262686243	10.0637511033776	5.59819253822235	0.0179790167664498	0.394972887435178
"Predict-miR-309"	6.65343488758217	10.2510895405668	5.56805434523027	0.0182910743819475	0.394972887435178
"Predict-miR-555"	3.08907433382584	11.4952475112931	5.28702305234442	0.0214849169037299	0.432166150372718
"Predict-miR-99"	6.5305461600847	8.9845760504042	5.26640113365397	0.0217409150523723	0.432166150372718
"Predict-miR-296"	-3.4135799390457	8.82728472035464	5.13556864249164	0.0234404071942861	0.432166150372718
"Predict-miR-415"	6.36979884074138	9.30991391469203	5.12004909994691	0.0236509474554642	0.432166150372718
"rna63727"	2.63461035281699	11.0986476727301	4.96520025218008	0.0258623203207036	0.432166150372718
"Predict-miR-562"	6.3876296231058	9.68182304156824	4.92267989397007	0.0265063708282976	0.432166150372718
"Predict-miR-260"	6.33677419942217	9.95130506964522	4.90566288179242	0.0267687754460839	0.432166150372718
"rna9752"	1.52209554448701	13.2189554497289	4.90269555146078	0.0268148078728063	0.432166150372718
"Predict-miR-488"	-5.70906431200815	8.38928631161834	4.87788863036975	0.0272028745641636	0.432166150372718
"Predict-miR-29"	-5.70813213971773	8.40697061768428	4.87610526293857	0.0272309966963987	0.432166150372718
"rna40086"	1.765778099324	12.9343065476749	4.8076090822533	0.0283343312432858	0.432166150372718
"rna15912"	-5.731251209168	8.36765599346247	4.79604742636308	0.028525107345818	0.432166150372718
"rna29118"	1.70327802947077	12.8185879610229	4.76867529411787	0.028982117845459	0.432166150372718
"Predict-miR-208"	2.14541508337542	11.7636608357212	4.74101135059371	0.0294517526974507	0.432166150372718
"Predict-miR-582"	-5.71384577890119	8.48640545369518	4.72610558281129	0.029708078866922	0.432166150372718
"rna63087"	1.65638131945153	13.6285897679488	4.70813372135772	0.0300202246279167	0.432166150372718
"Predict-miR-605"	-5.76237948318389	9.67565605967671	4.65862605684806	0.0308979065036807	0.435723538653946
"rna68982"	1.63960090434595	12.8758218896994	4.62383559008943	0.031530656085965	0.435753667108037
"Predict-miR-495"	2.59067706397947	11.3447282189518	4.51817712596834	0.0335365450025914	0.454387305819425
"Predict-miR-462"	-1.67495298771537	11.3769368493769	4.42260199148075	0.0354659151508547	0.471287449408473
"Predict-miR-571"	-3.28223152670283	8.1917847805543	4.36100091761279	0.0367706945335418	0.479406602314668
"rna12553"	1.7460646086847	12.8608125074129	4.25090171375549	0.0392294957514188	0.495010242024008
"Predict-miR-378"	-2.53093241589734	9.97189869107035	4.24352693039486	0.0394002363405505	0.495010242024008
"Predict-miR-406"	6.16690719322851	10.1705041828197	4.2124657897977	0.040127965170262	0.495150427368768
"rna41819"	6.03120838210266	9.24393198833396	4.07195637542355	0.0436007487701584	0.520704893536689
"Predict-miR-130"	6.0784045011114	10.5486592965734	4.06788156548979	0.0437060547396932	0.520704893536689
"Predict-miR-399"	1.32609505647427	15.0022257786217	4.0300091687431	0.0446976979979322	0.523493378246969
"Predict-miR-274"	6.07471653723629	10.0406619368336	3.8955367817591	0.0484145655348869	0.557574413076781
"Predict-miR-248"	1.51072560573555	12.9182346847149	3.85641555424437	0.0495560929291335	0.561364921541496
"Predict-miR-165"	-1.84169384495063	10.7561910607176	3.76205894208724	0.0524279828312134	0.574536128923087
"Predict-miR-603"	5.97444285550905	8.95676079672592	3.7575968160077	0.0525680807965274	0.574536128923087
"rna68981"	5.97175657620035	9.4707251316082	3.73721130443564	0.0532131870493163	0.574536128923087
"Predict-miR-64"	1.96381005939097	10.0798582763356	3.5595660804936	0.0592032131639289	0.629375696865767
"Predict-miR-568"	-2.72996558671224	8.37654637988661	3.5092779874552	0.0610260453928857	0.638924202522485
"Predict-miR-347"	5.80575454501122	9.24501701015422	3.41392448832106	0.0646485272560811	0.6619744687791
"Predict-miR-471"	-1.45706168875212	11.4935224304729	3.40133560055783	0.0651436524992457	0.6619744687791
"Predict-miR-340"	5.82610035528227	8.93848618265588	3.36653068889942	0.0665337271490821	0.666301528406025
"Predict-miR-70"	-2.81571736227351	9.05875698148576	3.33332633426679	0.0678894437220021	0.670165794455764
"Predict-miR-416"	5.79459645342402	9.60737968577729	3.24911550511243	0.0714620109598634	0.695496472862896
"Predict-miR-373"	-2.79253677594844	9.28502326807549	3.20625592804629	0.0733571676864339	0.704025039879525
"Predict-miR-72"	5.81828813021749	9.84111443801896	3.16711589085816	0.0751350169823081	0.708896863180649
"Predict-miR-206"	5.77049735239268	8.31765376067295	3.15022281317755	0.0759165960569726	0.708896863180649
"Predict-miR-503"	5.72279499907187	9.69309841591149	3.12103676922307	0.077287594736593	0.71207637283981
"Predict-miR-56"	-2.71749679005542	8.54472290417634	3.02340286863775	0.0820710906821115	0.724399194247848
"Predict-miR-146"	-5.95308770304795	7.95226274833368	3.02284948731299	0.0820990961557294	0.724399194247848
"Predict-miR-365"	2.28119691855458	10.4365161510492	2.94735115795758	0.0860184401956128	0.724399194247848
"Predict-miR-426"	-1.58914389391303	9.86734068429686	2.83590566211078	0.0921788191134922	0.724399194247848
"rna7683"	-1.23376312372023	11.8141607382242	2.8239444179437	0.092867931233415	0.724399194247848
"Predict-miR-116"	-0.941478710230953	11.7057724826134	2.76918359800429	0.096095161394121	0.724399194247848
"Predict-miR-27"	5.45972856164869	9.52083827354088	2.75749871156301	0.0967994760234191	0.724399194247848
"Predict-miR-478"	5.47703533933688	8.82362795697825	2.75719909925009	0.0968176091692772	0.724399194247848
"Predict-miR-421"	5.44116619573354	9.04476093733953	2.74239642967138	0.0977181239413597	0.724399194247848
"rna37546"	-1.62559602518416	11.085053326615	2.74121467038117	0.097790408455853	0.724399194247848
"Predict-miR-152"	5.43497530940502	8.59503021618406	2.7215147426066	0.0990040216524884	0.724399194247848
"Predict-miR-504"	5.44522799538873	9.25786459173155	2.69127720489061	0.100898908528895	0.724399194247848
"Predict-miR-473"	-2.71313073679947	8.78686845323021	2.68577576458836	0.101247906978911	0.724399194247848
"rna11059"	5.9703969272517	8.10243069958928	2.68333468331056	0.101403185874229	0.724399194247848
"rna437"	1.34116105392411	10.9812916256853	2.68285833661801	0.101433516967923	0.724399194247848
"Predict-miR-58"	-1.50668344783248	9.78175027996752	2.68160074338105	0.101513641140862	0.724399194247848
"Predict-miR-52"	5.42269094446182	8.45193787189683	2.68028118564152	0.101597787614818	0.724399194247848
"Predict-miR-404"	5.56166775569813	8.21629091030848	2.64615519760509	0.103800678046992	0.724399194247848
"Predict-miR-465"	5.9665758831806	8.33697533479827	2.63826513690658	0.104317402124234	0.724399194247848
"rna11049"	5.52467862001223	8.34057314411914	2.6177085744905	0.105676945489081	0.724399194247848
"Predict-miR-51"	5.43562442679459	9.75104523729322	2.60825684784907	0.106308559645106	0.724399194247848
"Predict-miR-328"	5.39394824361988	7.9973702818076	2.5848324364965	0.10789182551074	0.724399194247848
"Predict-miR-148"	5.37487707306156	8.78843465818496	2.52228034567575	0.112248159355759	0.724399194247848
"Predict-miR-298"	5.91994285441036	8.68997740408605	2.49802136843759	0.113989430325459	0.724399194247848
"Predict-miR-338"	5.36606583392085	10.1020673620764	2.4935862545694	0.114310983580341	0.724399194247848
"Predict-miR-458"	5.41566568461702	8.88667087147664	2.44378518051663	0.11799120046566	0.724399194247848
"Predict-miR-306"	-4.73581683587274	8.38094333908445	2.44000512506959	0.118275839255731	0.724399194247848
"Predict-miR-98"	-4.7412858912912	8.62180882557673	2.43233322695416	0.11885587181794	0.724399194247848
"Predict-miR-271"	-4.74139841462898	7.96266461445973	2.43211770070874	0.118872212014083	0.724399194247848
"Predict-miR-517"	-4.73353039404854	8.5631631614969	2.42764529212124	0.119211850690485	0.724399194247848
"Predict-miR-228"	-4.73072938409565	7.86448897830629	2.41237810432122	0.1203793697625	0.724399194247848
"Predict-miR-73"	-4.73061250642287	8.18638234464386	2.41173803226998	0.12042859335427	0.724399194247848
"rna53549"	-4.75362493567969	9.08344749105145	2.4080716162932	0.120710982380715	0.724399194247848
"Predict-miR-623"	5.33801127024423	9.09225778229754	2.40307855515355	0.121096730452161	0.724399194247848
"rna21854"	0.955276385176047	13.661192166112	2.39917116267975	0.121399555820194	0.724399194247848
"rna44577"	-4.72758871699361	7.86241164994298	2.39509413614986	0.121716422815688	0.724399194247848
"Predict-miR-251"	-4.72750145101959	9.66930443429034	2.39461138137862	0.121754003230149	0.724399194247848
"Predict-miR-533"	-4.72275948220853	8.52584270401544	2.36817426947558	0.12383180046043	0.724399194247848
"Predict-miR-485"	-4.7192552581803	8.42539409225206	2.34837850772474	0.125413397903044	0.724399194247848
"Predict-miR-180"	5.31999320663106	9.62439903716052	2.34562349862898	0.125635284850326	0.724399194247848
"Predict-miR-479"	1.40332135542366	10.0802436202508	2.32846792498223	0.127026844671287	0.724399194247848
"Predict-miR-149"	-4.71561262452247	10.0294972134368	2.3275659378534	0.127100481469058	0.724399194247848
"rna504"	1.69511227714926	11.2044355932828	2.32441290227671	0.12735826370891	0.724399194247848
"Predict-miR-461"	-4.71248037045051	7.80997171742813	2.30947708117761	0.128587302355291	0.724399194247848
"rna46223"	-4.71245223165376	7.80007323308895	2.30931377014374	0.128600813669655	0.724399194247848
"Predict-miR-71"	-4.71242802681259	7.79155753875847	2.30917327933665	0.128612438248998	0.724399194247848
"Predict-miR-161"	-4.71236233184159	7.76845812396175	2.30879191590606	0.128643999163793	0.724399194247848
"Predict-miR-273"	-4.71173705015053	8.59488216673147	2.3051581808576	0.128945153245275	0.724399194247848
"Predict-miR-575"	-4.70946516088142	7.88679136099305	2.29189539253785	0.130051021291336	0.724719804131557
"rna847"	-4.8224895602233	8.1560561558784	2.24412093749597	0.134123110073258	0.740509680013265
"rna50768"	1.25670548466362	12.8766403508374	2.23372673604196	0.135027814300537	0.740509680013265
"Predict-miR-580"	1.55726641254322	11.6397824479057	2.18534712613945	0.139329648098186	0.75109958351169
"Predict-miR-345"	-4.85229502400591	7.93460269760794	2.15318339096078	0.142274627257522	0.75109958351169
"rna9092"	-0.915579710501969	11.8700808205735	2.14893812291033	0.142668532849442	0.75109958351169
"Predict-miR-311"	5.17812262721325	9.11838676291414	2.13263712683842	0.144192495774536	0.75109958351169
"Predict-miR-143"	1.57123647361205	9.61423708175188	2.10347084429734	0.146965197217138	0.75109958351169
"Predict-miR-314"	5.05490105415328	8.06929597280799	2.0966733899457	0.147620006677769	0.75109958351169
"Predict-miR-151"	5.05107961039177	8.70361939456458	2.09251438798256	0.148022273484213	0.75109958351169
"Predict-miR-616"	5.06502886953757	9.30848810980508	2.07805482835801	0.149430495629898	0.75109958351169
"Predict-miR-539"	5.04118766671039	8.81593232452184	2.06732378478788	0.150485386524693	0.75109958351169
"Predict-miR-102"	5.05307815288262	9.53580799578378	2.06250299950412	0.150962022664884	0.75109958351169
"Predict-miR-374"	-1.30744346454458	11.2585404649055	2.06025361678381	0.1511850058007	0.75109958351169
"Predict-miR-613"	-1.50335039962081	10.4760330909133	2.05974553924838	0.151235423528776	0.75109958351169
"Predict-miR-247"	5.05311422333319	9.60612511349757	2.04674716838967	0.152531777885226	0.75109958351169
"Predict-miR-398"	5.05311321628775	10.5526192323479	2.04381545646729	0.152825900043844	0.75109958351169
"rna60851"	5.0265903866744	8.89542343405765	2.0303800738103	0.154182045331846	0.75109958351169
"Predict-miR-494"	5.02292154691971	10.0053784632134	2.02113737321193	0.15512291230697	0.75109958351169
"Predict-miR-115"	5.21405543693203	8.50713443471732	2.01806219181158	0.155437395719496	0.75109958351169
"Predict-miR-400"	5.00516335384381	10.0778962928009	1.97663954068687	0.15974487223484	0.755652860953205
"rna11056"	6.00470108915836	7.93271859662945	1.97594940102464	0.159817780092885	0.755652860953205
"Predict-miR-437"	5.00298996317675	9.58074966316415	1.97122059577149	0.160318362199184	0.755652860953205
"rna44410"	0.877152653689076	13.6512952182184	1.96444925979833	0.161038276415685	0.755652860953205
"rna44329"	6.72954906440975	7.86255977581759	1.93942281684463	0.163731217450375	0.755652860953205
"Predict-miR-521"	4.98852183854545	8.89321174652108	1.93529587403656	0.164180212349094	0.755652860953205
"rna39993"	4.98399293510379	9.43751705232614	1.92410335138483	0.165405014264523	0.755652860953205
"Predict-miR-456"	4.97976516227976	8.43688171310676	1.91367762139406	0.166555314143965	0.755652860953205
"rna49430"	4.96973243245558	9.76569547251887	1.88902365110985	0.169312085236062	0.755652860953205
"Predict-miR-255"	5.17063040356626	8.43715386445947	1.88868330867577	0.169350506151719	0.755652860953205
"rna49429"	-1.25426990325391	10.5254847146854	1.8759723197778	0.170792626850713	0.755652860953205
"rna46224"	-1.99032905343248	8.94098126647345	1.85463330186296	0.173245474123096	0.755652860953205
"Predict-miR-223"	4.94279402802529	9.38364841422402	1.82342405271529	0.17690624239883	0.755652860953205
"Predict-miR-436"	4.94172181354141	8.20430173044795	1.82083086277865	0.177214408708945	0.755652860953205
"rna39356"	1.15384482756207	14.3034995452275	1.80985454219962	0.178525679898179	0.755652860953205
"Predict-miR-182"	1.78417155785795	9.770953324995	1.77909238740318	0.182260815538468	0.755652860953205
"Predict-miR-254"	5.12795729092817	8.25616737546081	1.76424387822308	0.184096051711253	0.755652860953205
"Predict-miR-16"	4.91457841089596	8.63003059318651	1.75563182971748	0.185170296509409	0.755652860953205
"rna505"	1.50765138451297	11.7160050827304	1.72306838544468	0.189298555061463	0.755652860953205
"rna44328"	-2.15574833290562	8.64055710362936	1.71764423542129	0.189996566199783	0.755652860953205
"Predict-miR-366"	-2.15554183854277	8.8738988218021	1.70439580888413	0.19171410311733	0.755652860953205
"rna35737"	-1.10399405968041	11.7454064077172	1.69944391005344	0.192360717604316	0.755652860953205
"Predict-miR-79"	4.8888561042603	8.01888116553651	1.6946317644477	0.192991524331258	0.755652860953205
"Predict-miR-53"	1.18848357718916	11.0055108387747	1.6828156465327	0.194550739075468	0.755652860953205
"Predict-miR-315"	-2.18615823028665	8.63895474047814	1.66750121095755	0.196593561180633	0.755652860953205
"rna34927"	0.930725435105737	13.2757257079128	1.66641918808515	0.196738841939922	0.755652860953205
"Predict-miR-294"	-2.15489305878495	8.7080880675786	1.64021743173374	0.200295638244815	0.755652860953205
"Predict-miR-246"	-2.15488350787761	9.07568171094338	1.63843595000581	0.200540197139628	0.755652860953205
"Predict-miR-45"	1.7843233757032	9.21376432874003	1.63518172857215	0.200987838104158	0.755652860953205
"Predict-miR-541"	1.74290294981724	10.2358951540259	1.62969958740442	0.201744604867152	0.755652860953205
"Predict-miR-9"	1.17424329246361	14.8306346806919	1.62342425766837	0.202614984021958	0.755652860953205
"Predict-miR-215"	1.72722417021579	9.86732008207768	1.62122177871274	0.202921512108995	0.755652860953205
"Predict-miR-20"	-2.1547986100914	10.3848370841291	1.613368726207	0.204018908817511	0.755652860953205
"Predict-miR-467"	-2.15481056312849	9.35295196671524	1.58693565573834	0.207764490014447	0.755652860953205
"Predict-miR-621"	-1.09267667344714	16.4287379977371	1.5852674867241	0.208003583135713	0.755652860953205
"Predict-miR-303"	1.24694417216385	10.0700747702323	1.58251263634482	0.208399139455308	0.755652860953205
"Predict-miR-572"	-1.2517411332921	10.418628377911	1.55679673706905	0.212134856580937	0.755652860953205
"rna21855"	-0.931220546431956	13.2825033617394	1.54282145369898	0.214198325558739	0.755652860953205
"Predict-miR-490"	1.09892978473637	12.0693855699734	1.49006770161796	0.222205955853991	0.755652860953205
"rna38013"	0.843759370343819	12.994935840491	1.48642610779039	0.222771798386409	0.755652860953205
"Predict-miR-344"	1.37331200242922	10.2549446633077	1.48068366294986	0.223667587525357	0.755652860953205
"rna69978"	4.84284799903605	7.8668592686531	1.4740341692554	0.224710269747436	0.755652860953205
"rna55112"	-1.30904956677966	9.79838891016123	1.45205118806544	0.228199107027169	0.755652860953205
"Predict-miR-355"	-2.15683180284023	8.62352242635779	1.44212915819024	0.229795106925847	0.755652860953205
"Predict-miR-560"	4.56998763863364	8.90370222779177	1.42729287494903	0.232206751274026	0.755652860953205
"Predict-miR-132"	4.65971262320964	8.71969029469654	1.41244797815709	0.234650439692901	0.755652860953205
"Predict-miR-262"	4.56041195465015	8.9433086137	1.40375829554053	0.236095321689838	0.755652860953205
"Predict-miR-249"	0.96919056211076	12.8863121446539	1.40335906356632	0.236161962643461	0.755652860953205
"rna20253"	4.52936002891393	7.89663908261102	1.40112510956217	0.236535281462152	0.755652860953205
"rna31208"	4.49565040439834	8.62945302641125	1.39836487146292	0.236997536363503	0.755652860953205
"rna31209"	4.49011458498146	7.873389427655	1.39721719824118	0.237190058532545	0.755652860953205
"rna42423"	4.48817870051063	8.59141559360325	1.39584505178342	0.237420485008536	0.755652860953205
"Predict-miR-195"	4.4881115632454	8.45591962502155	1.39573075156866	0.237439691847972	0.755652860953205
"Predict-miR-401"	4.48798259876904	8.05878693136764	1.39551120126543	0.237476590042772	0.755652860953205
"Predict-miR-289"	4.48567652715306	8.91238309826627	1.39158750695903	0.238137190595554	0.755652860953205
"Predict-miR-607"	4.50050315957211	8.89448552421086	1.38770894526196	0.238792385218963	0.755652860953205
"rna34999"	4.50098409559509	7.94513371316303	1.38724284414156	0.238871269583412	0.755652860953205
"Predict-miR-561"	4.50141248393102	8.50699400533224	1.38682561975151	0.238941908740942	0.755652860953205
"Predict-miR-263"	4.48284486177602	8.29198986216098	1.38677518461064	0.238950449499474	0.755652860953205
"Predict-miR-354"	4.48063720014206	8.90806348374786	1.38302765035582	0.239586100858808	0.755652860953205
"Predict-miR-391"	4.48048733022563	8.79967879751343	1.38277338110139	0.239629304009092	0.755652860953205
"rna9998"	4.5077127871337	8.26790730543047	1.38045716980128	0.240023290046678	0.755652860953205
"rna55115"	4.50835413791716	9.1164473076074	1.37978343714307	0.240138039304471	0.755652860953205
"Predict-miR-578"	4.50899133527312	8.06244789375644	1.37910920365521	0.240252940627219	0.755652860953205
"Predict-miR-118"	4.47802950366656	9.0574605571816	1.37860591376307	0.240338753701718	0.755652860953205
"rna11053"	4.98099252448741	7.92683457098374	1.37330953989543	0.241244071883663	0.755652860953205
"rna41815"	-1.28256200436068	10.2216404154509	1.37058560678396	0.241711293849638	0.755652860953205
"Predict-miR-138"	4.47301569014123	9.31273461815007	1.37011901485065	0.241791436362276	0.755652860953205
"Predict-miR-501"	4.51721939301432	8.36907824054757	1.36994127726765	0.241821973336919	0.755652860953205
"Predict-miR-394"	4.51859093283262	8.97970614573142	1.36832424201033	0.242100010866333	0.755652860953205
"Predict-miR-201"	4.47145493138891	8.44521774216914	1.36748107115125	0.242245142399466	0.755652860953205
"Predict-miR-402"	4.52077110291607	8.95035091550379	1.36569750145042	0.242552490201394	0.755652860953205
"Predict-miR-200"	4.46794250903154	8.50275290803005	1.36155134792929	0.243268800334218	0.755652860953205
"Predict-miR-24"	4.46523775541821	8.34187619310046	1.35699160539831	0.244059543812879	0.755652860953205
"Predict-miR-428"	4.52920815721442	7.79949451854899	1.35482384701181	0.244436572450487	0.755652860953205
"rna30256"	-0.89421870700185	10.7092676189618	1.35449229486846	0.244494300488926	0.755652860953205
"Predict-miR-359"	4.53055418076342	8.48468175203515	1.35297564306286	0.24475858379768	0.755652860953205
"Predict-miR-198"	4.54024794482537	8.4596333049457	1.33859306906932	0.24728223576486	0.755652860953205
"rna70362"	1.75821269975682	10.2340974350821	1.33538701077312	0.247849119361647	0.755652860953205
"rna10532"	1.72807804887034	10.2849372623409	1.33494148835782	0.247928020823248	0.755652860953205
"Predict-miR-313"	4.44943111829636	9.02553142826858	1.3304563141692	0.248724055252981	0.755652860953205
"Predict-miR-493"	4.44844621271294	9.83377380753136	1.3288092117026	0.249017170760037	0.755652860953205
"Predict-miR-470"	4.55356227591719	8.5840308754385	1.31501498548488	0.25148866838276	0.755652860953205
"Predict-miR-506"	4.43944985857937	8.78804373669002	1.31379823096052	0.251708114766623	0.755652860953205
"Predict-miR-545"	4.43899733374435	8.43464515617042	1.31304478193733	0.251844120129319	0.755652860953205
"Predict-miR-181"	4.43607028110971	8.42354643915719	1.30817500191085	0.25272534719111	0.755652860953205
"rna11055"	4.43563081276898	8.31512831619092	1.30744440966688	0.252857880666407	0.755652860953205
"rna29117"	4.43548779230903	9.03063860696733	1.30720667729756	0.252901025060812	0.755652860953205
"Predict-miR-261"	4.43282020128887	9.65981011781234	1.30277535926612	0.253706893981394	0.755652860953205
"Predict-miR-549"	4.42913300128865	8.38674168978745	1.29665910610679	0.25482437923127	0.755723802784583
"Predict-miR-137"	4.41124995704319	8.18958929991853	1.26713933490803	0.260304025480676	0.768675562423705
"Predict-miR-214"	4.40075604601218	9.17215755291932	1.24992753600232	0.263566317963986	0.770444529217954
"Predict-miR-253"	4.39697375995848	8.36876293165003	1.24374387325789	0.264750736231531	0.770444529217954
"rna34588"	0.894954205870948	13.212220275305	1.24105258607976	0.265268291218533	0.770444529217954
"Predict-miR-487"	4.39502445945568	8.53052590601621	1.24056107036091	0.265362949282016	0.770444529217954
"Predict-miR-211"	1.32606603984357	10.6530939896661	1.22684162604514	0.268022147027228	0.774909220066168
"Predict-miR-476"	4.38109836287678	8.53917755388688	1.21790365999838	0.269772452243126	0.775126509747632
"Predict-miR-346"	1.54662648742195	10.3018273369294	1.21501697421075	0.270340794282459	0.775126509747632
"Predict-miR-31"	4.35527051759934	8.57226987662962	1.17625559788221	0.278119601768254	0.794134895958115
"Predict-miR-610"	-1.01638561204955	9.07940179293748	1.14048952968355	0.285548911203849	0.803832840439858
"rna37547"	0.712358844668239	13.1731209451404	1.1398140455587	0.285691624051433	0.803832840439858
"Predict-miR-387"	4.32714793641117	8.18101444914108	1.1314517463119	0.287465890531403	0.803832840439858
"rna798"	0.735784939203024	13.6350918482623	1.11492232252877	0.29101444233876	0.803832840439858
"rna55382"	4.30327717100812	8.31189706921139	1.09386125075514	0.295617261338067	0.803832840439858
"rna58409"	-0.65191982653084	13.1279379670187	1.05975428467155	0.303271233603233	0.803832840439858
"Predict-miR-634"	-1.25323085757837	9.76960450359329	1.01592759432599	0.313486946707806	0.803832840439858
"Predict-miR-65"	-1.25875387614453	8.82423657624039	0.994107516883439	0.318740529467045	0.803832840439858
"rna69979"	1.83500224620522	8.28645534779083	0.952410940656991	0.329106371456632	0.803832840439858
"rna7820"	4.42663910416442	7.85809979643892	0.94654566798436	0.33060012915757	0.803832840439858
"Predict-miR-245"	1.38267021269208	9.6300089799721	0.904251162436395	0.341644370005128	0.803832840439858
"rna65320"	0.910464568737166	10.924295726072	0.877727096157649	0.348824965991921	0.803832840439858
"rna39161"	1.52116969033797	9.61469180309796	0.858346714637797	0.354201765638591	0.803832840439858
"Predict-miR-323"	-0.905971654428688	9.91124145005783	0.843024152730596	0.358533291582527	0.803832840439858
"rna60848"	1.00050254202932	10.9468479437413	0.810230224889608	0.368052193393971	0.803832840439858
"rna17900"	-1.02520171165508	9.08072432257166	0.797274529686966	0.371909491613599	0.803832840439858
"Predict-miR-54"	0.676022856475654	11.5211791509614	0.785541911238036	0.375451567019851	0.803832840439858
"rna70363"	3.85653278010413	8.96867952364288	0.784494316422471	0.37577013277717	0.803832840439858
"Predict-miR-427"	3.77104264778378	8.60324184543566	0.76032018057712	0.383228341534706	0.803832840439858
"Predict-miR-597"	-1.38689608829351	8.91529615940744	0.756398326070762	0.38445801285852	0.803832840439858
"Predict-miR-486"	0.761610227531047	10.8419276572925	0.751927325028683	0.385866713481823	0.803832840439858
"Predict-miR-540"	-1.29877066070856	9.02187584702235	0.750890560229667	0.386194420539257	0.803832840439858
"Predict-miR-390"	1.2340211792027	9.76991297199503	0.74701928043797	0.387421588206272	0.803832840439858
"Predict-miR-433"	3.69666091965029	8.21679753728616	0.739366372635654	0.389863927168749	0.803832840439858
"Predict-miR-63"	3.80069163987532	7.94529799737071	0.735874282079463	0.390985706450615	0.803832840439858
"Predict-miR-40"	3.67743150456544	10.0462189404975	0.733962922889166	0.391601659147538	0.803832840439858
"rna69972"	3.73748872019821	7.82825652688166	0.729437134493037	0.393065695960487	0.803832840439858
"Predict-miR-62"	3.95072247283439	7.88560697984477	0.729169321789051	0.393152576196396	0.803832840439858
"Predict-miR-432"	-1.25393231200504	9.16927489668793	0.723593790986204	0.39496760473348	0.803832840439858
"Predict-miR-69"	3.65600170067742	8.88341491404841	0.717581429009995	0.396938391970154	0.803832840439858
"Predict-miR-204"	3.64592582017006	8.10722541830559	0.715916661833827	0.397486593258287	0.803832840439858
"rna51554"	3.64064763206321	7.77359335136515	0.715030162006632	0.397778960646686	0.803832840439858
"rna438"	-1.22787052468807	8.24830671526805	0.71282603924339	0.398507228773315	0.803832840439858
"Predict-miR-587"	0.748135177753141	12.0644737669933	0.71128367097711	0.399017993360219	0.803832840439858
"rna33836"	0.584404557804461	13.1735413613415	0.711157595087293	0.39905978605129	0.803832840439858
"Predict-miR-293"	1.21816786329015	9.81565778300622	0.710900993715365	0.399144866005249	0.803832840439858
"Predict-miR-329"	0.548071877254893	12.4924459520995	0.706526005509117	0.40059951183709	0.803832840439858
"Predict-miR-207"	3.56857257518837	8.88874379643202	0.702067227578146	0.402089946457203	0.803832840439858
"Predict-miR-3"	3.56059387850901	8.89960979254248	0.700546587821671	0.402600093757012	0.803832840439858
"Predict-miR-489"	3.55171269228596	8.90118925680199	0.698511578805733	0.403284277723701	0.803832840439858
"Predict-miR-411"	3.5516366938432	8.67361496161708	0.698446860035009	0.403306064388188	0.803832840439858
"Predict-miR-265"	3.55161839421372	8.61184942643479	0.698431276654884	0.40331131057017	0.803832840439858
"Predict-miR-438"	3.55160458432658	8.56128040375312	0.698419516653032	0.403315269668576	0.803832840439858
"Predict-miR-631"	3.55159447393927	8.52164077371017	0.698410907043016	0.403318168198341	0.803832840439858
"Predict-miR-22"	3.55155164280213	8.31830211311109	0.698374434015874	0.403330447622404	0.803832840439858
"rna50769"	3.55154854750566	8.30053320432768	0.69837179822181	0.403331335039906	0.803832840439858
"rna23853"	3.55154613460158	8.28629807167707	0.698369743519482	0.403332026817777	0.803832840439858
"Predict-miR-125"	3.55154268908182	8.26535259265327	0.698366809499052	0.403333014647759	0.803832840439858
"Predict-miR-396"	3.551540357352	8.25074208976962	0.698364823923617	0.403333683155991	0.803832840439858
"Predict-miR-420"	3.5515350907622	8.21634866937664	0.698360339186131	0.403335193093953	0.803832840439858
"Predict-miR-11"	3.55153265697895	8.19975821441776	0.698358266712665	0.403335890864747	0.803832840439858
"Predict-miR-372"	3.55153044201916	8.18425184229483	0.698356380578524	0.403336525899408	0.803832840439858
"Predict-miR-122"	3.55152960480984	8.17828613666435	0.698355667658891	0.403336765929734	0.803832840439858
"Predict-miR-477"	3.55152144032527	8.1168982005595	0.698348715259289	0.403339106718853	0.803832840439858
"Predict-miR-34"	3.55151221486485	8.03990586423498	0.698340859414887	0.403341751710758	0.803832840439858
"Predict-miR-608"	3.55150920595033	8.012944721316	0.698338297210052	0.403342614387464	0.803832840439858
"Predict-miR-601"	3.55150396674588	7.96386648228463	0.698333835833925	0.403344116508466	0.803832840439858
"Predict-miR-583"	3.55150327446923	7.9571884512259	0.698333246335352	0.40334431499003	0.803832840439858
"Predict-miR-258"	3.55149532448716	7.87776618653078	0.698326476647538	0.403346594324183	0.803832840439858
"rna9559"	3.55055489634864	8.67774903884865	0.697525784156897	0.4036163175763	0.803832840439858
"Predict-miR-335"	3.54744924123293	8.17877112763836	0.694883212295865	0.404508369001585	0.803832840439858
"Predict-miR-157"	3.54591652943876	7.99419308808984	0.693579962325428	0.404949365568356	0.803832840439858
"Predict-miR-42"	3.54563712138955	8.40641152653531	0.69334244997534	0.405029811112252	0.803832840439858
"Predict-miR-287"	3.54414290281819	9.19205660144877	0.692072625005347	0.405460297591269	0.803832840439858
"Predict-miR-91"	3.54412314177985	8.00963906059398	0.692055835454842	0.405465993933789	0.803832840439858
"Predict-miR-577"	3.54211319073081	8.36788698230284	0.690348652885284	0.406045816265192	0.803832840439858
"Predict-miR-502"	3.54197225439198	8.48757844042982	0.690228985869644	0.406086505057031	0.803832840439858
"Predict-miR-101"	3.54129557155946	8.48791799616583	0.689654496217873	0.406281924214085	0.803832840439858
"Predict-miR-110"	3.54047278333052	9.05418476358546	0.688956126751058	0.406519667780201	0.803832840439858
"Predict-miR-117"	3.54012827200042	8.03399555084624	0.688663763439855	0.406619256479023	0.803832840439858
"Predict-miR-403"	3.53985047469647	8.15905334805291	0.688428038310573	0.406699578321078	0.803832840439858
"Predict-miR-595"	3.53862549128384	9.03523188013504	0.687388817678326	0.407053963168268	0.803832840439858
"Predict-miR-538"	-1.32868337523134	9.2363806286478	0.686932887025268	0.407209582870161	0.803832840439858
"Predict-miR-450"	3.53708446843176	8.36096832390371	0.686082039762535	0.407500229888766	0.803832840439858
"Predict-miR-318"	3.53680749464492	8.38931844763548	0.685847233469014	0.407580492560045	0.803832840439858
"Predict-miR-334"	3.53565286806143	8.99603621291798	0.684868607533428	0.407915261018259	0.803832840439858
"Predict-miR-234"	3.53461019015778	8.88673962454618	0.683985165602403	0.408217815206901	0.803832840439858
"Predict-miR-124"	3.53430637287748	7.84621925674338	0.683727800334014	0.408306017519962	0.803832840439858
"Predict-miR-194"	3.53311482012292	8.3071952701806	0.682718662974386	0.408652131423813	0.803832840439858
"Predict-miR-6"	3.53216310354691	8.9221147156059	0.681912912584588	0.408928796868612	0.803832840439858
"Predict-miR-327"	3.53195514752907	9.0042523719727	0.681736882728989	0.408989275725876	0.803832840439858
"Predict-miR-41"	3.53189496507438	10.1897174483946	0.681685941820836	0.409006780024531	0.803832840439858
"rna34928"	3.53098958848664	8.26125668934063	0.680919708551663	0.409270205622471	0.803832840439858
"Predict-miR-190"	3.53054138540909	8.49926054458513	0.680540467493039	0.409400678214093	0.803832840439858
"Predict-miR-551"	3.53002536270603	8.24256501532166	0.680103907137802	0.409550946373065	0.803832840439858
"rna15527"	3.52785077424629	9.72986097162187	0.678264952999671	0.410184822270379	0.803832840439858
"Predict-miR-405"	3.52733933432566	8.86516431685362	0.677832631473894	0.410334050173639	0.803832840439858
"Predict-miR-581"	3.52719353209962	7.84895581777585	0.677709397085102	0.41037660260505	0.803832840439858
"Predict-miR-173"	3.52586520608422	8.97528782827614	0.676586932573539	0.410764484971045	0.803832840439858
"Predict-miR-77"	3.5255021704993	8.31179423787962	0.676280240517997	0.410870560285522	0.803832840439858
"Predict-miR-159"	3.52340423547824	9.48025569034	0.674508588636858	0.411484110114085	0.803832840439858
"rna18860"	3.52292026090499	8.54074603229351	0.674100049629288	0.411625784816851	0.803832840439858
"Predict-miR-447"	3.5212061734516	7.98977338218814	0.672653629525398	0.412127958101951	0.803832840439858
"Predict-miR-564"	3.51877279285573	9.74596886338653	0.670601574704211	0.412841949333592	0.803832840439858
"Predict-miR-593"	3.51859026031917	8.18188187644513	0.670447709393001	0.412895558720315	0.803832840439858
"Predict-miR-230"	-1.20772843203016	8.82600566427128	0.670163463462028	0.412994622044694	0.803832840439858
"rna2228"	0.805778491529644	11.2679048949464	0.668300603888994	0.413644721947977	0.803832840439858
"Predict-miR-498"	3.51526249209313	8.84118944727881	0.667644125530234	0.4138741797858	0.803832840439858
"Predict-miR-395"	3.51419723643213	8.84697954406906	0.666747288454408	0.414187954057571	0.803832840439858
"Predict-miR-336"	3.5115614663132	8.33334522400614	0.664529534867999	0.414965386864395	0.803832840439858
"Predict-miR-113"	3.51131684285732	8.90252197156267	0.66432380092237	0.415037616276113	0.803832840439858
"rna69774"	3.5100246739127	7.76411619977462	0.663237321659091	0.415419368154667	0.803832840439858
"Predict-miR-463"	3.51000911286902	7.76108248004421	0.663224240360542	0.415423967646501	0.803832840439858
"Predict-miR-363"	3.50947160347211	8.79354443418063	0.662772425916199	0.415582875627514	0.803832840439858
"Predict-miR-205"	3.50847159747673	8.25016734276288	0.661932055556393	0.415878682568438	0.803832840439858
"Predict-miR-509"	3.50577814283647	8.32894308880511	0.659669897166259	0.416676506172515	0.803832840439858
"Predict-miR-443"	3.50519067057714	7.85849158200692	0.659176752803491	0.416850730999841	0.803832840439858
"Predict-miR-626"	3.50205624864459	8.41626690384792	0.656547171413326	0.417781574624408	0.803832840439858
"Predict-miR-343"	1.23116267857104	9.16218101501375	0.656513428828546	0.417793539199594	0.803832840439858
"Predict-miR-484"	3.49896177484585	8.40989304691851	0.653953684493754	0.418702670811403	0.803832840439858
"Predict-miR-221"	-0.986834069511603	9.43476014912868	0.653212939501149	0.41896630669828	0.803832840439858
"Predict-miR-85"	3.49730550857897	8.2617766648036	0.652566618111514	0.419196538581954	0.803832840439858
"rna20252"	0.560112233746649	13.1449065868966	0.652489661280967	0.419223964610993	0.803832840439858
"Predict-miR-579"	3.49354338947152	8.70842508470495	0.649418708773855	0.420320583001141	0.803832840439858
"Predict-miR-28"	3.49038951778748	8.43466299545762	0.646782675954677	0.421265310837232	0.803832840439858
"Predict-miR-614"	3.48859522564577	8.23255810342049	0.645284186614731	0.421803768999597	0.803832840439858
"Predict-miR-337"	3.48839195656816	8.15558268261738	0.645114482710317	0.421864814223475	0.803832840439858
"Predict-miR-92"	3.48749673077845	8.81881994884398	0.644367215252172	0.42213377557266	0.803832840439858
"Predict-miR-305"	3.4863244697534	8.63444162009376	0.643389026326576	0.422486239491249	0.803832840439858
"Predict-miR-457"	3.48455329033791	7.82174816495871	0.641911775503638	0.423019362302925	0.803832840439858
"Predict-miR-617"	3.4815475557264	7.93190382184165	0.639406783637698	0.423925691049193	0.803832840439858
"Predict-miR-74"	3.478220006832	8.03406668685739	0.636636439220892	0.4249314222025	0.803832840439858
"Predict-miR-497"	3.47521502973158	8.90874126640152	0.634137226854051	0.42584180061539	0.803832840439858
"Predict-miR-212"	3.47388807893995	8.21869757277845	0.633034392608423	0.426244458531783	0.803832840439858
"Predict-miR-377"	3.46940150791001	8.10966882151193	0.629309122492248	0.427608845568077	0.803832840439858
"rna12554"	3.46484264316096	8.36518894003644	0.625529425286597	0.428999907758302	0.803832840439858
"Predict-miR-464"	3.45963476870235	8.02054159890914	0.621218559988028	0.430594821643689	0.803832840439858
"Predict-miR-364"	-1.2052279966748	9.24753365436051	0.619220061167486	0.431337263803272	0.803832840439858
"Predict-miR-156"	3.45198834750162	8.29047675131669	0.614902557155586	0.432947859442173	0.803832840439858
"Predict-miR-454"	3.44642677602784	8.17788535015074	0.610318682199757	0.434667845896384	0.803832840439858
"Predict-miR-210"	3.44460579416479	8.11015233983805	0.608819657192125	0.435232576481683	0.803832840439858
"Predict-miR-332"	3.44414532283861	8.60202604329664	0.608440742707161	0.435375502785858	0.803832840439858
"Predict-miR-216"	3.44138459589559	8.13157159331142	0.606170201398506	0.436233451758244	0.803832840439858
"Predict-miR-129"	-0.900272764128356	10.6589031607194	0.58793142814905	0.443220139238688	0.813806326319979
"Predict-miR-375"	3.41664843363167	7.87769564624724	0.585919369822668	0.444001425503086	0.813806326319979
"Predict-miR-557"	3.40926879742316	8.39987943434986	0.579910435343624	0.44634742955726	0.815941994243562
"rna54466"	0.562652738190168	13.2198224693218	0.569489342618908	0.450461909388635	0.81940393618901
"Predict-miR-139"	3.39595780129529	8.1388722143488	0.569109803468853	0.450612873736359	0.81940393618901
"Predict-miR-48"	3.39168814713839	8.01831174123971	0.5656557402848	0.451990392156459	0.819421496874242
"rna9999"	-1.12597003282797	8.91963743880327	0.563149023687082	0.452994228373315	0.819421496874242
"Predict-miR-599"	3.38350847393409	7.81991151237048	0.559052631403139	0.454642203770954	0.82025525536744
"Predict-miR-288"	0.509261516725296	11.5818451357992	0.549382051082036	0.458570297685735	0.823708398478932
"Predict-miR-584"	3.37036084227582	7.93545615669858	0.548477927400214	0.458940279905049	0.823708398478932
"rna69973"	1.58710368625519	8.33819959924235	0.512950683570331	0.473864310009327	0.848290772581463
"Predict-miR-439"	1.06192952258032	9.84266059903139	0.508508211398849	0.475785353989476	0.849528887872682
"Predict-miR-150"	1.06697161768238	9.08604765716523	0.500553754617592	0.479256908231252	0.853521968009781
"rna44066"	0.404385233967397	16.7748748989471	0.486863838764693	0.48532961942156	0.86211508231439
"Predict-miR-104"	-0.924752492559135	10.3215060768955	0.47385290741455	0.491219970564127	0.870341024768748
"Predict-miR-410"	1.03458282177824	10.1063276362687	0.464363607661557	0.495591665277456	0.875841024825376
"Predict-miR-244"	1.06141602064522	12.6752102152864	0.459840074830449	0.49769872389132	0.877320964818628
"rna46361"	1.03304530409864	9.09204776197801	0.452680809895554	0.501064622155352	0.881006752949996
"Predict-miR-140"	-0.727418398098998	10.3536489908152	0.43215239775048	0.510934685103411	0.896080881742277
"rna48654"	0.452414365643702	13.624955637025	0.409244076571678	0.522353431758703	0.913787902139909
"Predict-miR-75"	-0.773800708545104	9.47708005216057	0.402088797604758	0.526012481773988	0.917865214408651
"Predict-miR-407"	0.964594838801934	10.1022961052148	0.395261410041831	0.529546665434955	0.921704649409455
"Predict-miR-543"	0.687525626946795	9.26277995570464	0.385510320991944	0.534668859565598	0.928281864220673
"Predict-miR-236"	-1.34621236057978	8.17776070086664	0.378201661185443	0.53856725161995	0.928865222570742
"Predict-miR-567"	-1.41695450622943	7.96991623759292	0.376184749932618	0.539652199721961	0.928865222570742
"Predict-miR-379"	-1.21835249903013	9.83491003105417	0.371924429701959	0.541957153261293	0.928865222570742
"rna29819"	-1.21490714176902	9.53040729337849	0.371598455394023	0.542134259682527	0.928865222570742
"rna51239"	-1.20945113637558	9.37415454600787	0.371066796001617	0.5424233464301	0.928865222570742
"Predict-miR-594"	-1.18426577744386	8.21219721956944	0.367926532681581	0.544136660401295	0.928865222570742
"Predict-miR-155"	-1.18563911950111	8.07310372201381	0.365946158720892	0.545222293816098	0.928865222570742
"Predict-miR-339"	-1.18631792536502	9.20156910547839	0.36497030982287	0.545758727009727	0.928865222570742
"Predict-miR-384"	-1.19108302986526	8.09372508779263	0.358176595573784	0.549520655633218	0.929295263517277
"Predict-miR-381"	-1.19134129767521	8.56324781714602	0.357811237683563	0.549724337965859	0.929295263517277
"Predict-miR-534"	-1.19327032705985	7.94034578270987	0.355091753442972	0.551244867793623	0.929295263517277
"Predict-miR-546"	-1.19418715619802	8.67961928743108	0.35380508484949	0.551967027040587	0.929295263517277
"Predict-miR-452"	-1.19516350430111	9.14658592944097	0.352439053694003	0.552735677721564	0.929295263517277
"Predict-miR-68"	-1.16079069345438	8.10416154127467	0.34797771137328	0.555260136991823	0.9312736763625
"Predict-miR-292"	-0.592394991370851	9.77259070953632	0.325877224191707	0.568096872138362	0.950496219485735
"rna34406"	0.888240438730287	8.72336417449406	0.316300376084317	0.57383951242577	0.957521638406623
"rna30133"	-0.567293491020196	10.3095483987365	0.314213753851037	0.575105895273694	0.957521638406623
"Predict-miR-160"	-1.22565336048198	7.85663465256246	0.312004127010622	0.57645296899733	0.957521638406623
"rna55111"	-0.461121351509642	13.2147327657316	0.29975759156779	0.584034428988181	0.966277219843189
"Predict-miR-106"	-0.77632420223025	10.0620558254681	0.298982816229033	0.58452080737258	0.966277219843189
"Predict-miR-369"	-0.487325757914334	12.547926138088	0.292816815557284	0.588421077488614	0.970403256669768
"rna57201"	-0.751183447561446	8.58773617222539	0.289604335227967	0.590474193158347	0.97147063683909
"rna848"	0.393787463649955	11.7377319978968	0.284423694969551	0.593816320841647	0.974648640621325
"Predict-miR-520"	-0.800912943826538	9.86424645046652	0.281369121459168	0.595805247087098	0.975595795585746
"rna41499"	-0.296978734635643	12.3857470109457	0.277003803907741	0.598671788240472	0.977972117433017
"Predict-miR-8"	-0.747236103370813	8.97547443093246	0.273277202463445	0.601141821256244	0.979691034169964
"Predict-miR-440"	-0.704669676564092	10.0014613845614	0.264035117199029	0.607361429318279	0.985270920815607
"rna44578"	-0.679168711998779	9.08145550192164	0.260558555740781	0.609736679019923	0.985270920815607
"Predict-miR-90"	-1.03912492822821	8.0372123866844	0.252983527073233	0.614982075208827	0.985270920815607
"Predict-miR-231"	-0.657043685971621	8.86177546687586	0.250641837684952	0.61662350201015	0.985270920815607
"Predict-miR-356"	-0.669915641669864	9.23844180653295	0.249926635724682	0.617126740225077	0.985270920815607
"rna11052"	0.813826126473384	8.18073902577238	0.249825571632369	0.61719792460054	0.985270920815607
"Predict-miR-295"	-0.674248947742849	8.8834592668901	0.249562660589669	0.617383190021925	0.985270920815607
"Predict-miR-21"	-0.701389074986072	8.45670288435213	0.24589624504957	0.619979596515126	0.985270920815607
"rna20046"	-0.710598838290998	8.88936493406554	0.245181299010827	0.62048869916741	0.985270920815607
"rna31044"	0.433386759868296	11.0410265117269	0.244654342367895	0.620864529303856	0.985270920815607
"rna52801"	0.803181262009233	8.80242464821676	0.24388224588834	0.621416106194866	0.985270920815607
"Predict-miR-341"	-0.713472116393355	9.1712077610241	0.243518961877184	0.621676007924175	0.985270920815607
"Predict-miR-483"	-0.662312087658212	9.25806404806385	0.226818343380621	0.633893080522407	0.999579910238069
"Predict-miR-422"	0.717812763792157	9.12643149478958	0.222891880733698	0.636845229804032	0.999579910238069
"Predict-miR-239"	-0.63968827145729	9.63838728847048	0.22040236675231	0.63873350599549	0.999579910238069
"Predict-miR-225"	-0.553914595785371	10.5203200424509	0.218529685809242	0.640162514828365	0.999579910238069
"Predict-miR-472"	-0.514041839039635	9.64571662452403	0.217466125303096	0.640977423311296	0.999579910238069
"Predict-miR-385"	0.547377563918675	9.69990889849673	0.213131764055026	0.644323755288479	0.999579910238069
"Predict-miR-361"	-0.635394250483647	9.96621943013775	0.212747030360523	0.644622777278392	0.999579910238069
"rna25395"	0.333324070060089	13.1460907446358	0.212472556404983	0.644836303871292	0.999579910238069
"rna10649"	-0.338963924249533	14.6307786293945	0.21239153002921	0.644899370183536	0.999579910238069
"rna60849"	-0.371071081041149	11.6841358969496	0.212043727063833	0.645170245971315	0.999579910238069
"rna55116"	0.34496867969895	13.0926682152402	0.192276583690386	0.661028552795975	1
"Predict-miR-226"	-1.01538856146039	8.06342036742586	0.189114602432927	0.663654549991974	1
"Predict-miR-425"	0.456321674001758	10.3684733640161	0.188630182929629	0.664059157956506	1
"Predict-miR-168"	0.918456456273121	9.28794537738811	0.188547579617925	0.664128213401891	1
"rna41818"	0.655973510007863	8.89026424780761	0.180688261552637	0.670782425473625	1
"Predict-miR-37"	0.662746445566586	9.87064914950797	0.18029659531293	0.671118475047962	1
"Predict-miR-389"	0.641160911432659	9.73971863399068	0.169844793811206	0.680249781160049	1
"Predict-miR-222"	0.347767239425881	14.1310885108698	0.161770804378612	0.687531385885898	1
"Predict-miR-417"	0.412914524754748	9.50481473892253	0.160881954500361	0.688345817589329	1
"rna10531"	0.617062523117698	9.20479482306239	0.15317439556496	0.695520064020436	1
"Predict-miR-18"	0.616235571161612	8.96626216967296	0.152623214654033	0.696041019763815	1
"rna39160"	0.734311862128682	8.59711509227398	0.151686056913693	0.696929281142754	1
"Predict-miR-430"	0.469192655948707	9.42146255419778	0.144812283806182	0.7035430574952	1
"Predict-miR-39"	0.600508275819212	8.53140023471492	0.131880443439576	0.716490243114215	1
"rna54456"	0.594243006610737	9.34373161135416	0.124975995932672	0.723699055856664	1
"Predict-miR-135"	-0.49291480300722	9.05910585297082	0.113440362120276	0.736260821326851	1
"rna44065"	0.373810404013096	9.48578741228696	0.0998923746219589	0.751958826937234	1
"Predict-miR-559"	0.174912957742076	14.2269457051603	0.0809222269910848	0.776051506018386	1
"rna30134"	-0.169632596427617	11.9048612823613	0.0613749957633836	0.804335755514057	1
"Predict-miR-121"	0.28176734715228	10.432316482062	0.0551916245099768	0.814263858036841	1
"rna46983"	-0.251332483303011	8.98565305673993	0.0522762437170492	0.819148742442632	1
"Predict-miR-81"	-0.291909436640858	9.11789887303037	0.0502786106731836	0.82257917777311	1
"Predict-miR-474"	-0.287756222108802	8.74485672284428	0.0493296917535346	0.824233791643358	1
"Predict-miR-183"	-0.42752625191294	8.23093459935557	0.0481357180345192	0.82633960957977	1
"Predict-miR-268"	0.323468089840383	9.20964066358724	0.0399512649504015	0.841575898750343	1
"Predict-miR-348"	0.320430237733976	8.8185591654878	0.0399202986325946	0.841636495119219	1
"Predict-miR-270"	0.244647449353005	9.50627252956206	0.0377016416534595	0.846043472469835	1
"Predict-miR-301"	-0.247874750678128	9.28639258199586	0.0347547385554741	0.852110525830762	1
"Predict-miR-232"	0.297490583799878	9.29758285952353	0.0343415667190134	0.852982148088907	1
"Predict-miR-83"	-0.176017806090454	10.8717533044986	0.0312578726363757	0.859666305142999	1
"Predict-miR-233"	0.263953137104643	9.41717947670357	0.0295666433033333	0.86347720155659	1
"Predict-miR-203"	-0.304578594611437	9.09478682521643	0.0290410738080222	0.864684234189452	1
"Predict-miR-105"	0.283332184536967	9.62749058207378	0.027892507034462	0.867361787335962	1
"rna33835"	-0.294627972621959	9.47656991282232	0.0275675783893181	0.868129507932946	1
"Predict-miR-431"	0.114164546469739	10.996428880749	0.0267625933234346	0.870051739310171	1
"rna31043"	0.113477407416744	11.5664869235503	0.0261569313405374	0.871517654970302	1
"Predict-miR-585"	-0.282825520271423	9.8469826107126	0.0258439530597823	0.872282000933174	1
"rna54457"	-0.121594334478546	13.1856587656258	0.0251402437653923	0.874018104149864	1
"Predict-miR-264"	-0.274088202843093	7.91367463937715	0.024586348713366	0.875402199634565	1
"Predict-miR-325"	-0.270203551454195	8.95409528647473	0.0240325789082885	0.87680204503035	1
"Predict-miR-320"	-0.268956097686967	9.23533499679827	0.0232207079237767	0.878884530092413	1
"rna54463"	0.109256041022938	13.2540219390037	0.0225735038218247	0.880571471501303	1
"Predict-miR-475"	-0.262276974217037	8.78491103897303	0.0224928202707915	0.880783498498429	1
"Predict-miR-342"	-0.259901456329981	9.14619278783346	0.0222316525813167	0.881472496363956	1
"Predict-miR-455"	-0.247578452188436	8.78985843188788	0.0208607905720086	0.88515883561866	1
"rna40590"	0.13073386669564	10.5120068945259	0.0207838509864597	0.885369346243536	1
"rna19198"	-0.245679183948271	9.24134423911573	0.0200849718739011	0.887300024383116	1
"rna19202"	0.0955987636925026	13.0613914964638	0.0195601679732142	0.888772446610834	1
"Predict-miR-596"	-0.244035837918939	9.11090639776035	0.0181950884780289	0.892699501514789	1
"Predict-miR-358"	-0.232376743770533	9.04389716587609	0.0179927593042049	0.893294169921945	1
"rna70267"	0.0968803795352905	14.7219008422959	0.0174432277751109	0.894926700069303	1
"Predict-miR-57"	0.0976657071269372	12.8186309137668	0.016691230333123	0.89720371287816	1
"Predict-miR-441"	0.20870587702466	9.91197363359268	0.0157993495697362	0.899972992909368	1
"rna11058"	-0.276626592737715	8.36653747536515	0.0154465666350401	0.901090243290414	1
"Predict-miR-186"	-0.212577106464231	8.47799576453789	0.0152813038271287	0.90161807965828	1
"Predict-miR-357"	-0.211252726838404	9.14900753825055	0.0150842479874527	0.902251262585069	1
"Predict-miR-611"	-0.127483094741872	10.2616902536658	0.0142324002519771	0.905037981492262	1
"Predict-miR-319"	-0.19933244507895	9.23237411195862	0.0125105348103158	0.910941943868232	1
"Predict-miR-480"	0.18628130890953	8.64118730871282	0.0123606863350112	0.911474702464639	1
"rna63728"	-0.150040120537203	11.7005433356215	0.0108168238343325	0.91716620546122	1
"Predict-miR-569"	0.114731867816503	9.79995630201463	0.0108105557292699	0.91719012271003	1
"Predict-miR-97"	-0.117722731858389	9.75613516381396	0.0107495517181846	0.917423263129418	1
"Predict-miR-351"	0.0949707816496392	9.07358579562581	0.00854455814555521	0.926351018943343	1
"rna21373"	-0.0637220343939152	12.4273811584204	0.00842680231507131	0.926858838171293	1
"Predict-miR-518"	-0.0611096654888298	10.6497763147839	0.00416806769163358	0.948523876723643	1
"rna54469"	-0.0487947542031159	13.1925964150171	0.00396379619460419	0.949799402489087	1
"rna40085"	-0.063470686643249	10.1741052014231	0.00356009840462335	0.952421205368739	1
"rna6960"	0.0425644745702678	11.7561090704988	0.00287007486358704	0.95727530502533	1
"Predict-miR-134"	-0.120537815605784	8.72041557931517	0.00275868989787753	0.958111784435498	1
"Predict-miR-229"	-0.0852161888685329	8.65977688227527	0.00243279018651243	0.960661633111741	1
"Predict-miR-612"	0.0487211356694421	10.3456910410862	0.00198673104713443	0.964447854432687	1
"rna19197"	0.0313211798363271	13.0602794318771	0.00119389331272046	0.972436370015455	1
"Predict-miR-453"	-0.0290221649754144	9.25100675403269	0.000443580439720037	0.983196716739027	1
"rna31047"	0.0156019257115649	10.3293225314708	0.000275384447908422	0.98675994363494	1
"Predict-miR-269"	0.0188944160548356	9.17822116233357	0.000255413698731388	0.98724901697796	1
"rna66916"	0.0129960421352011	11.7497090514342	0.000147704038550245	0.990303264365896	1
"Predict-miR-119"	0	8.48813419938108	0	1	1
"Predict-miR-197"	0	8.17420033215292	0	1	1
"Predict-miR-290"	0	8.87867037398784	0	1	1
"Predict-miR-35"	0	8.36598616257092	0	1	1
"Predict-miR-459"	0	8.3683043177155	0	1	1
"Predict-miR-508"	0	7.9906370492997	0	1	1
"Predict-miR-600"	0	8.33085337010225	0	1	1
"Predict-miR-7"	0	8.98363983060416	0	1	1
"rna34405"	0	8.33814228444226	0	1	1
"rna38012"	0	8.35991745508123	0	1	1
"Predict-miR-123"	0	8.11153597603091	0	1	1
"Predict-miR-78"	0	8.1409953857343	0	1	1
"rna27273"	0	7.87702541812518	0	1	1
"rna39357"	0	8.79238484301414	0	1	1
"Predict-miR-531"	0	7.84853896791336	0	1	1
"Predict-miR-553"	0	7.82887265729034	0	1	1
"Predict-miR-606"	0	8.72850840680299	0	1	1
"Predict-miR-82"	0	8.2909382940745	0	1	1
"rna37802"	0	8.23377221864856	0	1	1
"rna46984"	0	7.92066350630791	0	1	1
"Predict-miR-171"	0	9.08089080163828	0	1	1
"Predict-miR-178"	0	7.98520989494429	0	1	1
"Predict-miR-241"	0	8.38787718981506	0	1	1
"Predict-miR-266"	0	8.13960898545537	0	1	1
"Predict-miR-277"	0	9.16489854696745	0	1	1
"Predict-miR-317"	0	7.76436023592968	0	1	1
"Predict-miR-326"	0	8.93918098402327	0	1	1
"Predict-miR-496"	0	8.17711667159242	0	1	1
"rna11484"	0	7.76178388046727	0	1	1
"rna15526"	0	8.11462466574028	0	1	1
"rna48653"	0	9.34315043568135	0	1	1
"Predict-miR-114"	0	8.5436211331007	0	1	1
"Predict-miR-131"	0	8.65231253741677	0	1	1
"Predict-miR-133"	0	7.98863067888942	0	1	1
"Predict-miR-142"	0	8.19426413268608	0	1	1
"Predict-miR-15"	0	8.04437092693266	0	1	1
"Predict-miR-209"	0	7.82488495424953	0	1	1
"Predict-miR-217"	0	8.24705677735465	0	1	1
"Predict-miR-307"	0	8.16756120365871	0	1	1
"Predict-miR-397"	0	9.47607951943754	0	1	1
"Predict-miR-500"	0	8.30350206797548	0	1	1
"Predict-miR-523"	0	8.76466404709007	0	1	1
"Predict-miR-55"	0	7.96228813184194	0	1	1
"Predict-miR-550"	0	8.13826341283053	0	1	1
"Predict-miR-552"	0	7.99026461894876	0	1	1
"Predict-miR-625"	0	9.02992003969963	0	1	1
"Predict-miR-67"	0	7.95784231109425	0	1	1
"rna19535"	0	8.69964691734023	0	1	1
"rna44409"	0	8.06635018844755	0	1	1
"rna50694"	0	7.84829187730379	0	1	1
"rna6961"	0	8.36202812572678	0	1	1
"Predict-miR-120"	0	8.53725347007962	0	1	1
"Predict-miR-423"	0	8.0400132059534	0	1	1
"rna37801"	0	7.96618345740545	0	1	1
"Predict-miR-12"	0	8.56641582784659	0	1	1
"Predict-miR-13"	0	8.75760431973649	0	1	1
"Predict-miR-141"	0	7.90412895194068	0	1	1
"Predict-miR-185"	0	8.80815921165808	0	1	1
"Predict-miR-19"	0	8.58784750849343	0	1	1
"Predict-miR-191"	0	8.12519570262024	0	1	1
"Predict-miR-218"	0	8.28802082847187	0	1	1
"Predict-miR-220"	0	8.45651002025239	0	1	1
"Predict-miR-256"	0	8.03761250415586	0	1	1
"Predict-miR-257"	0	8.37893115818652	0	1	1
"Predict-miR-267"	0	8.65065054542607	0	1	1
"Predict-miR-285"	0	8.68509886773635	0	1	1
"Predict-miR-308"	0	8.20162375587807	0	1	1
"Predict-miR-310"	0	8.60079640502422	0	1	1
"Predict-miR-330"	0	8.01255479408016	0	1	1
"Predict-miR-360"	0	7.84159848406661	0	1	1
"Predict-miR-382"	0	7.84882674205982	0	1	1
"Predict-miR-383"	0	7.98720374187236	0	1	1
"Predict-miR-388"	0	9.3274632917553	0	1	1
"Predict-miR-414"	0	8.12891795781309	0	1	1
"Predict-miR-429"	0	7.79085912305872	0	1	1
"Predict-miR-46"	0	8.19209768949801	0	1	1
"Predict-miR-528"	0	7.85745859542837	0	1	1
"Predict-miR-586"	0	7.98678758202419	0	1	1
"Predict-miR-604"	0	7.79006261915374	0	1	1
"Predict-miR-615"	0	8.00436246573449	0	1	1
"Predict-miR-630"	0	8.57215146914719	0	1	1
"Predict-miR-84"	0	8.17997129106796	0	1	1
"Predict-miR-95"	0	7.95587645426544	0	1	1
"rna11800"	0	7.78935512496392	0	1	1
"rna35738"	0	8.28950593087874	0	1	1
"rna51238"	0	7.82000452722587	0	1	1
"rna57202"	0	7.79107845191255	0	1	1
"rna61260"	0	8.21412192663205	0	1	1
"rna63088"	0	8.19862737167404	0	1	1
"rna9028"	0	7.92849416487513	0	1	1
"Predict-miR-108"	0	8.02841726071589	0	1	1
"Predict-miR-136"	0	7.79032755701742	0	1	1
"Predict-miR-153"	0	8.5068171064924	0	1	1
"Predict-miR-192"	0	8.2169603059316	0	1	1
"Predict-miR-202"	0	7.75701835372071	0	1	1
"Predict-miR-213"	0	8.17122573937028	0	1	1
"Predict-miR-300"	0	7.75948521824825	0	1	1
"Predict-miR-321"	0	7.90380735784794	0	1	1
"Predict-miR-322"	0	7.92137819536356	0	1	1
"Predict-miR-33"	0	7.90463644198025	0	1	1
"Predict-miR-333"	0	8.07428174374096	0	1	1
"Predict-miR-392"	0	8.1726538280074	0	1	1
"Predict-miR-393"	0	7.81894516893771	0	1	1
"Predict-miR-408"	0	7.89796799874375	0	1	1
"Predict-miR-409"	0	8.05978441657104	0	1	1
"Predict-miR-442"	0	8.46857989577417	0	1	1
"Predict-miR-460"	0	8.0081306695197	0	1	1
"Predict-miR-530"	0	8.38189715419771	0	1	1
"Predict-miR-532"	0	7.82057804500805	0	1	1
"Predict-miR-619"	0	7.75966252141236	0	1	1
"rna11272"	0	8.06113085223675	0	1	1
"rna34998"	0	7.78913933372262	0	1	1
"rna38812"	0	7.75731242034323	0	1	1
"rna9093"	0	8.57918591446487	0	1	1
"Predict-miR-100"	0	8.10438464727125	0	1	1
"Predict-miR-112"	0	7.78677455391376	0	1	1
"Predict-miR-164"	0	8.02864672350456	0	1	1
"Predict-miR-170"	0	8.43439637972942	0	1	1
"Predict-miR-187"	0	7.89950862956653	0	1	1
"Predict-miR-2"	0	8.0721339273452	0	1	1
"Predict-miR-23"	0	7.92666770659124	0	1	1
"Predict-miR-26"	0	7.81572160887228	0	1	1
"Predict-miR-272"	0	8.65897170990676	0	1	1
"Predict-miR-316"	0	7.81741565715183	0	1	1
"Predict-miR-331"	0	7.78887641616848	0	1	1
"Predict-miR-36"	0	7.78608387917059	0	1	1
"Predict-miR-371"	0	8.05411131806543	0	1	1
"Predict-miR-434"	0	7.75472430152151	0	1	1
"Predict-miR-507"	0	7.84527138635924	0	1	1
"Predict-miR-519"	0	8.14960470954338	0	1	1
"Predict-miR-624"	0	7.81676970776838	0	1	1
"Predict-miR-629"	0	7.78586509587188	0	1	1
"Predict-miR-86"	0	8.05121961084563	0	1	1
"Predict-miR-93"	0	7.89782772870843	0	1	1
"Predict-miR-94"	0	7.97912037611263	0	1	1
"rna34589"	0	8.94291903570432	0	1	1
"rna38809"	0	7.78377407993715	0	1	1
"rna799"	0	7.84545715006563	0	1	1
"Predict-miR-193"	0	7.78537206825331	0	1	1
"Predict-miR-238"	0	7.95152939290969	0	1	1
"Predict-miR-250"	0	7.81298636314671	0	1	1
"Predict-miR-32"	0	8.04922214039336	0	1	1
"Predict-miR-324"	0	8.05483746652429	0	1	1
"Predict-miR-44"	0	8.1014955968084	0	1	1
"Predict-miR-47"	0	7.8945984550988	0	1	1
"Predict-miR-491"	0	7.95261509982316	0	1	1
"Predict-miR-50"	0	7.90120876225306	0	1	1
"Predict-miR-512"	0	7.87164917792947	0	1	1
"Predict-miR-598"	0	7.9811309993434	0	1	1
"Predict-miR-628"	0	7.81529220500055	0	1	1
"Predict-miR-632"	0	8.17198929522944	0	1	1
"rna27274"	0	8.08210343939581	0	1	1
"rna62714"	0	7.78456141992373	0	1	1
"Predict-miR-145"	0	7.75828128901194	0	1	1
"Predict-miR-199"	0	7.90217727336594	0	1	1
"Predict-miR-4"	0	7.75723087868409	0	1	1
"Predict-miR-556"	0	7.84622380878692	0	1	1
"Predict-miR-17"	0	7.75852390214921	0	1	1
"Predict-miR-196"	0	7.78808431441778	0	1	1
"Predict-miR-376"	0	7.92892932281108	0	1	1
"Predict-miR-482"	0	7.87632652991522	0	1	1
"Predict-miR-602"	0	7.78905283859549	0	1	1
"Predict-miR-109"	0	7.78612395573406	0	1	1
"Predict-miR-144"	0	7.75746873328363	0	1	1
"Predict-miR-184"	0	7.95458517039464	0	1	1
"Predict-miR-219"	0	7.78830756321825	0	1	1
"Predict-miR-537"	0	7.81521322073461	0	1	1
"Predict-miR-618"	0	7.92740616265619	0	1	1
"Predict-miR-622"	0	7.78583138753326	0	1	1
