"logFC"	"logCPM"	"LR"	"PValue"	"FDR"
"Afl-milR-3"	3.10734676937219	18.9910421561875	14.5645937395745	0.000135435574767028	0.00880331235985685
"Afl-milR-11"	-3.36673469960457	16.0647183578723	11.9894926655478	0.000535013531301425	0.0173879397672963
"Afl-milR-24"	-6.8303088169937	13.3347328350753	10.5185426814339	0.0011818264696215	0.0256062401751326
"Afl-milR-103"	-6.23667307156407	12.3796948567904	6.85855556129463	0.00882178338125963	0.0891622088174035
"Afl-milR-58"	-3.00213408632103	15.7881677096301	6.7438647214216	0.00940706185108839	0.0891622088174035
"Afl-milR-107"	-5.55648422703548	13.0413193539921	6.71833735867484	0.00954265475455252	0.0891622088174035
"Afl-milR-7"	-6.29737274749794	12.6117935487958	6.70726582367267	0.00960208402648961	0.0891622088174035
"Afl-milR-132"	-5.51847393594653	12.9252142184771	5.37086124974918	0.0204758650138055	0.16636640323717
"Afl-milR-50"	-5.13912671170194	12.3443513505172	4.4667656392792	0.0345603538093969	0.249602555290089
"Afl-milR-9"	2.48095034506713	15.8429076591393	3.09841917228479	0.0783683590545705	0.474527972791528
"Afl-milR-33"	2.45070217968337	15.7614538847118	3.05872349443624	0.0803047338570279	0.474527972791528
"Afl-milR-14"	-2.85037547806034	12.5457979139751	1.89797000676124	0.168305715960921	0.86608891875983
"Afl-milR-19"	3.1014751708395	16.416749236667	1.7798666435486	0.182165702693631	0.86608891875983
"Afl-milR-53"	-3.29237338909297	12.376831062959	1.74471724699156	0.186542228655963	0.86608891875983
"Afl-milR-122"	-2.07631157618114	12.9724261196938	1.48609810548333	0.222822849068327	0.965565679296083
"Afl-milR-51"	-2.12266362203422	12.5384951220356	1.09206570522548	0.296013968222286	1
"Afl-milR-126"	3.02104299434859	12.8566768228607	0.462866530273386	0.496287334848054	1
"Afl-milR-81"	2.22593275134975	12.5080215535293	0.201266093373789	0.653700826986597	1
"Afl-milR-49"	1.90861646605377	12.5286870026733	0.15869646682378	0.690359494298012	1
"Afl-milR-45"	1.84705617169205	12.3415328430536	0.154369779826072	0.694393933911833	1
"Afl-milR-31"	1.84705617169205	12.3415328430536	0.154369779826072	0.694393933911833	1
"Afl-milR-117"	1.84705617169205	12.3415328430536	0.154369779826072	0.694393933911833	1
"Afl-milR-78"	1.84705617169205	12.3415328430536	0.154369779826072	0.694393933911833	1
"Afl-milR-18"	1.84599132407679	12.3706425105829	0.154250617695638	0.694505966142867	1
"Afl-milR-116"	1.84468073393433	12.4062387224109	0.154103058044767	0.694644766011985	1
"Afl-milR-110"	1.84459001808716	12.4086933032311	0.154092808689749	0.694654409768885	1
"Afl-milR-62"	1.41400976752395	12.5326871905676	0.110949178638887	0.739066086431592	1
"Afl-milR-82"	1.14550987729193	12.3927529640138	0.0858264906876696	0.769551514238455	1
"Afl-milR-6"	1.14443957090773	12.3625603488486	0.0857119788255329	0.769700955404699	1
"Afl-milR-123"	1.14347251678063	12.3353019879471	0.0856083984984343	0.769836223999369	1
"Afl-milR-80"	0	12.4251911277414	0	1	1
"Afl-milR-114"	0	12.3668463311819	0	1	1
"Afl-milR-27"	0	12.3396111845518	0	1	1
"Afl-milR-131"	0	12.3684920933831	0	1	1
"Afl-milR-36"	0	12.8602149871881	0	1	1
"Afl-milR-67"	0	12.3362880778817	0	1	1
"Afl-milR-43"	0	12.3362880778817	0	1	1
"Afl-milR-40"	0	12.366201929524	0	1	1
"Afl-milR-100"	0	12.6769207175762	0	1	1
"Afl-milR-83"	0	12.341627394403	0	1	1
"Afl-milR-29"	0	12.3688672087211	0	1	1
"Afl-milR-102"	0	12.3389645415004	0	1	1
"Afl-milR-97"	0	12.3389645415004	0	1	1
"Afl-milR-37"	0	12.3389645415004	0	1	1
"Afl-milR-133"	0	12.3442772149639	0	1	1
"Afl-milR-41"	0	12.4140995376824	0	1	1
"Afl-milR-128"	0	12.4144487622879	0	1	1
"Afl-milR-87"	0	12.3402500926004	0	1	1
"Afl-milR-94"	0	12.5475514642453	0	1	1
"Afl-milR-16"	0	12.3442310393377	0	1	1
"Afl-milR-79"	0	12.3442310393377	0	1	1
"Afl-milR-20"	0	12.3444724937198	0	1	1
"Afl-milR-121"	0	12.3441849854973	0	1	1
"Afl-milR-127"	0	12.3391522738577	0	1	1
"Afl-milR-95"	0	12.3379412634506	0	1	1
"Afl-milR-76"	0	12.3379412634506	0	1	1
"Afl-milR-71"	0	12.3379412634506	0	1	1
"Afl-milR-104"	0	12.3379412634506	0	1	1
"Afl-milR-69"	0	12.3788314800978	0	1	1
"Afl-milR-48"	0	12.4121779538585	0	1	1
"Afl-milR-99"	0	12.3436149395678	0	1	1
"Afl-milR-57"	0	12.3436149395678	0	1	1
"Afl-milR-85"	0	12.3442587300675	0	1	1
"Afl-milR-42"	0	12.3442587300675	0	1	1
"Afl-milR-96"	0	12.3444351297399	0	1	1
