"logFC"	"logCPM"	"LR"	"PValue"	"FDR"
"Predict-miR-244"	7.72130275486777	12.6752102152864	86.1104097890293	1.70164724889503e-20	1.17583824898646e-17
"Predict-miR-397"	5.5958852684191	9.47607951943754	73.5769412930444	9.67887951070259e-18	3.34405287094774e-15
"Predict-miR-587"	-5.11095318980502	12.0644737669933	66.9294918368123	2.81393567153098e-16	6.48143183009302e-14
"Predict-miR-41"	4.96323889996042	10.1897174483946	65.8523841410029	4.85992111229429e-16	8.39551372148839e-14
"Predict-miR-490"	-5.36168971195561	12.0693855699734	62.1743966438908	3.14348435309905e-15	4.34429537598289e-13
"Predict-miR-379"	-5.20459226065117	9.83491003105417	61.3963593068901	4.66672644554319e-15	5.37451328978391e-13
"Predict-miR-309"	-7.30056704243925	10.2510895405668	60.5869739130475	7.03983146512259e-15	6.9493193462853e-13
"Predict-miR-232"	-5.9023817854528	9.29758285952353	53.1378000105962	3.10950715964959e-13	2.68583680914733e-11
"Predict-miR-289"	-5.64023835659471	8.91238309826627	50.960520475729	9.42425390477625e-13	7.23573272022266e-11
"Predict-miR-40"	4.83119144475534	10.0462189404975	44.7978583015231	2.18461514850325e-11	1.50956906761574e-09
"Predict-miR-313"	-5.84017243022218	9.02553142826858	41.7743063719378	1.02440790482409e-10	6.43514420212224e-09
"Predict-miR-523"	5.87150352205708	8.76466404709007	39.8767433894332	2.7050494152154e-10	1.4403472950451e-08
"Predict-miR-45"	-5.93691713726989	9.21376432874003	39.8733373763717	2.70977059849295e-10	1.4403472950451e-08
"Predict-miR-378"	-3.99146189480563	9.97189869107035	39.1747045540185	3.87528584311319e-10	1.91273036970801e-08
"Predict-miR-20"	3.33351145935244	10.3848370841291	38.8267698194758	4.63132735014363e-10	2.13349813263283e-08
"Predict-miR-130"	-2.64028421096507	10.5486592965734	38.4176719095923	5.71128709780565e-10	2.34891232938867e-08
"Predict-miR-398"	-2.46493076972065	10.5526192323479	38.3947380138865	5.77880023149166e-10	2.34891232938867e-08
"Predict-miR-149"	4.42881214712673	10.0294972134368	37.8023312130517	7.82881637783338e-10	2.99207724672664e-08
"Predict-miR-472"	-3.26281405412506	9.64571662452403	37.7055229490142	8.22712991140465e-10	2.99207724672664e-08
"Predict-miR-129"	-2.31499040928275	10.6589031607194	32.3230539427608	1.30555146595878e-08	4.51068031488759e-07
"Predict-miR-521"	-4.45697684217035	8.89321174652108	29.1336418167148	6.75537094530276e-08	2.22283872533534e-06
"Predict-miR-603"	-4.41911643394974	8.95676079672592	28.9378187683055	7.47393386317644e-08	2.34749468157042e-06
"Predict-miR-569"	-3.45669231148518	9.79995630201463	27.1728001935046	1.86057947334366e-07	5.58982789600203e-06
"Predict-miR-368"	-2.32871404516564	11.7891807602104	26.5861912068269	2.52038755405244e-07	7.25661583270931e-06
"Predict-miR-293"	-2.22628679827964	9.81565778300622	21.5804032889153	3.39300998938845e-06	9.37827961066967e-05
"Predict-miR-201"	-3.68162942965768	8.44521774216914	20.6540185404512	5.50215833281839e-06	0.000146230438768366
"Predict-miR-46"	4.28729440594013	8.19209768949801	18.923595426394	1.36059385379164e-05	0.000348211241840748
"Predict-miR-246"	-2.65172731734086	9.07568171094338	17.7842392513457	2.47424345194245e-05	0.000610607937604368
"Predict-miR-118"	-2.16052955919826	9.0574605571816	17.5591109022514	2.78513099036407e-05	0.000663629487703992
"Predict-miR-200"	-3.46305890027133	8.50275290803005	16.9243969584074	3.88984164561685e-05	0.000895960192373748
"Predict-miR-153"	3.78901960828289	8.5068171064924	16.7314027844916	4.30622903973899e-05	0.000959872344019239
"rna19198"	1.94220340111691	9.24134423911573	13.532606584606	0.000234454190013288	0.00506274516559943
"Predict-miR-307"	3.21470973179277	8.16756120365871	13.0943152444082	0.000296193251944508	0.0062021071846562
"Predict-miR-314"	-3.60328155068984	8.06929597280799	12.0438973719638	0.000519622144749643	0.0100738181315154
"Predict-miR-366"	1.88423852795811	8.8738988218021	12.0264215652812	0.000524516791341906	0.0100738181315154
"Predict-miR-272"	-2.22123545297835	8.65897170990676	12.0253092951323	0.000524829888183146	0.0100738181315154
"Predict-miR-306"	-2.56292834940312	8.38094333908445	11.5396897922621	0.000681260063571592	0.0127229919980532
"Predict-miR-318"	-2.97608927729048	8.38931844763548	10.7338010612479	0.00105196137746278	0.0191290871533364
"Predict-miR-241"	2.45572764395009	8.38787718981506	10.5500655176883	0.00116183968990073	0.0205854160441385
"Predict-miR-225"	1.59106711989334	10.5203200424509	9.99448199474899	0.00157009988969883	0.0271234755945473
"Predict-miR-19"	2.11002941790384	8.58784750849343	9.92370996902168	0.00163163166039104	0.0274989628617124
"Predict-miR-615"	3.74523102324927	8.00436246573449	9.70847411294363	0.00183420246299519	0.0301769976649923
"Predict-miR-493"	-1.47967841449617	9.83377380753136	9.26188882463359	0.0023397159479385	0.0375986911633839
"Predict-miR-322"	3.42780227099586	7.92137819536356	9.19827073525413	0.00242243861415816	0.0380432973268929
"Predict-miR-517"	1.82505227550871	8.5631631614969	8.82212997922201	0.00297599085437875	0.0453679833769771
"Predict-miR-91"	-3.22509154985417	8.00963906059398	8.79525203045777	0.00302015518862655	0.0453679833769771
"Predict-miR-376"	-3.46095591115945	7.92892932281108	8.5628069429337	0.003431000186523	0.050443002742285
"Predict-miR-631"	-1.88198356310166	8.52164077371017	8.10208049137275	0.00442144792362246	0.0636504274004817
"Predict-miR-530"	-2.72222279651939	8.38189715419771	7.68835004711987	0.00555784152730868	0.0783769080687815
"Predict-miR-383"	3.07297063105269	7.98720374187236	7.59793884153396	0.00584350658307646	0.0805235403541762
"Predict-miR-258"	-2.99498127524865	7.87776618653078	7.53725087091594	0.00604361867790927	0.0805235403541762
"Predict-miR-634"	1.31636545868083	9.76960450359329	7.52685915559128	0.00607857906594464	0.0805235403541762
"rna10531"	-1.68199370086822	9.20479482306239	7.49816459713546	0.00617619050473421	0.0805235403541762
"rna49430"	1.68001734375227	9.76569547251887	7.39763436849294	0.00653097078940254	0.083572237323651
"Predict-miR-417"	1.41827827337409	9.50481473892253	7.00299813475422	0.00813733174499878	0.102234477014439
"Predict-miR-391"	-1.38171637294983	8.79967879751343	6.5447530709474	0.0105193927298283	0.129801792434131
"Predict-miR-186"	-1.9126565655379	8.47799576453789	6.37717065606002	0.0115597568756929	0.135864720067852
"Predict-miR-618"	-2.97205055483732	7.92740616265619	6.36708873524459	0.0116256168110854	0.135864720067852
"Predict-miR-539"	-1.41316460965555	8.81593232452184	6.36185473502405	0.0116599595806668	0.135864720067852
"Predict-miR-337"	-2.75600852148327	8.15558268261738	6.34109155798877	0.0117972260550957	0.135864720067852
"rna44578"	-1.23973676910145	9.08145550192164	6.23839412423847	0.0125009776775533	0.141609435658842
"Predict-miR-365"	1.22703103039866	10.4365161510492	6.17498965216109	0.0129568668812706	0.144406371209
"rna55115"	1.41307261477905	9.1164473076074	6.03486556311485	0.0140260189814564	0.151775767736387
"Predict-miR-184"	-2.71707308796156	7.95458517039464	6.03092316657401	0.0140573793561921	0.151775767736387
"Predict-miR-157"	-2.71680556469783	7.99419308808984	5.94969039201359	0.0147198712145292	0.155159571193073
"Predict-miR-29"	-1.46985038482286	8.40697061768428	5.93775639888724	0.014819872212363	0.155159571193073
"Predict-miR-328"	-2.71578015891783	7.9973702818076	5.79125078731769	0.0161061258092338	0.165548065309925
"Predict-miR-123"	2.82840142583009	8.11153597603091	5.74056916257827	0.0165774198222688	0.165548065309925
"Predict-miR-360"	2.81547235802283	7.84159848406661	5.73881891404527	0.016593947305019	0.165548065309925
"Predict-miR-342"	-1.11516451950193	9.14619278783346	5.72024121819293	0.0167704262976769	0.165548065309925
"Predict-miR-148"	-1.60639187331234	8.78843465818496	5.68659643598954	0.0170949794870487	0.165778926808551
"Predict-miR-596"	-1.48849889448452	9.11090639776035	5.66835607312814	0.0172736363678953	0.165778926808551
"rna29117"	1.81844254082487	9.03063860696733	5.51940997254591	0.0188066009144424	0.17801864701205
"rna30133"	-1.07708266250514	10.3095483987365	5.3687455862227	0.0205007157640454	0.191432359364262
"rna55116"	1.28646734663682	13.0926682152402	5.27478039166896	0.0216365170445795	0.199344443704059
"Predict-miR-597"	-1.7229954619521	8.91529615940744	5.21989854780173	0.0223298537541584	0.203025380843729
"Predict-miR-482"	-3.0535841632513	7.87632652991522	5.0714909399646	0.0243224552577977	0.216675275936511
"Predict-miR-205"	2.1583438897365	8.25016734276288	5.06183839751391	0.0244582800622979	0.216675275936511
"Predict-miR-121"	-0.872998717635925	10.432316482062	5.01594451358953	0.0251149247517554	0.219676113967886
"Predict-miR-160"	-2.7702220561639	7.85663465256246	4.93714453837973	0.0262854265059475	0.227040371445122
"Predict-miR-100"	-1.66568975162022	8.10438464727125	4.83094483289269	0.0279533075276012	0.237850246955325
"Predict-miR-586"	2.57871647787279	7.98678758202419	4.8084349969536	0.0283207539461829	0.237850246955325
"Predict-miR-343"	-1.39193738571549	9.16218101501375	4.79336461644516	0.0285695665662692	0.237850246955325
"rna51016"	0.675387145338844	11.2578142947779	4.77163313982518	0.0289323677857923	0.238003168333125
"rna20046"	-1.57288706078807	8.88936493406554	4.71154805589239	0.0299606605878973	0.243562546661612
"Predict-miR-214"	1.55867783377218	9.17215755291932	4.66576496938067	0.0307697134908594	0.247231070025394
"Predict-miR-577"	-1.5744219409361	8.36788698230284	4.60545483200177	0.0318703981002621	0.253131552727369
"Predict-miR-264"	-2.37036834974792	7.91367463937715	4.44649456369551	0.0349729655749358	0.273109089371326
"rna40085"	0.879063446049879	10.1741052014231	4.43660484178765	0.0351761345210536	0.273109089371326
"Predict-miR-533"	1.37191192972933	8.52584270401544	4.36266852456171	0.0367347188706927	0.282041008218319
"Predict-miR-326"	1.2303016214646	8.93918098402327	4.33277829864703	0.03738517604571	0.28388084228116
"Predict-miR-510"	1.35388291761892	9.14756758292003	4.29025002924844	0.0383315281685851	0.287903108309699
"Predict-miR-622"	-2.35780928918728	7.78583138753326	4.15980420218597	0.0413941888234345	0.307563273946164
"Predict-miR-388"	1.05366781210648	9.3274632917553	4.11818895478304	0.0424244713113078	0.311864996554401
"Predict-miR-53"	-0.715209751923596	11.0055108387747	4.08763853076573	0.043197956048862	0.313794999478147
"rna2228"	-1.23967453277113	11.2679048949464	4.03952163827535	0.0444464186983141	0.313794999478147
"Predict-miR-532"	-2.38061258741914	7.82057804500805	4.03455523561381	0.0445774240329513	0.313794999478147
"Predict-miR-110"	0.988801646727528	9.05418476358546	4.02791442340712	0.0447532330033737	0.313794999478147
"Predict-miR-562"	-0.983980908478097	9.68182304156824	4.02022914703701	0.044957604845639	0.313794999478147
"Predict-miR-7"	1.04790877739974	8.98363983060416	3.99874160981516	0.0455342481102397	0.314623622538307
"Predict-miR-488"	-1.18387915538779	8.38928631161834	3.98207223466563	0.0459869549585659	0.314623622538307
"Predict-miR-260"	-0.847594126008268	9.95130506964522	3.89566059716915	0.0484109970886869	0.324259810155982
"Predict-miR-578"	1.99808244946699	8.06244789375644	3.88155993403772	0.0488191782380147	0.324259810155982
"Predict-miR-537"	-2.34665631255991	7.81521322073461	3.84453734455538	0.049908289059051	0.324259810155982
"Predict-miR-216"	-2.45154268196305	8.13157159331142	3.82853254187953	0.0503870291877369	0.324259810155982
"Predict-miR-51"	-0.995457213581275	9.75104523729322	3.82201487274276	0.0505833759837717	0.324259810155982
"Predict-miR-263"	1.49476087572063	8.29198986216098	3.81987281347694	0.0506480826229613	0.324259810155982
"Predict-miR-327"	1.11596117994635	9.0042523719727	3.81880869278505	0.0506802597638873	0.324259810155982
"Predict-miR-382"	2.23470998794066	7.84882674205982	3.80284711785839	0.0511655118024206	0.324361180325437
"Predict-miR-70"	-1.12713988484474	9.05875698148576	3.77943475347183	0.0518861858569984	0.32593958570169
"Predict-miR-338"	1.05053287085267	10.1020673620764	3.71777931483123	0.0538359266071106	0.335140768337959
"rna11272"	-2.40937340785949	8.06113085223675	3.6640997006211	0.055596672269891	0.343011611950845
"Predict-miR-441"	-1.01978711849346	9.91197363359268	3.60434265668318	0.0576288472777276	0.352402951052299
"Predict-miR-375"	-2.42515895642719	7.87769564624724	3.56252268938694	0.0590978607819339	0.358215980704529
"Predict-miR-489"	-0.784823453149421	8.90118925680199	3.50376258430762	0.061229570595072	0.364500396556622
"Predict-miR-305"	-1.64907025085168	8.63444162009376	3.49938277216481	0.0613917057863202	0.364500396556622
"rna38809"	2.20701328910866	7.78377407993715	3.49062865333327	0.0617171438453325	0.364500396556622
"Predict-miR-287"	0.863577802650968	9.19205660144877	3.46851958336922	0.0625472652355661	0.366272544726917
"Predict-miR-524"	1.13327928994649	8.91217620534813	3.42487836346601	0.0642209739960166	0.370540366320234
"rna70363"	-1.67930932030545	8.96867952364288	3.42160190614619	0.0643485440787671	0.370540366320234
"Predict-miR-389"	-0.84218463272935	9.73971863399068	3.36317451688269	0.0666694343494948	0.380732058971082
"Predict-miR-387"	-2.18472901429308	8.18101444914108	3.30807700028505	0.0689401208139841	0.390472323626746
"Predict-miR-405"	-1.12879451039375	8.86516431685362	3.28405928138404	0.0699557064356657	0.390533481598464
"Predict-miR-334"	0.954291761764074	8.99603621291798	3.28111596320416	0.0700812615314176	0.390533481598464
"rna19197"	1.10053079210983	13.0602794318771	3.17068794158713	0.0749708616144543	0.412456785033496
"Predict-miR-420"	1.36508616137162	8.21634866937664	3.15495882376295	0.0756966011000108	0.412456785033496
"Predict-miR-372"	1.52309747538371	8.18425184229483	3.15259981122306	0.0758060950785152	0.412456785033496
"Predict-miR-323"	-1.36053270452642	9.91124145005783	3.106452809818	0.0779826267256411	0.420984336464203
"Predict-miR-231"	-0.758914042741273	8.86177546687586	3.08353922333893	0.0790882518470084	0.423643271521572
"Predict-miR-209"	-1.92430656026873	7.82488495424953	2.98216743993001	0.0841864654194888	0.444632770955731
"rna438"	-1.91836001330186	8.24830671526805	2.98010848520864	0.0842936222795959	0.444632770955731
"Predict-miR-340"	-1.20151176095727	8.93848618265588	2.95576640856834	0.085571726566579	0.445434792116552
"Predict-miR-504"	0.785692822165196	9.25786459173155	2.95268671538549	0.0857349165723609	0.445434792116552
"Predict-miR-602"	-1.94747675584425	7.78905283859549	2.90225407923798	0.0884557800732657	0.447119990524702
"rna19535"	1.66826867848457	8.69964691734023	2.89358062354608	0.0889330731906866	0.447119990524702
"Predict-miR-196"	-1.93066847944471	7.78808431441778	2.87816401448221	0.0897883434395685	0.447119990524702
"Predict-miR-17"	-1.93069842816527	7.75852390214921	2.87763274273719	0.089817975467044	0.447119990524702
"Predict-miR-134"	-2.21593284516306	8.72041557931517	2.87476687628303	0.0899780041060011	0.447119990524702
"rna52801"	-1.88343167779075	8.80242464821676	2.85660329590848	0.0909994721007294	0.447119990524702
"rna11800"	-1.91130426304786	7.78935512496392	2.85062356882177	0.0913385034905649	0.447119990524702
"Predict-miR-109"	-1.91130050559626	7.78612395573406	2.85055595044239	0.0913423450695051	0.447119990524702
"Predict-miR-142"	1.52668534010007	8.19426413268608	2.82659464789015	0.0927147645664179	0.447119990524702
"Predict-miR-457"	-1.96138438193436	7.82174816495871	2.82327016059518	0.0929069429516576	0.447119990524702
"Predict-miR-475"	-0.871617520094155	8.78491103897303	2.81558334312402	0.0933529544384285	0.447119990524702
"Predict-miR-632"	-1.31098542944701	8.17198929522944	2.80750794956043	0.0938240211665437	0.447119990524702
"Predict-miR-170"	-1.484947992556	8.43439637972942	2.79552291775201	0.094527924079336	0.447389010539871
"Predict-miR-610"	-0.933334558579608	9.07940179293748	2.73259450947086	0.0983194442360637	0.460851631466421
"Predict-miR-295"	-0.833501610085399	8.8834592668901	2.72632328806464	0.0987062828611147	0.460851631466421
"Predict-miR-409"	-1.78797079787979	8.05978441657104	2.68532901286206	0.101276305727375	0.468893866817341
"Predict-miR-190"	1.11918235883743	8.49926054458513	2.67733506122149	0.10178593346252	0.468893866817341
"Predict-miR-122"	-1.43114316315126	8.17828613666435	2.59177459654051	0.107419920484477	0.489554680276561
"Predict-miR-22"	1.1499249336953	8.31830211311109	2.58782885679612	0.107687860205553	0.489554680276561
"rna41496"	0.484447377748364	11.2834194671721	2.56348657363078	0.109357167571378	0.493894135894263
"rna65319"	-1.89622539269226	8.11883429881765	2.53700950560923	0.111205229590866	0.498979309397975
"Predict-miR-390"	-0.660474504268016	9.76991297199503	2.51856422458833	0.1125129853817	0.501590147733903
"Predict-miR-439"	-0.69854129687896	9.84266059903139	2.50835561526423	0.113244041727583	0.501613030985641
"rna46984"	1.79790570158258	7.92066350630791	2.47433810196113	0.115718148295467	0.504179976887212
"rna18860"	1.37060250603787	8.54074603229351	2.46210166324309	0.116622646281866	0.504179976887212
"Predict-miR-630"	-1.50630858418244	8.57215146914719	2.44996026824273	0.117527842912796	0.504179976887212
"Predict-miR-604"	1.8210865901064	7.79006261915374	2.44910884525543	0.117591611087928	0.504179976887212
"Predict-miR-34"	1.58422269897922	8.03990586423498	2.44292293208078	0.118056061175182	0.504179976887212
"Predict-miR-408"	1.58351854195287	7.89796799874375	2.44099293407055	0.118201383872255	0.504179976887212
"Predict-miR-71"	1.80403314927351	7.79155753875847	2.42759349506673	0.119215790488683	0.505387185445889
"rna42423"	1.3489121269159	8.59141559360325	2.36173409771696	0.124343898745142	0.523912402639592
"Predict-miR-156"	-1.78207357536544	8.29047675131669	2.33620469423338	0.126397172672171	0.529336038281636
"Predict-miR-330"	-1.55647721129909	8.01255479408016	2.30101873509551	0.129289176529307	0.533922770673397
"rna39160"	1.89831535047437	8.59711509227398	2.29714744831477	0.129611839175978	0.533922770673397
"Predict-miR-400"	0.6399330956753	10.0778962928009	2.29476978583133	0.129810456545775	0.533922770673397
"Predict-miR-92"	1.25757082377676	8.81881994884398	2.27857077335628	0.131172702718498	0.536333358452556
"Predict-miR-450"	-1.06285716419569	8.36096832390371	2.26319044676254	0.132480877126053	0.537619513777843
"Predict-miR-541"	-0.673281119593996	10.2358951540259	2.24791894707114	0.133794226300552	0.537619513777843
"rna504"	-0.786143477249648	11.2044355932828	2.24621055152809	0.133942050938639	0.537619513777843
"Predict-miR-115"	-1.45004776486154	8.50713443471732	2.23291921715703	0.135098385430513	0.537619513777843
"Predict-miR-593"	-1.34720271218276	8.18188187644513	2.22973097545206	0.135377417362293	0.537619513777843
"Predict-miR-625"	0.75274740147569	9.02992003969963	2.21040102240642	0.137083032169915	0.541282144168062
"Predict-miR-582"	0.952302014535901	8.48640545369518	2.18625454540954	0.139247561518833	0.546704914826781
"Predict-miR-303"	-0.786828823324437	10.0700747702323	2.17240376068742	0.140506457742138	0.548530860450945
"rna63727"	-0.501879997231318	11.0986476727301	2.14995897754025	0.142573698944999	0.553474303207832
"rna39993"	-0.807901807061111	9.43751705232614	2.13211755277169	0.144241370648424	0.556820039765705
"Predict-miR-395"	1.01604444134138	8.84697954406906	2.11714521848904	0.145657825002378	0.559164205981351
"Predict-miR-199"	-1.40448337902759	7.90217727336594	2.08877104171405	0.148385395874535	0.566190494570145
"Predict-miR-133"	-1.57104936362791	7.98863067888942	2.07995659808449	0.149244419852073	0.566190494570145
"rna21855"	-0.464454285320726	13.2825033617394	2.07279754512866	0.149946252541732	0.566190494570145
"Predict-miR-344"	-0.749848239109535	10.2549446633077	2.054347818428	0.151772228777132	0.569970706983688
"rna27273"	-1.539040191573	7.87702541812518	2.01725241898979	0.155520327473597	0.580889439374353
"Predict-miR-462"	-0.604057373147583	11.3769368493769	1.99186718743778	0.158145785358617	0.587520095068839
"Predict-miR-24"	-1.19072279753516	8.34187619310046	1.96240709627875	0.161256117661007	0.595871536383719
"rna34928"	-1.2179026094818	8.26125668934063	1.91364024613705	0.166559454295407	0.610712530163474
"Predict-miR-203"	0.745635081261108	9.09478682521643	1.90930895900992	0.167040040811717	0.610712530163474
"Predict-miR-269"	-0.874071370431907	9.17822116233357	1.88151302595402	0.170162282082025	0.618853352203574
"Predict-miR-11"	-1.03116564744277	8.19975821441776	1.87019537892347	0.171452704197907	0.620281772778815
"rna437"	-0.810434435663939	10.9812916256853	1.83194387385666	0.175898117257768	0.633049994922489
"Predict-miR-354"	0.592631020083828	8.90806348374786	1.80273736487945	0.179381912792631	0.642243014195379
"Predict-miR-254"	-1.66919342222803	8.25616737546081	1.7835396185554	0.18171528168841	0.647243606426246
"Predict-miR-180"	-0.8252602186586	9.62439903716052	1.74218801115688	0.18686182991305	0.661407368948023
"Predict-miR-238"	-1.20003174688981	7.95152939290969	1.71095674026737	0.190861285386892	0.661407368948023
"rna37802"	-1.19861520909943	8.23377221864856	1.70793630681293	0.191253343200651	0.661407368948023
"Predict-miR-414"	-1.03190424105183	8.12891795781309	1.70341136817852	0.191842448181376	0.661407368948023
"Predict-miR-497"	-1.14962517121984	8.90874126640152	1.70262199718367	0.191945433760168	0.661407368948023
"rna848"	0.409172179961207	11.7377319978968	1.701459737539	0.192097185882642	0.661407368948023
"Predict-miR-503"	0.690720595708741	9.69309841591149	1.6948044059433	0.192968851635126	0.661407368948023
"rna41818"	0.772844118873365	8.89026424780761	1.67531585910617	0.19554802915899	0.661407368948023
"Predict-miR-626"	1.12733715704332	8.41626690384792	1.66909879719833	0.196379286628133	0.661407368948023
"rna44329"	-1.88222656432681	7.86255977581759	1.66373117005962	0.197100300858799	0.661407368948023
"rna34589"	-0.984188489233617	8.94291903570432	1.64890598495685	0.199107897806958	0.661407368948023
"rna6960"	0.417251215205144	11.7561090704988	1.64589110315751	0.199519097805824	0.661407368948023
"Predict-miR-215"	-0.577815736120415	9.86732008207768	1.60871437829818	0.204672615076187	0.661407368948023
"Predict-miR-28"	1.10876835651258	8.43466299545762	1.60417827865611	0.20531209140168	0.661407368948023
"Predict-miR-485"	0.895318402140314	8.42539409225206	1.59829315957587	0.206145262704773	0.661407368948023
"Predict-miR-68"	1.16072008323718	8.10416154127467	1.57708195752746	0.209181515130618	0.661407368948023
"Predict-miR-484"	1.02555416236018	8.40989304691851	1.57703129450877	0.20918883029332	0.661407368948023
"Predict-miR-498"	0.841058960154448	8.84118944727881	1.5737415965653	0.209664474144785	0.661407368948023
"Predict-miR-430"	-0.750805251751908	9.42146255419778	1.56977867277808	0.210239158695991	0.661407368948023
"Predict-miR-131"	0.746714933118112	8.65231253741677	1.5647073716542	0.210977299478628	0.661407368948023
"Predict-miR-564"	-0.709519102781368	9.74596886338653	1.56372546258152	0.211120573567362	0.661407368948023
"Predict-miR-341"	-0.779108568525576	9.1712077610241	1.56035676887781	0.211612990095504	0.661407368948023
"Predict-miR-425"	0.586171461662711	10.3684733640161	1.55520600823564	0.212368535678305	0.661407368948023
"Predict-miR-606"	0.797461465488942	8.72850840680299	1.55507741098758	0.212387440040293	0.661407368948023
"Predict-miR-35"	0.929235015443164	8.36598616257092	1.54650764000462	0.213651749214405	0.661407368948023
"Predict-miR-194"	-1.01714041162994	8.3071952701806	1.54410194484836	0.214008270123043	0.661407368948023
"Predict-miR-230"	-0.675918877275572	8.82600566427128	1.53312100388433	0.215644641402213	0.661407368948023
"Predict-miR-52"	-0.915265978075725	8.45193787189683	1.53216418950186	0.215787928873504	0.661407368948023
"Predict-miR-561"	-0.776478838139411	8.50699400533224	1.52282565869286	0.217192387156857	0.661407368948023
"Predict-miR-117"	1.31112755299066	8.03399555084624	1.51337811198081	0.218624339219593	0.661407368948023
"Predict-miR-496"	1.02007058250784	8.17711667159242	1.51282517211955	0.2187084957984	0.661407368948023
"Predict-miR-605"	-0.683560536964146	9.67565605967671	1.50890019475397	0.219306983617094	0.661407368948023
"Predict-miR-458"	-0.891773839533952	8.88667087147664	1.49913366499181	0.220804709834775	0.661407368948023
"Predict-miR-317"	-1.27329118375865	7.76436023592968	1.48025539485231	0.223734567685731	0.661407368948023
"Predict-miR-361"	0.514232025112546	9.96621943013775	1.4733926592572	0.224811170448098	0.661407368948023
"rna12554"	1.26916713596298	8.36518894003644	1.47203388802874	0.225025065981004	0.661407368948023
"rna31047"	0.572122759137074	10.3293225314708	1.47055163988397	0.22525867752761	0.661407368948023
"Predict-miR-351"	-0.801484697128378	9.07358579562581	1.46912687069349	0.225483504367201	0.661407368948023
"Predict-miR-219"	-1.25554227260078	7.78830756321825	1.46723740620303	0.225782075071227	0.661407368948023
"Predict-miR-144"	-1.25552726541378	7.75746873328363	1.46706635626261	0.225809127575424	0.661407368948023
"Predict-miR-428"	-1.25266499216213	7.79949451854899	1.46514638876556	0.226113048296331	0.661407368948023
"Predict-miR-463"	-1.25263338295301	7.76108248004421	1.46492364693904	0.226148338935852	0.661407368948023
"rna7683"	0.374061686142179	11.8141607382242	1.46050187370302	0.226850284284633	0.661407368948023
"Predict-miR-551"	-0.949491717178385	8.24256501532166	1.43607503987774	0.230775541804148	0.663687960681097
"Predict-miR-495"	-0.451230178575049	11.3447282189518	1.43451561465547	0.231028899211789	0.663687960681097
"Predict-miR-447"	-1.18919824811406	7.98977338218814	1.43136674830573	0.231541513917164	0.663687960681097
"Predict-miR-82"	0.863885497413298	8.2909382940745	1.42734001671518	0.232199040145321	0.663687960681097
"Predict-miR-325"	0.595846528346917	8.95409528647473	1.42458397858597	0.232650373813094	0.663687960681097
"Predict-miR-55"	1.326292041092	7.96228813184194	1.41042439605634	0.234985953865419	0.663687960681097
"rna9998"	1.12298514414055	8.26790730543047	1.40959556351819	0.235123543589624	0.663687960681097
"Predict-miR-438"	0.881945243071093	8.56128040375312	1.4084355092787	0.235316281283457	0.663687960681097
"Predict-miR-543"	-0.566177224179641	9.26277995570464	1.39371128772136	0.237779350535857	0.667908663497061
"Predict-miR-90"	1.34947008090162	8.0372123866844	1.3558846510974	0.244251982767508	0.679058426435742
"Predict-miR-3"	-0.588075846252994	8.89960979254248	1.34271680577451	0.246555421759084	0.679058426435742
"rna31208"	0.759263297590583	8.62945302641125	1.33804922616758	0.247378284272391	0.679058426435742
"Predict-miR-87"	1.38737410156088	8.31748021447382	1.32335410798852	0.249990979206298	0.679058426435742
"Predict-miR-54"	-0.352232694754843	11.5211791509614	1.32331160213585	0.249998585378834	0.679058426435742
"Predict-miR-358"	0.565556797858726	9.04389716587609	1.30292179706386	0.253680212722961	0.679058426435742
"Predict-miR-601"	-1.21298131000663	7.96386648228463	1.29953708798427	0.254297797114797	0.679058426435742
"Predict-miR-26"	-1.21287928592376	7.81572160887228	1.29931950246202	0.254337561716134	0.679058426435742
"Predict-miR-33"	-1.2125800553326	7.90463644198025	1.29889031681819	0.25441601951088	0.679058426435742
"Predict-miR-155"	-1.21682162874799	8.07310372201381	1.29258759790609	0.255571636412932	0.679058426435742
"Predict-miR-584"	-1.6663843534766	7.93545615669858	1.27504417998155	0.25882252375579	0.679058426435742
"Predict-miR-598"	-1.22541162697835	7.9811309993434	1.27043650576246	0.259684807694277	0.679058426435742
"Predict-miR-321"	1.16119797420224	7.90380735784794	1.26904992965312	0.259944988126091	0.679058426435742
"Predict-miR-566"	-0.5342566858271	9.3244138918325	1.2647387046545	0.260756020759269	0.679058426435742
"rna54466"	0.630454663356425	13.2198224693218	1.26060959750123	0.261535733643067	0.679058426435742
"rna44577"	1.15417095897563	7.86241164994298	1.25401168795006	0.262787647580568	0.679058426435742
"rna69774"	1.18340280753353	7.76411619977462	1.25250881940942	0.263073846813761	0.679058426435742
"Predict-miR-145"	1.1834185053038	7.75828128901194	1.25249562476661	0.263076361252444	0.679058426435742
"Predict-miR-112"	1.16543929779605	7.78677455391376	1.24081549029031	0.265313946829325	0.679058426435742
"Predict-miR-300"	1.16545309929189	7.75948521824825	1.24071446154059	0.265333404085209	0.679058426435742
"Predict-miR-440"	-0.460327940947409	10.0014613845614	1.23527672773053	0.26638328911751	0.679058426435742
"Predict-miR-426"	-0.688681099134186	9.86734068429686	1.23297776147044	0.266828715028639	0.679058426435742
"Predict-miR-124"	-1.21348248746382	7.84621925674338	1.23209089781821	0.267000793284991	0.679058426435742
"Predict-miR-106"	-0.555701418151846	10.0620558254681	1.22836507290873	0.267725228216288	0.679058426435742
"rna57202"	1.14276681550717	7.79107845191255	1.22569451765782	0.268245988786111	0.679058426435742
"Predict-miR-429"	1.14276635439334	7.79085912305872	1.22569331644485	0.268246223307799	0.679058426435742
"rna38812"	1.14269578652251	7.75731242034323	1.22550942938282	0.268282127955076	0.679058426435742
"Predict-miR-299"	0.569799701713391	10.1464152788952	1.21651952262095	0.270044780135168	0.680026100122029
"rna50694"	-1.21527575203348	7.84829187730379	1.21353742560363	0.270632673709925	0.680026100122029
"rna50769"	0.896919582900969	8.30053320432768	1.1934088077359	0.274643036231668	0.687602674043779
"Predict-miR-113"	-0.746260057837859	8.90252197156267	1.18220011637396	0.27690855034778	0.688947910242917
"Predict-miR-506"	-0.680236422087913	8.78804373669002	1.18089231649014	0.277174412514516	0.688947910242917
"rna505"	-0.564509741317025	11.7160050827304	1.15513286770281	0.282477232697386	0.696131221214848
"Predict-miR-560"	-0.657324698957104	8.90370222779177	1.15374379859147	0.282766810651135	0.696131221214848
"Predict-miR-373"	0.64697704224644	9.28502326807549	1.15001485054225	0.283546040902324	0.696131221214848
"Predict-miR-509"	0.981037300130487	8.32894308880511	1.145576609243	0.284477038253171	0.696131221214848
"Predict-miR-356"	0.511149098443728	9.23844180653295	1.14260998804812	0.285101498703042	0.696131221214848
"Predict-miR-599"	1.17423429396763	7.81991151237048	1.13131956427036	0.287494048408819	0.699501364262303
"Predict-miR-345"	1.10801116856482	7.93460269760794	1.11943196085918	0.290040800333079	0.700814077832663
"Predict-miR-595"	0.520769722824096	9.03523188013504	1.10610876175331	0.292929384239531	0.700814077832663
"Predict-miR-567"	1.39088365175556	7.96991623759292	1.09860158000382	0.294573203964192	0.700814077832663
"rna9029"	-0.588263219386309	11.7347930771964	1.08818187878148	0.296874397070943	0.700814077832663
"rna30256"	0.568882184742271	10.7092676189618	1.0874647675142	0.297033617800042	0.700814077832663
"Predict-miR-479"	-0.574597732355408	10.0802436202508	1.08630446848717	0.297291472059213	0.700814077832663
"Predict-miR-105"	-0.623489817134088	9.62749058207378	1.08128383728907	0.298410530300939	0.700814077832663
"Predict-miR-152"	0.665870047141282	8.59503021618406	1.08113460247481	0.298443876300994	0.700814077832663
"Predict-miR-399"	-0.556543086770662	15.0022257786217	1.07988460545548	0.298723371972555	0.700814077832663
"Predict-miR-212"	1.06149772612873	8.21869757277845	1.07975780132356	0.298751743802685	0.700814077832663
"Predict-miR-422"	-0.49337066595112	9.12643149478958	1.07780192305982	0.299189801679646	0.700814077832663
"Predict-miR-470"	-0.925362611524587	8.5840308754385	1.05688002779643	0.303927858406989	0.708769761247009
"Predict-miR-454"	1.17753506285825	8.17788535015074	1.04687446170519	0.306228026110486	0.708769761247009
"Predict-miR-234"	-0.559880214487457	8.88673962454618	1.04544333135154	0.306558867599601	0.708769761247009
"rna44066"	0.514733721586948	16.7748748989471	1.04488058975596	0.306689086270413	0.708769761247009
"Predict-miR-159"	0.543384417360221	9.48025569034	1.03293003582538	0.309471478691914	0.712815972587043
"rna54469"	0.609426763106353	13.1925964150171	1.02359411612838	0.311667989128981	0.715490300625003
"rna33835"	-0.576556229813918	9.47656991282232	1.01205630842943	0.314410714682683	0.71832720703551
"Predict-miR-473"	-0.804438714354539	8.78686845323021	1.00966611055977	0.314982841869406	0.71832720703551
"Predict-miR-192"	-0.873373948447728	8.2169603059316	1.00131814605401	0.316991765181923	0.720530624147068
"Predict-miR-381"	-0.785702771069364	8.56324781714602	0.994347851230874	0.318682038448305	0.721997667435339
"Predict-miR-18"	-0.602897604647742	8.96626216967296	0.988174166674906	0.320189033905237	0.723041249766401
"Predict-miR-311"	0.600979362832634	9.11838676291414	0.982020820853524	0.321700406795216	0.723859405286842
"rna9559"	0.588238119702734	8.67774903884865	0.977927574361831	0.322710990794305	0.723859405286842
"Predict-miR-73"	-0.746945964309806	8.18638234464386	0.973793546810416	0.323735898127164	0.723859405286842
"Predict-miR-339"	-0.405636766630862	9.20156910547839	0.969753926258693	0.324741556640986	0.723859405286842
"Predict-miR-442"	0.742325815082062	8.46857989577417	0.963531171671413	0.326298802279457	0.724520488990474
"Predict-miR-102"	-0.365714942958693	9.53580799578378	0.956115481277418	0.328167523836326	0.724520488990474
"Predict-miR-223"	0.628292686408951	9.38364841422402	0.956051668947451	0.328183665780055	0.724520488990474
"Predict-miR-332"	-1.00452044567901	8.60202604329664	0.936470535692356	0.333187185544606	0.726812084127679
"Predict-miR-94"	0.950828590400839	7.97912037611263	0.932701618060306	0.334161893909447	0.726812084127679
"rna9028"	-0.924897921673191	7.92849416487513	0.928320344581815	0.335299763154298	0.726812084127679
"Predict-miR-262"	0.594559368491505	8.9433086137	0.927085702366382	0.335621350237111	0.726812084127679
"rna35737"	0.331769412412903	11.7454064077172	0.925263663449684	0.336096691028481	0.726812084127679
"Predict-miR-456"	-0.791447168110025	8.43688171310676	0.923213624131387	0.336632591883968	0.726812084127679
"rna15912"	0.917572900204784	8.36765599346247	0.917805759601549	0.338051768462494	0.726812084127679
"Predict-miR-594"	0.727800793744915	8.21219721956944	0.91623543756819	0.338465368745286	0.726812084127679
"rna19201"	-0.802216493904341	9.91703009894555	0.915390780800109	0.338688120244736	0.726812084127679
"Predict-miR-346"	0.437877632141103	10.3018273369294	0.890913549378748	0.345229864737273	0.73548943240571
"rna54456"	0.554988151697457	9.34373161135416	0.886094422071217	0.346537881551168	0.73548943240571
"Predict-miR-266"	1.15524994497558	8.13960898545537	0.885744824496348	0.346633031009088	0.73548943240571
"rna24415"	-0.302435581533052	13.6768377746363	0.884437250186243	0.346989225708049	0.73548943240571
"Predict-miR-119"	0.528670114263413	8.48813419938108	0.853562658876351	0.3555464287241	0.748397355341377
"Predict-miR-294"	0.574212383290659	8.7080880675786	0.851636076162693	0.356089911452738	0.748397355341377
"Predict-miR-48"	-1.30089706212448	8.01831174123971	0.850792929807939	0.356328118534461	0.748397355341377
"Predict-miR-436"	0.865365483814113	8.20430173044795	0.826775298851732	0.363206645420179	0.760532702985891
"Predict-miR-494"	-0.329234735263229	10.0053784632134	0.818471490917194	0.365627445281443	0.761057664451992
"Predict-miR-132"	-0.784361354242852	8.71969029469654	0.817985086992952	0.365769938397495	0.761057664451992
"rna39356"	-0.615580392647186	14.3034995452275	0.811393291989432	0.367708643886386	0.761057664451992
"Predict-miR-8"	0.574306136839823	8.97547443093246	0.807429623308204	0.368881276164214	0.761057664451992
"Predict-miR-207"	0.435450557086142	8.88874379643202	0.802473290158519	0.370354923709408	0.761057664451992
"Predict-miR-502"	0.55293190780317	8.48757844042982	0.801675281979777	0.370592959311001	0.761057664451992
"rna37546"	0.727431152252417	11.085053326615	0.799753590958396	0.371167051983099	0.761057664451992
"Predict-miR-165"	0.391899638988851	10.7561910607176	0.788321634823197	0.374608109203408	0.765840838637737
"Predict-miR-468"	-0.759913360343495	8.18882088468909	0.772417188591843	0.379470312899378	0.770874208849817
"rna31043"	0.378735635748323	11.5664869235503	0.771312266784406	0.379811398012713	0.770874208849817
"Predict-miR-37"	0.402586275028052	9.87064914950797	0.76935410423161	0.380416939533701	0.770874208849817
"Predict-miR-72"	0.57397756024069	9.84111443801896	0.7593687734234	0.383526135592312	0.774902221328325
"Predict-miR-97"	-0.47025089509486	9.75613516381396	0.753904583488042	0.385242825249291	0.776101435123208
"Predict-miR-217"	-0.772293117791213	8.24705677735465	0.741773686601698	0.389093294817573	0.78112501921749
"Predict-miR-81"	-0.440619956411445	9.11789887303037	0.734774208632672	0.391340045262372	0.78112501921749
"rna20252"	0.424041440468161	13.1449065868966	0.732668604839976	0.392019555074609	0.78112501921749
"Predict-miR-101"	0.52864452527871	8.48791799616583	0.727658779649273	0.393643123338125	0.78112501921749
"Predict-miR-464"	-1.01286077451969	8.02054159890914	0.722671200095355	0.39526910250017	0.78112501921749
"Predict-miR-568"	0.604701969221838	8.37654637988661	0.721991037033314	0.395491588535272	0.78112501921749
"rna41499"	0.260219038653117	12.3857470109457	0.721508830840662	0.395649430862694	0.78112501921749
"Predict-miR-182"	-0.392383527582589	9.770953324995	0.712521806863837	0.398607902209921	0.783429601870367
"Predict-miR-95"	-0.897933834246343	7.95587645426544	0.711083790068447	0.399084254498363	0.783429601870367
"Predict-miR-512"	-0.917241171458151	7.87164917792947	0.702387522357165	0.40198261319847	0.786883812238365
"Predict-miR-98"	-0.466214007897632	8.62180882557673	0.696491254355209	0.403965201212687	0.787575639405185
"Predict-miR-608"	0.699243103774475	8.012944721316	0.686875495550213	0.40722917808457	0.787575639405185
"rna21851"	-0.308388298631221	13.2688130789	0.680701923421651	0.409345124088746	0.787575639405185
"Predict-miR-150"	-0.522153599203156	9.08604765716523	0.679615124427027	0.409719286133325	0.787575639405185
"rna30134"	0.294626117635858	11.9048612823613	0.679185036620787	0.409867495125568	0.787575639405185
"Predict-miR-125"	-0.656057585421411	8.26535259265327	0.676622683417999	0.410752122480757	0.787575639405185
"Predict-miR-394"	0.515395689502831	8.97970614573142	0.674381107034259	0.411528310954048	0.787575639405185
"Predict-miR-181"	-0.627745038253975	8.42354643915719	0.673598244343184	0.4117999011391	0.787575639405185
"Predict-miR-501"	-0.646506416058696	8.36907824054757	0.669323279560372	0.413287642081515	0.787575639405185
"rna21373"	0.376189448353782	12.4273811584204	0.664856679743867	0.414850570621531	0.787575639405185
"Predict-miR-146"	-1.32063455650208	7.95226274833368	0.664248760571374	0.415063966198975	0.787575639405185
"Predict-miR-580"	0.314678002962239	11.6397824479057	0.661550244992386	0.416013181451364	0.787575639405185
"Predict-miR-285"	0.634401343664868	8.68509886773635	0.652741005884936	0.419134399807155	0.789647839363286
"Predict-miR-540"	0.455225778664323	9.02187584702235	0.650143619380918	0.420061336561338	0.789647839363286
"Predict-miR-614"	-0.77160371235429	8.23255810342049	0.648816745474244	0.420536041802734	0.789647839363286
"Predict-miR-183"	-0.75984545751169	8.23093459935557	0.638919872340299	0.424102197853284	0.793298230672172
"rna54463"	0.463054382802478	13.2540219390037	0.635700433208452	0.425272034615169	0.793298230672172
"Predict-miR-277"	-0.425241705768822	9.16489854696745	0.633911331911483	0.425924230939762	0.793298230672172
"Predict-miR-559"	0.646568816585985	14.2269457051603	0.626062507383725	0.428803301231391	0.796513659007771
"Predict-miR-585"	-0.31067666716044	9.8469826107126	0.62252870227446	0.430109153733804	0.79679738667576
"Predict-miR-433"	-0.764687242095332	8.21679753728616	0.619009215551655	0.43141570605854	0.797080890070724
"rna38012"	0.687179197584528	8.35991745508123	0.615096463856233	0.432875329045478	0.797644939654468
"Predict-miR-273"	-0.583299811608895	8.59488216673147	0.611600895025093	0.434185680845518	0.797931663468757
"Predict-miR-467"	0.42874462040274	9.35295196671524	0.608373806480659	0.435400758527808	0.798042239105345
"rna54457"	0.469644850650496	13.1856587656258	0.599583281055459	0.438737067417281	0.80082595008805
"Predict-miR-56"	0.604310574787064	8.54472290417634	0.598273853805651	0.439237387964358	0.80082595008805
"Predict-miR-77"	-0.581338859651624	8.31179423787962	0.59210706169185	0.441605485771229	0.803024712283999
"Predict-miR-195"	0.433542096694056	8.45591962502155	0.568865691371411	0.450710012773664	0.815449851460991
"Predict-miR-384"	-0.637727156300087	8.09372508779263	0.568643102997584	0.450798615424166	0.815449851460991
"Predict-miR-296"	-0.581139103469392	8.82728472035464	0.552887219786241	0.457140371630367	0.82476239372476
"Predict-miR-31"	-0.663505827379008	8.57226987662962	0.548645322026378	0.458871743672922	0.82573014291143
"Predict-miR-16"	0.577502464922281	8.63003059318651	0.542825688829323	0.461264022917082	0.827879064508322
"rna37547"	-0.377717862363757	13.1731209451404	0.536130210639225	0.464040932333836	0.82791565324014
"Predict-miR-171"	0.328625257528647	9.08089080163828	0.53355280254068	0.46511700550337	0.82791565324014
"rna39161"	0.609204055286249	9.61469180309796	0.531600441223059	0.465934776928485	0.82791565324014
"Predict-miR-600"	0.755465836333776	8.33085337010225	0.527516649108343	0.467652786948151	0.82791565324014
"Predict-miR-236"	-0.812049825491103	8.17776070086664	0.527002818176014	0.467869669707507	0.82791565324014
"Predict-miR-265"	-0.457201340639358	8.61184942643479	0.525574832203156	0.468473256753828	0.82791565324014
"Predict-miR-6"	0.419040898950469	8.9221147156059	0.520154535895778	0.470775768826261	0.829862388415679
"rna9752"	-0.235584367453002	13.2189554497289	0.515788323706346	0.472643813755638	0.830188575136123
"rna847"	0.842859681155359	8.1560561558784	0.513847743152368	0.473477924711903	0.830188575136123
"Predict-miR-452"	0.39518323637733	9.14658592944097	0.511326692316763	0.474565104455526	0.830188575136123
"Predict-miR-140"	0.348771374222357	10.3536489908152	0.508358875097924	0.475850150768566	0.83033448025525
"Predict-miR-255"	-0.75650943252132	8.43715386445947	0.499387357788319	0.479769435597653	0.834556362459982
"Predict-miR-99"	0.429256682039469	8.9845760504042	0.494897322890901	0.481750816093708	0.834556362459982
"Predict-miR-437"	-0.315583488863843	9.58074966316415	0.492173281116985	0.482959451943036	0.834556362459982
"rna27274"	-0.704298962044606	8.08210343939581	0.491855792127379	0.483100643971046	0.834556362459982
"Predict-miR-211"	-0.416536696733998	10.6530939896661	0.481740765375392	0.487634877727501	0.836589809187327
"Predict-miR-151"	-0.360920112136501	8.70361939456458	0.480389516629101	0.488245934564015	0.836589809187327
"Predict-miR-253"	0.575018522735927	8.36876293165003	0.478580488999236	0.489066001262253	0.836589809187327
"Predict-miR-565"	0.483233809501017	8.98683019490733	0.478460390724498	0.4891205251978	0.836589809187327
"rna40590"	0.314138452256458	10.5120068945259	0.474964996425118	0.490711861799845	0.837239250626402
"Predict-miR-548"	-0.244756886885431	11.5599412351597	0.46587154055813	0.494892609376404	0.842292593790875
"Predict-miR-12"	-0.374276209124723	8.56641582784659	0.461312306312918	0.497011302936562	0.843626925702132
"Predict-miR-218"	-0.836326985616676	8.28802082847187	0.457106517808514	0.498979359676352	0.843626925702132
"Predict-miR-84"	0.929493043115878	8.17997129106796	0.456340485615526	0.499339236775936	0.843626925702132
"Predict-miR-193"	-0.785205907117602	7.78537206825331	0.443780489395177	0.505303395518806	0.845212329650098
"Predict-miR-331"	-0.782039035910684	7.78887641616848	0.441024421049875	0.50662842496126	0.845212329650098
"rna46224"	-0.529836095890895	8.94098126647345	0.440729669739937	0.506770484971014	0.845212329650098
"Predict-miR-49"	0.274581562496939	10.5232153485508	0.437591731639214	0.50828712009405	0.845212329650098
"Predict-miR-178"	0.709355082598066	7.98520989494429	0.437268534364476	0.508443772356323	0.845212329650098
"Predict-miR-432"	-0.323158432283782	9.16927489668793	0.434584337105138	0.509748014907491	0.845212329650098
"Predict-miR-65"	-0.395411148452122	8.82423657624039	0.433767044903078	0.510146282235737	0.845212329650098
"rna62714"	-0.771235578457099	7.78456141992373	0.432928216108016	0.510555604162216	0.845212329650098
"Predict-miR-357"	-0.317799005272043	9.14900753825055	0.431433916264368	0.511286184940291	0.845212329650098
"rna44410"	-0.236621846749092	13.6512952182184	0.426385707910399	0.51376777646286	0.847287669536601
"Predict-miR-63"	-0.872513206068446	7.94529799737071	0.422502026557757	0.515691214656308	0.848434831732163
"Predict-miR-410"	-0.309574034197153	10.1063276362687	0.414242781855446	0.519823854360544	0.850325636560098
"rna34405"	0.653440449602126	8.33814228444226	0.413996647188677	0.519947903841629	0.850325636560098
"Predict-miR-210"	0.762725718888505	8.11015233983805	0.412838714082627	0.520532191410885	0.850325636560098
"rna51238"	-0.741457865169908	7.82000452722587	0.404987980265037	0.524524433927535	0.854826376990393
"Predict-miR-4"	-0.727845561262106	7.75723087868409	0.399419865623292	0.527389014549877	0.857472491891682
"Predict-miR-239"	0.274539859484349	9.63838728847048	0.395345121414778	0.529503075088895	0.858509725467729
"Predict-miR-480"	0.450763926672123	8.64118730871282	0.393261654777529	0.530589900958171	0.858509725467729
"rna63087"	-0.266917776138874	13.6285897679488	0.391038141213183	0.531754214906205	0.858509725467729
"Predict-miR-579"	0.483639924232979	8.70842508470495	0.365428004887148	0.545507006009053	0.878660468886377
"Predict-miR-13"	-0.298910375033455	8.75760431973649	0.356418060429898	0.550502314346363	0.88275483350318
"Predict-miR-222"	-0.435911167036273	14.1310885108698	0.355472961166829	0.551031250517581	0.88275483350318
"rna39357"	0.412813883347296	8.79238484301414	0.350780465738332	0.553671659531034	0.88275483350318
"Predict-miR-459"	0.610803976560601	8.3683043177155	0.348387389501193	0.555027412287756	0.88275483350318
"Predict-miR-476"	0.493066987995893	8.53917755388688	0.345938261567914	0.556421436572312	0.88275483350318
"rna68981"	0.318877870925357	9.4707251316082	0.340885864380484	0.559318330017157	0.88275483350318
"Predict-miR-320"	0.282662673415703	9.23533499679827	0.339670613501811	0.560019411763248	0.88275483350318
"Predict-miR-507"	-0.733617681335484	7.84527138635924	0.339408244892434	0.560170993469788	0.88275483350318
"Predict-miR-628"	-0.578081672523723	7.81529220500055	0.339157338997786	0.56031602609259	0.88275483350318
"rna11055"	0.500474240311289	8.31512831619092	0.335778320971359	0.562276250964306	0.88275483350318
"Predict-miR-135"	0.406146261803596	9.05910585297082	0.335534247552424	0.562418351701916	0.88275483350318
"rna61260"	0.574436616586982	8.21412192663205	0.333887354223924	0.563378989254562	0.88275483350318
"Predict-miR-315"	-0.392908534768235	8.63895474047814	0.328468757069075	0.566562133516999	0.885734014163454
"Predict-miR-50"	-0.588932627942638	7.90120876225306	0.315759951698098	0.574166970502578	0.893599701665614
"Predict-miR-221"	-0.427522044247597	9.43476014912868	0.315738729321186	0.574179837249685	0.893599701665614
"Predict-miR-197"	-0.611981192742244	8.17420033215292	0.307584821625509	0.579166030575045	0.898294415548753
"Predict-miR-120"	0.34074464851339	8.53725347007962	0.306563919823382	0.579796395564029	0.898294415548753
"rna69979"	0.707326315914889	8.28645534779083	0.301361546966236	0.583030109550922	0.90128368165478
"rna21854"	-0.202894475072568	13.661192166112	0.293276558694945	0.588128444909774	0.905815403290914
"Predict-miR-396"	0.470673901999358	8.25074208976962	0.292562028535411	0.588583380720146	0.905815403290914
"Predict-miR-108"	-0.482999658698709	8.02841726071589	0.288793719979761	0.590994581765156	0.907505013332717
"Predict-miR-245"	-0.274019423901144	9.6300089799721	0.28000712700762	0.59669654547508	0.914229075217916
"rna15526"	-0.48949835092419	8.11462466574028	0.276934657869731	0.598717425388928	0.915295887043692
"Predict-miR-545"	0.412125698638638	8.43464515617042	0.269495575955197	0.603670345017151	0.920830482134329
"Predict-miR-477"	-0.423281235599696	8.1168982005595	0.26308742548636	0.608006942268165	0.922664166243967
"Predict-miR-308"	0.4608890055019	8.20162375587807	0.261357654217335	0.609188958775443	0.922664166243967
"Predict-miR-613"	0.210228019371113	10.4760330909133	0.25972287233332	0.61031060913082	0.922664166243967
"Predict-miR-421"	-0.222842278396397	9.04476093733953	0.259323276247536	0.610585454625058	0.922664166243967
"Predict-miR-187"	0.563006783065552	7.89950862956653	0.25687554134685	0.612274871486682	0.922664166243967
"Predict-miR-9"	0.371925559084103	14.8306346806919	0.255996556956763	0.612884012020233	0.922664166243967
"Predict-miR-23"	-0.462148785008798	7.92666770659124	0.24557247766236	0.620210032187943	0.931590690752412
"Predict-miR-363"	0.375985259086758	8.79354443418063	0.24375117013709	0.621509853020061	0.931590690752412
"Predict-miR-78"	-0.522072803210428	8.1409953857343	0.238848366653045	0.625039125043903	0.932509133527611
"rna57201"	0.448650507202509	8.58773617222539	0.237366884360686	0.62611439146441	0.932509133527611
"Predict-miR-369"	0.380366188988406	12.547926138088	0.237288895079317	0.626171111370205	0.932509133527611
"Predict-miR-206"	-0.447348058374039	8.31765376067295	0.230108184938606	0.631443622597515	0.937019193019815
"Predict-miR-164"	0.582774626167387	8.02864672350456	0.228476679375041	0.63265565533266	0.937019193019815
"Predict-miR-623"	-0.301335091752881	9.09225778229754	0.222458446293658	0.63717305652904	0.937019193019815
"rna65320"	-0.360922983430535	10.924295726072	0.220225422432897	0.638868211456472	0.937019193019815
"Predict-miR-220"	-0.29551267418838	8.45651002025239	0.219669216883927	0.639292074149826	0.937019193019815
"rna44328"	0.277618186059127	8.64055710362936	0.218252476913811	0.640374681314365	0.937019193019815
"Predict-miR-364"	0.681112668053728	9.24753365436051	0.217812883190184	0.640711468548655	0.937019193019815
"Predict-miR-348"	-0.271056222286261	8.8185591654878	0.217467075912907	0.640976693864195	0.937019193019815
"Predict-miR-402"	0.295133345860067	8.95035091550379	0.214514094276973	0.643252077254311	0.937019193019815
"Predict-miR-392"	0.613498254894547	8.1726538280074	0.214427311225903	0.643319233943035	0.937019193019815
"rna55381"	0.21310652806599	12.6919851466835	0.213399391921726	0.644115943103346	0.937019193019815
"Predict-miR-292"	0.322764315217996	9.77259070953632	0.205939217810929	0.649968994365142	0.941909162709767
"rna49429"	0.28014299638095	10.5254847146854	0.205643564012036	0.650203575416149	0.941909162709767
"Predict-miR-434"	0.527310107033038	7.75472430152151	0.202917026121548	0.652376537974501	0.942963030323333
"Predict-miR-553"	0.710346711957472	7.82887265729034	0.201316452793436	0.653660335057708	0.942963030323333
"Predict-miR-47"	-0.586440458519532	7.8945984550988	0.198445976543902	0.655978143757719	0.943333523960815
"Predict-miR-474"	-0.255419283748898	8.74485672284428	0.197621607837425	0.656647503654345	0.943333523960815
"Predict-miR-44"	0.543609362644443	8.1014955968084	0.19075202154878	0.662291452228563	0.945240821605687
"Predict-miR-359"	0.348173730569101	8.48468175203515	0.189651203280546	0.663207076632209	0.945240821605687
"Predict-miR-335"	0.352832495447265	8.17877112763836	0.188009160706702	0.664578766679984	0.945240821605687
"rna35738"	-0.485823708375302	8.28950593087874	0.187568711414942	0.664947908472377	0.945240821605687
"Predict-miR-427"	0.358747890186932	8.60324184543566	0.186697126049426	0.665679906375973	0.945240821605687
"rna9999"	-0.284723961885945	8.91963743880327	0.185523068914428	0.666669146330633	0.945240821605687
"Predict-miR-607"	0.23099608307716	8.89448552421086	0.184303985038314	0.667700259940058	0.945240821605687
"Predict-miR-58"	-0.257300300670884	9.78175027996752	0.182869657389421	0.668918613263648	0.945240821605687
"Predict-miR-268"	0.195827830017322	9.20964066358724	0.178383274604633	0.672766325926233	0.948737818806177
"rna66916"	-0.266815831912795	11.7497090514342	0.171742828796379	0.678567522810987	0.952474794920119
"rna17900"	0.329090690027651	9.08072432257166	0.170475158554954	0.679689864083839	0.952474794920119
"Predict-miR-520"	-0.270987847379799	9.86424645046652	0.170022262275968	0.680092023251151	0.952474794920119
"Predict-miR-546"	0.262272042650501	8.67961928743108	0.16749536746546	0.682347414541445	0.952474794920119
"Predict-miR-355"	0.339015279893341	8.62352242635779	0.167446137641047	0.682391551566382	0.952474794920119
"Predict-miR-518"	-0.155431088728004	10.6497763147839	0.16600532288377	0.683686683473776	0.952474794920119
"rna34927"	-0.170485133162724	13.2757257079128	0.154230825852469	0.694524578605352	0.961915493682014
"Predict-miR-616"	-0.163847807847887	9.30848810980508	0.15310928581922	0.695581546986184	0.961915493682014
"Predict-miR-347"	-0.189976364878115	9.24501701015422	0.152793551524264	0.695879908054853	0.961915493682014
"Predict-miR-226"	-0.51172156974199	8.06342036742586	0.152551190175156	0.696109174689495	0.961915493682014
"rna55382"	-0.464059445945364	8.31189706921139	0.151166035272015	0.697423534493038	0.961915493682014
"Predict-miR-2"	0.274986630542581	8.0721339273452	0.135623548859905	0.712671154349083	0.97977534490432
"Predict-miR-573"	-0.232389711318348	10.0493204844553	0.135093408157658	0.713208391442653	0.97977534490432
"Predict-miR-617"	-0.38344566513172	7.93190382184165	0.132838595058722	0.715506852663289	0.980982609504628
"Predict-miR-139"	0.483967451178011	8.1388722143488	0.129321917439297	0.719136136589137	0.982275681656163
"Predict-miR-229"	-0.287621994719939	8.65977688227527	0.12842790513492	0.720067641724837	0.982275681656163
"Predict-miR-278"	-0.156635691549621	10.7637922445449	0.127173008659064	0.721381358279937	0.982275681656163
"Predict-miR-257"	0.218672333617053	8.37893115818652	0.123460507220519	0.725311180485725	0.982275681656163
"Predict-miR-57"	-0.201349813530481	12.8186309137668	0.117803958691084	0.731428586914471	0.982275681656163
"Predict-miR-267"	0.254064645340347	8.65065054542607	0.117456487953061	0.73180967545674	0.982275681656163
"Predict-miR-487"	0.27173079774167	8.53052590601621	0.116522086705627	0.732837614741932	0.982275681656163
"Predict-miR-612"	0.204534417164088	10.3456910410862	0.113161254876271	0.736573401768689	0.982275681656163
"Predict-miR-411"	0.191576194136583	8.67361496161708	0.112868986013993	0.736901182571886	0.982275681656163
"rna53549"	0.208617553790786	9.08344749105145	0.111111151382081	0.738882634770766	0.982275681656163
"Predict-miR-374"	0.157749889731632	11.2585404649055	0.11014766971188	0.739976078558881	0.982275681656163
"rna15527"	0.175431585698007	9.72986097162187	0.109870892769193	0.740291170423791	0.982275681656163
"Predict-miR-301"	0.180418651244394	9.28639258199586	0.108239940041059	0.742156905621153	0.982275681656163
"Predict-miR-508"	0.40661360726563	7.9906370492997	0.108028249688321	0.742400209393929	0.982275681656163
"Predict-miR-79"	-0.323010861985722	8.01888116553651	0.103952009150841	0.747137644391478	0.982275681656163
"Predict-miR-316"	0.348466151562828	7.81741565715183	0.100755048652277	0.750925420764374	0.982275681656163
"Predict-miR-556"	0.552285943795101	7.84622380878692	0.100292701356134	0.751478663350115	0.982275681656163
"Predict-miR-141"	0.31396095984026	7.90412895194068	0.0989386228853855	0.753107064881907	0.982275681656163
"Predict-miR-208"	-0.122124229058545	11.7636608357212	0.0988639252696792	0.753197251007877	0.982275681656163
"Predict-miR-371"	0.31360451845673	8.05411131806543	0.0987724199150675	0.753307780985965	0.982275681656163
"Predict-miR-39"	0.255844630229488	8.53140023471492	0.0985079846945016	0.753627510733119	0.982275681656163
"Predict-miR-256"	0.313163353995793	8.03761250415586	0.0980981924236222	0.754123925000253	0.982275681656163
"rna34999"	0.318566973883739	7.94513371316303	0.0970220035710643	0.75543304452181	0.982275681656163
"Predict-miR-15"	0.313678193881588	8.04437092693266	0.0964644360412485	0.75611442585178	0.982275681656163
"rna798"	-0.145188607370147	13.6350918482623	0.0959762333760974	0.756712814261186	0.982275681656163
"rna34588"	-0.15111737601329	13.212220275305	0.0954438414657162	0.757367269650023	0.982275681656163
"Predict-miR-298"	0.401528768009386	8.68997740408605	0.0953085812681138	0.757533859830184	0.982275681656163
"Predict-miR-169"	-0.214312306588362	10.1065966648299	0.0938606582530213	0.759325331222433	0.982275681656163
"Predict-miR-531"	0.309400629407277	7.84853896791336	0.0935617399894877	0.759697052813819	0.982275681656163
"rna33836"	-0.169428520070768	13.1735413613415	0.0922734774224061	0.761306554429428	0.982275681656163
"rna19202"	-0.139146271343583	13.0613914964638	0.0902241679125986	0.763892365779373	0.982275681656163
"Predict-miR-80"	-0.15857483033949	10.0637511033776	0.0896277744201388	0.764650897682071	0.982275681656163
"rna70267"	0.185798333035218	14.7219008422959	0.0889519084487915	0.765513839279325	0.982275681656163
"Predict-miR-455"	0.163302044114313	8.78985843188788	0.0883846152852605	0.766240915664769	0.982275681656163
"rna60851"	-0.178033035419229	8.89542343405765	0.0869911983123348	0.768037649555566	0.982275681656163
"Predict-miR-75"	0.154363060938088	9.47708005216057	0.0863205180571605	0.768908032564412	0.982275681656163
"Predict-miR-407"	0.147855457838696	10.1022961052148	0.0853287511415175	0.770201867991863	0.982275681656163
"rna63728"	-0.188433824002727	11.7005433356215	0.0851254887700286	0.770468045524805	0.982275681656163
"Predict-miR-310"	-0.223016197294041	8.60079640502422	0.0812444644968551	0.775617981639828	0.987020304444054
"rna40086"	0.132472368660691	12.9343065476749	0.0740736488416154	0.785495347764986	0.997752362694128
"rna25395"	-0.134459880485651	13.1460907446358	0.0712040343867137	0.789591707467966	1
"Predict-miR-42"	-0.160753656559736	8.40641152653531	0.0699009609655512	0.791481035337188	1
"Predict-miR-500"	0.307580660869161	8.30350206797548	0.0697134029571664	0.791754522717249	1
"Predict-miR-83"	0.113614633219565	10.8717533044986	0.0685449770589095	0.793467191396369	1
"rna23853"	0.171457254025697	8.28629807167707	0.0665998257157732	0.796353331416131	1
"Predict-miR-333"	-0.329955566418329	8.07428174374096	0.0665838659633771	0.796377196636766	1
"Predict-miR-162"	-0.152229774017507	10.69433215859	0.0654197183545868	0.798126288257891	1
"Predict-miR-290"	0.186561507269193	8.87867037398784	0.0643090904625545	0.799810491327896	1
"Predict-miR-64"	-0.116251254537358	10.0798582763356	0.0624564690090246	0.802654689279791	1
"rna10532"	-0.155067721069431	10.2849372623409	0.0578910135171231	0.809860875924223	1
"rna48654"	-0.114219016169609	13.624955637025	0.0552305316414703	0.814199598552146	1
"rna70362"	0.14747140892684	10.2340974350821	0.0539849588729577	0.81626879370483	1
"Predict-miR-329"	0.0923592259376187	12.4924459520995	0.0533265466838948	0.817372747004702	1
"Predict-miR-286"	0.110863112818956	10.8867214982272	0.0513886328580995	0.820664328855031	1
"Predict-miR-213"	-0.156869922699562	8.17122573937028	0.0504698225970337	0.822247754910393	1
"rna31044"	-0.104909233347387	11.0410265117269	0.0504476106067706	0.822286220506908	1
"Predict-miR-288"	0.0702173486087077	11.5818451357992	0.0502353677495773	0.82265422138426	1
"rna44065"	0.17735504199727	9.48578741228696	0.0498278295926298	0.823363134253621	1
"Predict-miR-406"	0.117593666351705	10.1705041828197	0.0496172408614601	0.823730646404089	1
"Predict-miR-114"	-0.131645422900361	8.5436211331007	0.0491502499735876	0.824548553865881	1
"Predict-miR-538"	-0.154386080396768	9.2363806286478	0.0491122599370932	0.824615270194593	1
"rna41815"	0.0975845653884596	10.2216404154509	0.0477234224940748	0.827073126605518	1
"Predict-miR-93"	0.373822514218578	7.89782772870843	0.0447072793720595	0.832543198052394	1
"Predict-miR-478"	0.118181762470939	8.82362795697825	0.0446962944743428	0.832563467260067	1
"Predict-miR-261"	-0.116787518063894	9.65981011781234	0.0437174627365682	0.834380156465641	1
"Predict-miR-319"	0.115476600991163	9.23237411195862	0.040019952286956	0.841441575199666	1
"rna9092"	0.0643858516663444	11.8700808205735	0.0383649392381766	0.844712154045684	1
"rna60849"	0.106591454078733	11.6841358969496	0.0382549326896253	0.844932119312415	1
"rna29819"	-0.0905473685234259	9.53040729337849	0.0375319483877341	0.846386015928284	1
"Predict-miR-549"	-0.143575845450171	8.38674168978745	0.0374189110965961	0.846614639463927	1
"Predict-miR-86"	-0.151286320863385	8.05121961084563	0.0362680163407392	0.848963074602095	1
"Predict-miR-550"	-0.150992299717306	8.13826341283053	0.0361488542341792	0.849208421712784	1
"Predict-miR-385"	-0.0840523752529501	9.69990889849673	0.0360105421596586	0.84949372338062	1
"Predict-miR-173"	-0.114350689778779	8.97528782827614	0.0355675904488759	0.850411256812621	1
"Predict-miR-404"	-0.195227258942673	8.21629091030848	0.0343113070266572	0.853046196200753	1
"Predict-miR-415"	-0.0852711279398988	9.30991391469203	0.0337693106243258	0.854198379258471	1
"rna11052"	-0.178292113262078	8.18073902577238	0.0327902117900205	0.856304250933761	1
"rna41819"	0.0821082549303314	9.24393198833396	0.0295149992146655	0.863595316470011	1
"Predict-miR-401"	-0.146944925440482	8.05878693136764	0.0292109185831553	0.864292945131094	1
"Predict-miR-191"	-0.190770811022883	8.12519570262024	0.0279349778326399	0.867261780406031	1
"Predict-miR-27"	0.061643768183855	9.52083827354088	0.0277704104458287	0.867649727569491	1
"rna63088"	-0.148701040191455	8.19862737167404	0.0268450320384357	0.869853530593733	1
"Predict-miR-270"	-0.0910182321493519	9.50627252956206	0.0268386506262033	0.869868862356225	1
"Predict-miR-67"	-0.147256415733175	7.95784231109425	0.0264643279836818	0.870771494615244	1
"rna11059"	-0.229087919543674	8.10243069958928	0.0260551720900146	0.871765650996107	1
"rna55111"	-0.107182993692785	13.2147327657316	0.0259860737800501	0.871934332877933	1
"Predict-miR-69"	-0.114835487907888	8.88341491404841	0.0258879488496397	0.872174270035161	1
"Predict-miR-416"	0.0853723760758972	9.60737968577729	0.0254215021771955	0.873321266528927	1
"rna10649"	0.0990224848312626	14.6307786293945	0.0252056845214383	0.873855614744657	1
"Predict-miR-557"	-0.19221575826998	8.39987943434986	0.0244705105240719	0.875693674413009	1
"rna46983"	0.100225012000221	8.98565305673993	0.0226138265593363	0.880465653239857	1
"Predict-miR-611"	-0.114234225782687	10.2616902536658	0.0219005198624771	0.882352047345172	1
"Predict-miR-583"	-0.13901392053261	7.9571884512259	0.0217986497437233	0.882623998561891	1
"Predict-miR-271"	-0.14112858367491	7.96266461445973	0.0217860602791458	0.882657652283533	1
"Predict-miR-250"	-0.177461931667204	7.81298636314671	0.0211502853442651	0.884370292934436	1
"rna44409"	-0.144049894794918	8.06635018844755	0.0210340689385529	0.884686183830844	1
"rna9093"	-0.110753207124215	8.57918591446487	0.0207136426207981	0.885561787249391	1
"Predict-miR-534"	-0.142994758074153	7.94034578270987	0.0206426072321442	0.885756834222058	1
"Predict-miR-104"	0.094360890707384	10.3215060768955	0.0199985230810817	0.887541208915249	1
"rna38013"	-0.0685500188428751	12.994935840491	0.0199663229831728	0.887631180235064	1
"Predict-miR-116"	0.04713831290134	11.7057724826134	0.0189317451303435	0.890562342335076	1
"rna6961"	0.135605249741148	8.36202812572678	0.0188063316493405	0.890923155729737	1
"Predict-miR-519"	-0.109337205808131	8.14960470954338	0.018610068337507	0.891490272206603	1
"rna15913"	0.0620576092310959	12.8583544652376	0.0181746545227455	0.892759405899096	1
"rna11053"	-0.227796758190967	7.92683457098374	0.0180281793149195	0.893189821624221	1
"Predict-miR-460"	0.120886577792502	8.0081306695197	0.0174990688799834	0.894759625761045	1
"Predict-miR-552"	-0.139835669207733	7.99026461894876	0.0162548738322723	0.898548944388923	1
"Predict-miR-137"	0.116019819329241	8.18958929991853	0.0161912125576453	0.898746730893594	1
"Predict-miR-491"	-0.137575063382336	7.95261509982316	0.0159728409292228	0.899428200122107	1
"Predict-miR-62"	-0.201010402824806	7.88560697984477	0.0153015790962669	0.901553166609051	1
"Predict-miR-393"	-0.125702346029108	7.81894516893771	0.0144562333005434	0.904297723935386	1
"rna58409"	-0.053977291079506	13.1279379670187	0.0139923701602953	0.905838396169326	1
"rna37801"	-0.208502017024124	7.96618345740545	0.0138551247457332	0.906299191073887	1
"Predict-miR-575"	-0.1316912330661	7.88679136099305	0.0133163695843166	0.908130793367458	1
"Predict-miR-163"	0.0713626994041957	10.8338577848117	0.0133029883313611	0.908176758964993	1
"Predict-miR-555"	-0.0708275667015763	11.4952475112931	0.0122799579943376	0.911763072627747	1
"rna46361"	-0.0723758764646005	9.09204776197801	0.0118863247222176	0.913183119365836	1
"Predict-miR-324"	-0.0966416688030264	8.05483746652429	0.0117973297182905	0.913507455760532	1
"Predict-miR-204"	0.0945278450437457	8.10722541830559	0.0102774413619553	0.919250625145113	1
"rna799"	-0.107105517813618	7.84545715006563	0.00965461683744007	0.921727499512528	1
"rna11484"	-0.130590207958431	7.76178388046727	0.00961956431041422	0.921869262854016	1
"Predict-miR-423"	-0.10356067332226	8.0400132059534	0.00938405307442913	0.922828583201516	1
"Predict-miR-32"	0.0901149051488776	8.04922214039336	0.00930572369727223	0.923150333843803	1
"Predict-miR-431"	-0.0383718050998922	10.996428880749	0.00888333151462994	0.924909433619668	1
"Predict-miR-21"	-0.068795000069722	8.45670288435213	0.00879762832091302	0.925271468777993	1
"rna68982"	-0.0421658694914566	12.8758218896994	0.00854330243872781	0.92635641546821	1
"Predict-miR-403"	0.072872625536745	8.15905334805291	0.00825605070577673	0.92760159919922	1
"rna60848"	-0.0366304841653165	10.9468479437413	0.00805648063181863	0.928479603942286	1
"Predict-miR-274"	-0.0483126792835922	10.0406619368336	0.00789911732172044	0.929179679565268	1
"Predict-miR-483"	-0.0492540414478579	9.25806404806385	0.00777429680347375	0.92973999293135	1
"Predict-miR-202"	-0.109934868366909	7.75701835372071	0.00772107218571882	0.929980293561152	1
"Predict-miR-529"	-0.0519393503664929	10.8927277722526	0.00748435254625157	0.931059295919411	1
"Predict-miR-251"	-0.0359797133550878	9.66930443429034	0.00688506389584642	0.93387039628961	1
"Predict-miR-486"	0.0381661766307255	10.8419276572925	0.00656539768451303	0.935420367549481	1
"rna20253"	-0.08850447234631	7.89663908261102	0.00625546649056297	0.936959838728863	1
"Predict-miR-136"	-0.0899163267902887	7.79032755701742	0.00605659914425249	0.937967931588138	1
"rna69973"	0.0988567268599784	8.33819959924235	0.00590549096916249	0.938745107658473	1
"Predict-miR-36"	-0.0872143145421795	7.78608387917059	0.00584711079969136	0.939048042152073	1
"Predict-miR-629"	-0.0872140239212764	7.78586509587188	0.0058470753127553	0.939048226755129	1
"Predict-miR-581"	-0.0828567268610582	7.84895581777585	0.00572305264750828	0.939696871784007	1
"Predict-miR-572"	-0.0288399441562238	10.418628377911	0.00502682468015436	0.943477260981842	1
"rna34998"	-0.072207150079183	7.78913933372262	0.00477200342286555	0.944926188285576	1
"Predict-miR-377"	0.0685747631559999	8.10966882151193	0.0046012175141108	0.945919151291315	1
"rna50768"	0.0390082063927637	12.8766403508374	0.00453107520791463	0.946332319482608	1
"Predict-miR-443"	-0.069141714568508	7.85849158200692	0.00451154797740472	0.946447913927378	1
"Predict-miR-74"	0.0667619903333172	8.03406668685739	0.00447625082118375	0.946657500334052	1
"Predict-miR-249"	-0.0368469452931756	12.8863121446539	0.00436877001377667	0.947300860633613	1
"Predict-miR-185"	-0.0626146131557963	8.80815921165808	0.00430862433642965	0.947664353001069	1
"Predict-miR-624"	-0.0653998751463702	7.81676970776838	0.00418622988603179	0.948412002093101	1
"rna29820"	-0.0255375788193816	12.9306049202199	0.00392629711666004	0.95003711342204	1
"rna48653"	-0.0280796141599229	9.34315043568135	0.00362708875471629	0.951976182608858	1
"Predict-miR-336"	0.0517465395357589	8.33334522400614	0.00356875410892066	0.952363469761893	1
"Predict-miR-143"	0.0295028119337137	9.61423708175188	0.00355487857363102	0.952456056933854	1
"rna12553"	-0.0292334684500799	12.8608125074129	0.0035052981776893	0.952788382231246	1
"Predict-miR-453"	-0.0342331481043371	9.25100675403269	0.00322610917207733	0.954705431355132	1
"rna55112"	-0.0348838664308972	9.79838891016123	0.00194615321032998	0.964812555598286	1
"Predict-miR-248"	-0.0197013627728837	12.9182346847149	0.00174474768657973	0.966681909561809	1
"Predict-miR-621"	-0.03242994461795	16.4287379977371	0.0016677883574463	0.96742459489661	1
"rna11049"	-0.0360164833122501	8.34057314411914	0.00150008232572318	0.969104940223593	1
"rna19536"	0.0170083121587099	12.9450741068605	0.000904813601788845	0.976003155729087	1
"Predict-miR-471"	-0.0183806920544296	11.4935224304729	0.000854440023296377	0.97668051203765	1
"rna51239"	-0.0126301196229931	9.37415454600787	0.000798823848125352	0.97745201409395	1
"Predict-miR-198"	0.0257248465404764	8.4596333049457	0.000798230062484251	0.97746039366092	1
"rna11058"	0.0244184511487943	8.36653747536515	0.000439812313343779	0.983268228699178	1
"rna34406"	-0.0165071358137883	8.72336417449406	0.000438889861754888	0.98328578174361	1
"rna29118"	-0.00935354966404431	12.8185879610229	0.000428047037956958	0.983493506418598	1
"Predict-miR-138"	-0.00691184341680738	9.31273461815007	0.000267518973137371	0.986950376179035	1
"Predict-miR-247"	0.00499568368797226	9.60612511349757	0.000116000538630701	0.991406666473569	1
"Predict-miR-349"	-0.00559010083210138	9.52280702028295	5.78821128840445e-05	0.993929729283304	1
"Predict-miR-233"	-0.00511332570651297	9.41717947670357	2.5314198190074e-05	0.995985603020824	1
"Predict-miR-85"	-0.00153829490530688	8.2617766648036	5.1454487728364e-06	0.998190113592461	1
"Predict-miR-168"	0	9.28794537738811	0	1	1
"Predict-miR-461"	0	7.80997171742813	0	1	1
"Predict-miR-574"	0	8.61567423009946	0	1	1
"rna31209"	0	7.873389427655	0	1	1
"Predict-miR-465"	0	8.33697533479827	0	1	1
"Predict-miR-161"	0	7.76845812396175	0	1	1
"Predict-miR-571"	0	8.1917847805543	0	1	1
"rna46223"	0	7.80007323308895	0	1	1
"rna11056"	0	7.93271859662945	0	1	1
"rna51554"	0	7.77359335136515	0	1	1
"Predict-miR-228"	0	7.86448897830629	0	1	1
"rna69978"	0	7.8668592686531	0	1	1
"Predict-miR-528"	0	7.85745859542837	0	1	1
"rna69972"	0	7.82825652688166	0	1	1
"rna7820"	0	7.85809979643892	0	1	1
"Predict-miR-619"	0	7.75966252141236	0	1	1
