Length	Counts  	Percentage
10    	354101  	8.2%
11    	384383  	8.9%
12    	416225  	9.6%
13    	680747  	15.8%
14    	514258  	11.9%
15    	502068  	11.6%
16    	890417  	20.6%
17    	285944  	6.6%
18    	519248  	12.0%
19    	316871  	7.3%
20    	332188  	7.7%
21    	242107  	5.6%
22    	222817  	5.2%
23    	182140  	4.2%
24    	190869  	4.4%
25    	180999  	4.2%
26    	148307  	3.4%
27    	291383  	6.7%
28    	116911  	2.7%
29    	156602  	3.6%
30    	136125  	3.2%
31    	129746  	3.0%
32    	151732  	3.5%
33    	151697  	3.5%
34    	109757  	2.5%
35    	115481  	2.7%
36    	158148  	3.7%
37    	92228   	2.1%
38    	60045   	1.4%
39    	53445   	1.2%
40    	51468   	1.2%
41    	58864   	1.4%
42    	56007   	1.3%
43    	41539   	1.0%
44    	53486   	1.2%
