mireap start at Thu Aug 31 12:13:50 2017

Parameters:
  minimal miRNA length: 18
  maximal miRNA length: 26
  minimal miRNA(reference) length: 20
  maximal miRNA(reference) length: 24
  uniqueness of miRNA: 20
  maximal energy: -18
  minimal space: 5
  maximal space: 35
  minimal mature pair: 14
  maximal mature bulge: 4
  maximal duplex asymmetry: 5
  flank sequence length: 10

Load short tag file: data/Va35-3357-3.filtered.fa
  small RNAs [18 - 26 nt]
  unique: 134187
  total:  748738

Load mapping file: bwa/Va35-3357-3.filtered.mapping
  small RNAs mapped [18 - 26 nt]
  unique: 42363
  total:  417757

Load reference file: db/a_flavus.fa
  total 331 entries

miRNA discovery
	NW_002477237.1:+ 1249 10(0) 2
	NW_002477237.1:- 1203 11(0) 0
	NW_002477238.1:+ 1453 15(0) 2
	NW_002477238.1:- 1244 5(0) 0
	NW_002477239.1:+ 827 12(0) 0
	NW_002477239.1:- 930 14(0) 2
	NW_002477240.1:+ 656 7(0) 0
	NW_002477240.1:- 755 3(0) 0
	NW_002477241.1:+ 694 7(0) 0
	NW_002477241.1:- 664 8(0) 0
	NW_002477242.1:+ 480 4(0) 0
	NW_002477242.1:- 692 7(0) 0
	NW_002477243.1:+ 611 6(0) 2
	NW_002477243.1:- 644 6(0) 0
	NW_002477244.1:+ 711 9(0) 0
	NW_002477244.1:- 602 6(0) 0
	NW_002477245.1:+ 662 6(0) 0
	NW_002477245.1:- 587 6(0) 0
	NW_002477246.1:+ 491 6(0) 0
	NW_002477246.1:- 507 5(0) 1
	NW_002477247.1:+ 380 7(0) 0
	NW_002477247.1:- 426 5(0) 0
	NW_002477248.1:+ 661 3(0) 0
	NW_002477248.1:- 699 7(0) 1
	NW_002477249.1:+ 520 4(0) 0
	NW_002477249.1:- 669 9(0) 0
	NW_002477250.1:+ 323 3(0) 0
	NW_002477250.1:- 293 1(0) 0
	NW_002477251.1:+ 250 3(0) 0
	NW_002477251.1:- 317 2(0) 0
	NW_002477252.1:+ 112 1(0) 0
	NW_002477252.1:- 339 3(0) 0
	NW_002477253.1:+ 3 0(0) 0
	NW_002477253.1:- 2 0(0) 0
	NW_002477255.1:- 1 0(0) 0
	NW_002477256.1:- 5 0(0) 0
	NW_002477257.1:- 1 0(0) 0
	NW_002477261.1:- 1 0(0) 0
	NW_002477263.1:+ 1 0(0) 0
	NW_002477264.1:+ 2 0(0) 0
	NW_002477264.1:- 1 0(0) 0
	NW_002477265.1:- 2 0(0) 0
	NW_002477267.1:- 1 0(0) 0
	NW_002477270.1:- 2 0(0) 0
	NW_002477271.1:+ 7 0(0) 0
	NW_002477271.1:- 810 2(0) 0
	NW_002477276.1:+ 1 0(0) 0
	NW_002477276.1:- 2 0(0) 0
	NW_002477287.1:- 1 0(0) 0
	NW_002477289.1:+ 1 0(0) 0
	NW_002477290.1:- 25 1(0) 0
	NW_002477297.1:- 1 0(0) 0
	NW_002477303.1:+ 1 0(0) 0
	NW_002477306.1:- 7 0(0) 0
	NW_002477331.1:+ 1 0(0) 0
	NW_002477372.1:+ 15 0(0) 0
	NW_002477511.1:- 60 0(0) 0
	NW_002477588.1:+ 11 0(0) 0
	NW_002477651.1:+ 30 0(0) 0
	NW_002477651.1:- 373 1(0) 0
	NW_002477665.1:+ 1 0(0) 0
	NW_002477746.1:+ 568 0(0) 0
	NW_002477746.1:- 1 0(0) 0
	NW_002477749.1:+ 1 0(0) 0
	NW_002477749.1:- 1 0(0) 0
	NW_002477758.1:+ 397 1(0) 0
	NW_002477758.1:- 1 0(0) 0
	NW_002477899.1:+ 1 0(0) 0
	NW_002477975.1:+ 1 0(0) 0
	NW_002477975.1:- 1 0(0) 0
	NW_002478195.1:+ 422 0(0) 0
	NW_002478195.1:- 2 0(0) 0
	NW_002478253.1:+ 2 0(0) 0
	NW_002478306.1:+ 1 0(0) 0
	NW_002478306.1:- 4 0(0) 0
	NW_002478337.1:- 2 0(0) 0
	NW_002478608.1:+ 1 0(0) 0
	NW_002478650.1:- 1 0(0) 0
	NW_002478688.1:+ 1 0(0) 0
	NW_002478688.1:- 1 0(0) 0
	NW_002478791.1:- 1 0(0) 0
	NW_002478808.1:+ 2 0(0) 0
	NW_002478816.1:- 1 0(0) 0
	NW_002478852.1:- 2 0(0) 0
	NW_002478983.1:- 1 0(0) 0
	NW_002479018.1:+ 2 0(0) 0
	NW_002479018.1:- 1 0(0) 0
	NW_002479056.1:+ 4 0(0) 0
	NW_002479056.1:- 367 3(0) 0
	NW_002479074.1:- 1 0(0) 0
	NW_002479103.1:+ 361 0(0) 0
	NW_002479103.1:- 1 0(0) 0
	NW_002479124.1:+ 1 0(0) 0
	NW_002479124.1:- 350 0(0) 0
	NW_002479187.1:- 2 0(0) 0
	NW_002479422.1:- 1 0(0) 0
	NW_002479436.1:- 1 0(0) 0
	NW_002479452.1:+ 1 0(0) 0
	NW_002479452.1:- 1 0(0) 0
	NW_002479569.1:+ 1 0(0) 0
	NW_002479569.1:- 2 0(0) 0
	NW_002479592.1:- 1 0(0) 0
	NW_002479605.1:- 1 0(0) 0
	NW_002479802.1:- 1 0(0) 0
	NW_002479848.1:+ 4 0(0) 0
	NW_002479848.1:- 1 0(0) 0
	NW_002479900.1:- 1 0(0) 0
	NW_002479907.1:+ 18 0(0) 0
	NW_002479907.1:- 18 0(0) 0
	NW_002479909.1:+ 3 0(0) 0
	NW_002479909.1:- 436 0(0) 0
	NW_002479916.1:+ 2 0(0) 0
	NW_002479939.1:+ 4 0(0) 0
	NW_002479939.1:- 141 1(0) 0
	NW_002479943.1:+ 1 0(0) 0
	NW_002479943.1:- 9 0(0) 0
	NW_002479957.1:- 77 2(0) 1
	NW_002479958.1:- 1 0(0) 0
	NW_002479963.1:+ 1 0(0) 0
	NW_002479983.1:- 2 1(0) 0

mireap finish at Thu Aug 31 12:14:09 2017
  11 miRNA genes are identified
