"logFC"	"logCPM"	"LR"	"PValue"	"FDR"
"Predict-miR-559"	8.5909415430674	14.2269457051603	125.155030934763	4.70698617940805e-29	3.25252744997096e-26
"rna437"	4.16798578607783	10.9812916256853	44.7928294196767	2.19023312416404e-11	7.56725544398675e-09
"Predict-miR-369"	5.60867438066603	12.547926138088	40.4723166534159	1.9942161628233e-10	4.593344561703e-08
"rna9752"	-3.3792979978083	13.2189554497289	36.6283537925019	1.42937446692698e-09	2.46924439161636e-07
"Predict-miR-571"	6.80992222245911	8.1917847805543	30.0855672993398	4.13396442037014e-08	5.71313882895153e-06
"rna65320"	4.25298400777398	10.924295726072	27.4630363959479	1.60125846773793e-07	1.84411600201152e-05
"rna44065"	4.15011870634489	9.48578741228696	26.7967124191274	2.26021525575941e-07	2.23115534532822e-05
"rna34928"	4.626034725486	8.26125668934063	24.662088555792	6.83148892741932e-07	5.88832794230707e-05
"Predict-miR-621"	4.49746193265801	16.4287379977371	24.4391772879288	7.66931280474148e-07	5.88832794230707e-05
"Predict-miR-20"	-7.85064358313625	10.3848370841291	21.7714450493157	3.07137460610325e-06	0.000212231985281734
"rna21855"	-2.22861923748233	13.2825033617394	21.1708487885936	4.20106069475509e-06	0.000263902994552343
"Predict-miR-351"	3.55171795438944	9.07358579562581	20.4582340900434	6.09467831873332e-06	0.0003474805997616
"rna44410"	-2.14186721851345	13.6512952182184	20.324081340957	6.53726164529784e-06	0.0003474805997616
"rna53549"	3.10408937402173	9.08344749105145	20.1256908953655	7.25160417663771e-06	0.000357918463289761
"rna52801"	5.14000072530149	8.80242464821676	18.8323219353157	1.42727799570479e-05	0.000657499396688005
"Predict-miR-465"	6.88563079406108	8.33697533479827	18.2260035265796	1.96182015096836e-05	0.000847261077699459
"rna37546"	3.55010394891518	11.085053326615	17.1138480798368	3.52046767839577e-05	0.00143096656810087
"rna24415"	-1.71675438131358	13.6768377746363	16.9234606172767	3.89176079656267e-05	0.00149400372801378
"Predict-miR-244"	-2.78036517312018	12.6752102152864	16.526010599258	4.79872516154561e-05	0.00174522057190948
"rna21851"	-2.04204606201509	13.2688130789	16.3181560852688	5.35484285928104e-05	0.00178954117467815
"rna33835"	2.90011756415091	9.47656991282232	16.2887642026778	5.43854770886269e-05	0.00178954117467815
"Predict-miR-168"	6.74178879393033	9.28794537738811	15.7400185548099	7.26703646595679e-05	0.00228251008998916
"rna15912"	3.53979989285351	8.36765599346247	14.5353241686284	0.000137555968727217	0.004132659756109
"Predict-miR-41"	-3.76528265463261	10.1897174483946	14.3899918959539	0.000148589941646544	0.00420201615160841
"Predict-miR-361"	-6.99738125599708	9.96621943013775	14.3469393612197	0.000152026633560362	0.00420201615160841
"rna48654"	-2.22037453438228	13.624955637025	14.1416218022966	0.000169550500716199	0.00450613061518822
"rna39160"	4.39185801638014	8.59711509227398	13.3577294697188	0.000257359701913949	0.00658650200083478
"rna20252"	1.89362562590976	13.1449065868966	13.2603338980796	0.00027108136100026	0.00668990073039926
"Predict-miR-222"	2.83901795674472	14.1310885108698	13.1639650240413	0.00028538436971325	0.0068000206714433
"rna21854"	-1.65827490518797	13.661192166112	12.8184219729235	0.000343223082811763	0.00790557167409761
"rna17900"	3.06324952364934	9.08072432257166	12.5415743843962	0.000397996825468346	0.00887147762576215
"rna34927"	-1.91563900280964	13.2757257079128	12.4769441393123	0.000412005634554208	0.00889674667115493
"rna63087"	-1.8237971558759	13.6285897679488	12.4005980890211	0.000429196359537152	0.00898711164970219
"Predict-miR-104"	-7.14331165622416	10.3215060768955	11.894888672955	0.000562881922360329	0.0114397473044408
"rna33836"	2.01102916942854	13.1735413613415	11.6915655896492	0.000627840489551855	0.0123953650937238
"rna55112"	2.91053006755684	9.79838891016123	11.5937742006874	0.000661729773622903	0.0127015353770396
"Predict-miR-40"	-3.61936557703431	10.0462189404975	11.0462885834297	0.000888649163841075	0.0165961235733563
"rna505"	-2.8187362387442	11.7160050827304	10.9661139523344	0.00092793148623524	0.0168034167744058
"rna57201"	3.31593442670748	8.58773617222539	10.9257190478136	0.000948383870046061	0.0168034167744058
"Predict-miR-612"	-6.76335949729857	10.3456910410862	10.5024786098923	0.00119214521321029	0.0205943085582077
"Predict-miR-548"	-2.07173146031367	11.5599412351597	10.4131441011028	0.00125121535774378	0.0210875563951452
"rna54469"	1.99662518760045	13.1925964150171	10.1199916747585	0.0014666966216081	0.0241306515602666
"rna31209"	4.84385077161744	7.873389427655	10.0022450854951	0.00156349503077987	0.025125001541137
"Predict-miR-149"	-3.49284311771916	10.0294972134368	9.84343569981513	0.00170438866597688	0.0262719847657939
"rna798"	-1.71434598428336	13.6350918482623	9.79888506566592	0.00174617706769449	0.0262719847657939
"Predict-miR-64"	-6.40783768828268	10.0798582763356	9.79598718416811	0.0017489309684899	0.0262719847657939
"rna34588"	-1.85461632005415	13.212220275305	9.69882901923209	0.0018438547066592	0.0271085872830107
"rna39161"	2.72958090279563	9.61469180309796	9.65145203513195	0.00189201968213736	0.0272372000074358
"Predict-miR-72"	-6.66706492141693	9.84111443801896	9.61124314848585	0.00193389683030766	0.0272718920355631
"rna51554"	4.83660970393856	7.77359335136515	9.48231686573435	0.00207461803750397	0.0284020508102178
"Predict-miR-274"	-6.46415874987374	10.0406619368336	9.46329313273673	0.00209624398165139	0.0284020508102178
"Predict-miR-344"	2.00795366225648	10.2549446633077	9.30549120694564	0.00228468043113003	0.0303598880367471
"Predict-miR-374"	-2.31196231737256	11.2585404649055	9.15975624596355	0.00247395521060169	0.0320050128218826
"rna54463"	1.82941781334382	13.2540219390037	9.13977737417358	0.00250111532906174	0.0320050128218826
"rna37547"	1.64312111422726	13.1731209451404	9.10421174147287	0.00255021594425416	0.0320399857723568
"rna29820"	-1.56180263718729	12.9306049202199	9.05778768742107	0.0026157828240304	0.0322768916322322
"Predict-miR-57"	-2.11852950500284	12.8186309137668	8.94615253478655	0.00278054604372651	0.0331939150507181
"rna54457"	1.89022519946726	13.1856587656258	8.94245817839963	0.0027861752140979	0.0331939150507181
"rna54466"	1.73983968438744	13.2198224693218	8.90267487634256	0.00284753224373084	0.0333499115325087
"rna15913"	-1.68487813935747	12.8583544652376	8.74900343198199	0.00309771291949657	0.0354536929076115
"rna34405"	3.25335160070732	8.33814228444226	8.71239497259782	0.00316053718971846	0.0354536929076115
"rna12553"	-1.79593176559442	12.8608125074129	8.67149841475345	0.00323225312383703	0.0354536929076115
"Predict-miR-397"	-2.96816234907529	9.47607951943754	8.64553270660572	0.00327864261706852	0.0354536929076115
"Predict-miR-388"	-6.21040049432571	9.3274632917553	8.64272481029086	0.00328369948782509	0.0354536929076115
"Predict-miR-306"	3.61561772515672	8.38094333908445	8.60992696082925	0.00334335709480822	0.0355424577309613
"rna9029"	-2.44748372779185	11.7347930771964	8.58025816494047	0.00339827186142406	0.035578876609758
"rna46361"	2.42796461062846	9.09204776197801	8.40929299757719	0.00373307807913004	0.0385008500399829
"rna48653"	1.97328885784703	9.34315043568135	8.32971594303863	0.00390017558556305	0.0396326666121187
"Predict-miR-385"	-6.05790517983187	9.69990889849673	8.13250704664272	0.00434785862131406	0.0435415986569278
"Predict-miR-106"	-6.13793663873716	10.0620558254681	8.10428842875571	0.00441606541373937	0.0435928742984844
"Predict-miR-613"	-2.99193085116994	10.4760330909133	8.0358907301236	0.00458594534420607	0.0446322286316394
"rna46983"	2.3927141861049	8.98565305673993	7.94556797822831	0.00482052862783445	0.0462636844699111
"rna11049"	2.8732344108747	8.34057314411914	7.8665355268878	0.0050358043862136	0.0476676826147068
"rna55382"	3.8538222731452	8.31189706921139	7.71959350533091	0.00546246941697892	0.0510076536098977
"Predict-miR-49"	-2.93148759929837	10.5232153485508	7.6283227549472	0.00574587119163399	0.0529386265789212
"rna29118"	-1.52572835447024	12.8185879610229	7.49384508812599	0.00619102227064742	0.0559360902272764
"Predict-miR-102"	-5.85652602554612	9.53580799578378	7.48164501843855	0.00623310990955179	0.0559360902272764
"Predict-miR-27"	-5.82227334166382	9.52083827354088	7.42012073506554	0.00644984875107046	0.057139044704996
"Predict-miR-75"	-5.96629662200622	9.47708005216057	7.30408214588215	0.0068798130765362	0.060176592859323
"rna55381"	1.32974309809442	12.6919851466835	7.22539706670868	0.00718792717840919	0.0620857210035093
"Predict-miR-329"	-1.39664235859427	12.4924459520995	7.13235219930542	0.00757053499466453	0.0645832059421381
"Predict-miR-15"	3.16022223641792	8.04437092693266	7.00960477607151	0.008107357543622	0.0683193178371073
"Predict-miR-486"	-2.40643714238854	10.8419276572925	6.86727221642529	0.00877885511938782	0.0730866131023733
"rna19201"	2.44344167065318	9.91703009894555	6.79773695014688	0.00912734918336018	0.0750833129250224
"Predict-miR-223"	-5.92054319543292	9.38364841422402	6.61261762311149	0.0101258709832257	0.0823173746989288
"rna70363"	2.88319382310785	8.96867952364288	6.51269920832879	0.0107106807367577	0.0860590742918554
"Predict-miR-211"	1.71168591695086	10.6530939896661	6.3562093404832	0.0116971184761397	0.0929046996208334
"rna44577"	3.6907309097795	7.86241164994298	6.22193123560636	0.0126177407435977	0.0990779415207502
"rna20253"	3.67545684885588	7.89663908261102	6.17327017251451	0.0129694655299804	0.100695513272095
"Predict-miR-390"	-5.57815818393521	9.76991297199503	6.09295993328372	0.0135721533806413	0.10420397762248
"rna68982"	-1.35956085137665	12.8758218896994	6.05897188565149	0.0138358209752699	0.105061014218808
"Predict-miR-133"	3.65079425062558	7.98863067888942	5.95191498067585	0.0147013072103664	0.110419600895252
"rna46224"	2.47291561083732	8.94098126647345	5.9054405884035	0.0150941897596206	0.112151452945138
"Predict-miR-110"	-5.51519218840907	9.05418476358546	5.86243044224546	0.0154674215320652	0.113546530046318
"Predict-miR-129"	-5.53145941949567	10.6589031607194	5.8462147448299	0.0156105938558614	0.113546530046318
"Predict-miR-452"	-5.57473744787335	9.14658592944097	5.74200607616247	0.0165638638300257	0.117946925602067
"rna15527"	-5.55920931601832	9.72986097162187	5.73521163695244	0.0166280642089832	0.117946925602067
"rna31043"	1.18062155535639	11.5664869235503	5.72472677349828	0.0167276392315523	0.117946925602067
"rna30133"	1.62199740469554	10.3095483987365	5.61341240915572	0.0178235208023718	0.124404574489282
"Predict-miR-438"	2.21834844504273	8.56128040375312	5.49026899777952	0.0191226006522961	0.131751917946031
"Predict-miR-398"	-5.42616408743547	10.5526192323479	5.47797857017899	0.0192575162265544	0.131751917946031
"Predict-miR-564"	-5.53794998285487	9.74596886338653	5.44629038845978	0.0196099239535909	0.131873674911336
"Predict-miR-524"	-5.50783942199366	8.91217620534813	5.44210178664426	0.0196570021937302	0.131873674911336
"Predict-miR-288"	-1.27068844658614	11.5818451357992	5.42103102299983	0.0198956080441995	0.132191011139826
"Predict-miR-7"	-5.40131611604979	8.98363983060416	5.38205997634894	0.020344841958421	0.13388843612637
"Predict-miR-83"	-1.72347987630218	10.8717533044986	5.30617245409199	0.0212499927589072	0.136653083691698
"rna66916"	-1.93346291395613	11.7497090514342	5.28064574501847	0.0215637489909332	0.136653083691698
"Predict-miR-510"	-5.48617718079416	9.14756758292003	5.27048535759864	0.0216899642934441	0.136653083691698
"Predict-miR-595"	-5.36929768138795	9.03523188013504	5.2701027511976	0.0216947320608666	0.136653083691698
"rna63728"	-1.93459861857603	11.7005433356215	5.26537408105008	0.0217537470420938	0.136653083691698
"rna11053"	4.04744436091032	7.92683457098374	5.13550578349167	0.0234412560167342	0.145927098266336
"rna68981"	-5.37431814135338	9.4707251316082	5.10282769060611	0.0238868727283172	0.147373473707743
"Predict-miR-495"	-1.44025035760656	11.3447282189518	5.07870776628359	0.024221415899592	0.148115029970071
"Predict-miR-381"	2.58762319482873	8.56324781714602	5.02989756758463	0.0249133718496749	0.151009999544959
"rna9999"	2.0398902101363	8.91963743880327	4.99162514229494	0.0254702770201171	0.153043142790443
"Predict-miR-228"	3.88575553041539	7.86448897830629	4.96812196036974	0.0258186669339771	0.153211127517202
"Predict-miR-209"	3.88403636501679	7.82488495424953	4.95942923014587	0.0259487709024372	0.153211127517202
"Predict-miR-45"	3.90976079494654	9.21376432874003	4.94518720619498	0.0261634052779014	0.153211127517202
"Predict-miR-373"	-5.35413729698118	9.28502326807549	4.92042281481778	0.0265410209354596	0.153897091493407
"Predict-miR-317"	3.91898772456386	7.76436023592968	4.90842642517319	0.0267259782622414	0.153897091493407
"Predict-miR-233"	-5.714543109943	9.41717947670357	4.77856505571976	0.0288161231559849	0.164122073307069
"rna38013"	-1.24706279277577	12.994935840491	4.76899773161821	0.0289766902220874	0.164122073307069
"Predict-miR-105"	-5.33259001712063	9.62749058207378	4.73849924881285	0.0294947899555909	0.165698372839946
"rna63727"	-1.65930967781577	11.0986476727301	4.71108541858272	0.0299687242094907	0.167003132489985
"Predict-miR-493"	-5.23689979133534	9.83377380753136	4.68895059181402	0.0303571821030788	0.16781450266582
"Predict-miR-552"	3.03930277979109	7.99026461894876	4.65756814727445	0.0309169506460072	0.16955248330469
"Predict-miR-574"	3.82425388455933	8.61567423009946	4.621850443437	0.0315671659747673	0.171206470148161
"Predict-miR-130"	-5.18283342280383	10.5486592965734	4.61388653584296	0.0317140784066057	0.171206470148161
"rna69978"	3.81161348716624	7.8668592686531	4.54053602022394	0.0331012251837961	0.176837436208361
"Predict-miR-339"	-5.10529211601968	9.20156910547839	4.53188351012141	0.0332689822099665	0.176837436208361
"Predict-miR-425"	-1.75903893913444	10.3684733640161	4.47578882185176	0.0343783296283228	0.181339128039474
"rna9998"	2.37931886099453	8.26790730543047	4.3960296325659	0.0360227019701793	0.188573386828741
"Predict-miR-566"	-5.09912197197672	9.3244138918325	4.37045824040331	0.0365671570581547	0.189309213059003
"Predict-miR-19"	-5.10856379861854	8.58784750849343	4.3508583501392	0.0369902985073072	0.189309213059003
"Predict-miR-415"	-5.06729664583095	9.30991391469203	4.34449698154888	0.037128733551449	0.189309213059003
"Predict-miR-498"	-5.19694976008568	8.84118944727881	4.3385280690113	0.0372591215282553	0.189309213059003
"rna7683"	-0.9859842427703	11.8141607382242	4.30273620028341	0.0380511063458324	0.191922003539928
"Predict-miR-464"	3.23345786495886	8.02054159890914	4.26725998224095	0.0388535338998702	0.194549216846451
"Predict-miR-261"	1.49345461896565	9.65981011781234	4.18422392770209	0.040801889721105	0.202835293505637
"rna60849"	1.2027270024119	11.6841358969496	4.16059032698294	0.0413749813940083	0.203656120873187
"rna41815"	1.28244102582877	10.2216404154509	4.15317804346457	0.0415564588178282	0.203656120873187
"Predict-miR-92"	-5.2548205232927	8.81881994884398	4.12322744157325	0.0422983106275401	0.205831920025565
"Predict-miR-140"	-1.71623197052372	10.3536489908152	4.07515340016212	0.0435183144332262	0.210287799114401
"rna31208"	1.8396554672416	8.62945302641125	4.03408845043626	0.0445897579208312	0.213968907800655
"Predict-miR-153"	-5.04529890510679	8.5068171064924	3.97963596818046	0.0460535152610334	0.218333646922017
"Predict-miR-453"	-5.02900825710151	9.25100675403269	3.97311416990859	0.04623219495771	0.218333646922017
"rna11056"	4.03631035838547	7.93271859662945	3.96530000327718	0.0464472447142352	0.218333646922017
"Predict-miR-159"	-2.32616264864846	9.48025569034	3.85928250584972	0.0494714800243448	0.230978329032583
"Predict-miR-585"	-2.19509044432775	9.8469826107126	3.81055280530045	0.050930638744164	0.236195109880653
"Predict-miR-365"	-1.51643752364835	10.4365161510492	3.78365197060327	0.0517555838298818	0.237476745798393
"Predict-miR-610"	1.83288985291187	9.07940179293748	3.77074897784028	0.0521562735039	0.237476745798393
"Predict-miR-6"	-4.90451424769752	8.9221147156059	3.76812976309225	0.0522380106531921	0.237476745798393
"Predict-miR-8"	-4.92924693278442	8.97547443093246	3.73111290473623	0.0534077977264797	0.241207766202598
"Predict-miR-517"	-4.81736667439957	8.5631631614969	3.70970167161524	0.0540970591348455	0.242734206897261
"Predict-miR-24"	2.60922778367837	8.34187619310046	3.68739806849931	0.0548250793116577	0.244413740673261
"Predict-miR-249"	-1.21713267448424	12.8863121446539	3.65847916087061	0.0557845314459739	0.247096866853641
"Predict-miR-340"	2.14195550808459	8.93848618265588	3.64772371217167	0.0561458978406304	0.247113473935513
"rna39993"	-4.84725320829096	9.43751705232614	3.58231013537529	0.0583978873083947	0.255398355253802
"Predict-miR-248"	-1.02962262939361	12.9182346847149	3.53644304178558	0.0600340731513079	0.260902795896565
"rna40086"	-1.04172035925158	12.9343065476749	3.50405052204534	0.0612189274800319	0.262376278151801
"Predict-miR-593"	2.60976908027123	8.18188187644513	3.50275052523055	0.0612669952213145	0.262376278151801
"Predict-miR-541"	-2.17445792447205	10.2358951540259	3.49613474455208	0.0615122388720576	0.262376278151801
"Predict-miR-341"	-4.83615743883849	9.1712077610241	3.45173307387164	0.0631854845369351	0.267859937515473
"Predict-miR-69"	-4.8566016935633	8.88341491404841	3.36697170855032	0.0665159164173162	0.280259135636375
"Predict-miR-623"	-4.77709959658915	9.09225778229754	3.32782254862428	0.068116999155512	0.28289170397217
"Predict-miR-607"	-4.68440905566564	8.89448552421086	3.32191004247102	0.0683623623020344	0.28289170397217
"Predict-miR-422"	-4.67380720320612	9.12643149478958	3.32175265209669	0.068368906748701	0.28289170397217
"Predict-miR-225"	-1.28368569909552	10.5203200424509	3.28454413932723	0.0699350466408219	0.287649507314333
"Predict-miR-364"	3.14412285430123	9.24753365436051	3.25268770234915	0.0713064432783086	0.291554747368706
"rna69973"	2.921943056011	8.33819959924235	3.23021790965761	0.0722910688077893	0.293841932624602
"rna54456"	1.36908515693218	9.34373161135416	3.13113952116123	0.0768100339830935	0.310384406329343
"Predict-miR-269"	-4.68434401614136	9.17822116233357	3.11823966777291	0.0774203786320152	0.310428819236895
"Predict-miR-579"	-4.76311520850532	8.70842508470495	3.10911566799845	0.0778552218750574	0.310428819236895
"Predict-miR-431"	-1.22940077505585	10.996428880749	3.10257084728217	0.078168762007554	0.310428819236895
"Predict-miR-489"	-4.53879342941342	8.90118925680199	3.07149059256865	0.0796763842387269	0.313109550161277
"Predict-miR-294"	-4.59867544139768	8.7080880675786	3.06375326800111	0.080056551627087	0.313109550161277
"Predict-miR-631"	2.27330287564728	8.52164077371017	3.05234414460816	0.0806207014647473	0.313109550161277
"Predict-miR-562"	1.30238285944519	9.68182304156824	3.04403553562537	0.0810342361914169	0.313109550161277
"Predict-miR-13"	-4.55005786910234	8.75760431973649	3.04200437195713	0.0811356785259494	0.313109550161277
"Predict-miR-634"	1.05586430536422	9.76960450359329	3.03348719250473	0.0815625456281186	0.313109550161277
"Predict-miR-582"	-4.56072975467042	8.48640545369518	3.00153581089822	0.0831856264452698	0.31757606560045
"Predict-miR-234"	-4.55522397522892	8.88673962454618	2.98375587096267	0.084103897237332	0.319317543906574
"rna11052"	2.37186072018873	8.18073902577238	2.9660205133797	0.0850307885035769	0.31953106639721
"rna34589"	-4.69397111870721	8.94291903570432	2.96499021226443	0.0850849728177809	0.31953106639721
"Predict-miR-190"	-4.53585387647838	8.49926054458513	2.91922494492731	0.0875298973146627	0.326841388839983
"Predict-miR-251"	-1.98647791873827	9.66930443429034	2.91099528417732	0.0879775663158277	0.326841388839983
"Predict-miR-231"	-4.46062545366088	8.86177546687586	2.90220164808046	0.0884586569614644	0.326871293905732
"Predict-miR-484"	-4.62199594982018	8.40989304691851	2.87928181195001	0.0897260321802426	0.329790894875254
"Predict-miR-546"	-4.51513080171061	8.67961928743108	2.8575202149343	0.0909476066487726	0.33216429772141
"Predict-miR-478"	-4.4661119298818	8.82362795697825	2.85071755195248	0.0913331643517624	0.33216429772141
"Predict-miR-523"	-1.9944186016534	8.76466404709007	2.81979935828168	0.0931080414682633	0.336846369919214
"Predict-miR-485"	-4.49555352972005	8.42539409225206	2.79385505318754	0.094626335415824	0.340556238397575
"Predict-miR-230"	-4.44478242975469	8.82600566427128	2.77300643812157	0.0958659506378994	0.343229906169889
"Predict-miR-442"	-4.50579182189095	8.46857989577417	2.73698823460574	0.098049403902923	0.349237825241854
"Predict-miR-285"	-4.51287165487539	8.68509886773635	2.70329695903764	0.100140968185631	0.354858507775748
"Predict-miR-503"	-1.61444247623675	9.69309841591149	2.68812679671674	0.101098601848639	0.356424152435763
"Predict-miR-295"	-4.37912720080586	8.8834592668901	2.67985028305946	0.10162528222466	0.356462284351473
"Predict-miR-70"	-4.40915581555178	9.05875698148576	2.6544598952673	0.103259824770671	0.356944850365452
"Predict-miR-65"	-4.40131339433338	8.82423657624039	2.65383176893769	0.103300624213556	0.356944850365452
"Predict-miR-437"	-1.92542773560424	9.58074966316415	2.65364826124558	0.10331254713906	0.356944850365452
"rna9092"	-0.798845467319619	11.8700808205735	2.61549322854994	0.105824616503644	0.362052904266589
"Predict-miR-518"	-1.297019606342	10.6497763147839	2.61527898207872	0.105838909785602	0.362052904266589
"Predict-miR-545"	1.77035572393434	8.43464515617042	2.59730744798101	0.107045437847074	0.364376342622305
"rna37801"	3.50581112657002	7.96618345740545	2.57452245679685	0.10859686980608	0.366562038539054
"Predict-miR-596"	-4.38957139978251	9.11090639776035	2.57231465659612	0.108748506368316	0.366562038539054
"Predict-miR-46"	-4.28729440594013	8.19209768949801	2.55775612483558	0.109754262638794	0.367175117023103
"Predict-miR-119"	-4.28832890880324	8.48813419938108	2.55432009107142	0.109993124781161	0.367175117023103
"Predict-miR-502"	-4.30180194691229	8.48757844042982	2.53433551384331	0.111393772122303	0.370062964117844
"Predict-miR-416"	-1.943536103847	9.60737968577729	2.52251444034998	0.112231499807884	0.370079432431571
"Predict-miR-101"	-4.29466534193489	8.48791799616583	2.51916856311412	0.112469870927106	0.370079432431571
"Predict-miR-475"	-4.29078261090476	8.78491103897303	2.51153883611465	0.113015525771072	0.370112456435123
"Predict-miR-509"	1.83143826443383	8.32894308880511	2.50164202475163	0.113727665937558	0.370687816805909
"Predict-miR-474"	-4.27400678876539	8.74485672284428	2.4713912727638	0.115935262980956	0.374502341151513
"Predict-miR-18"	-4.30292535037433	8.96626216967296	2.47075891907469	0.115981911731438	0.374502341151513
"Predict-miR-185"	-4.50682310224221	8.80815921165808	2.46116343808916	0.116692319972788	0.375043688842774
"Predict-miR-476"	-4.3931522247433	8.53917755388688	2.44642980419965	0.117792510150793	0.376826965343508
"Predict-miR-195"	-4.19362392764524	8.45591962502155	2.38861306304337	0.12222202125869	0.387513037329278
"rna39356"	-1.10651719871262	14.3034995452275	2.38819806817214	0.122254474873781	0.387513037329278
"Predict-miR-3"	-4.19334290492618	8.89960979254248	2.37304487191707	0.123446063140479	0.387753038528278
"Predict-miR-200"	2.72869182226297	8.50275290803005	2.37296362206813	0.123452486940986	0.387753038528278
"Predict-miR-458"	-4.30006723070363	8.88667087147664	2.34977372985088	0.12530119360349	0.387826169372585
"rna11484"	2.77629062791544	7.76178388046727	2.3485974809433	0.125395780608815	0.387826169372585
"Predict-miR-487"	-4.30334576919507	8.53052590601621	2.34377973847699	0.125784023984259	0.387826169372585
"rna44328"	-4.18146733826203	8.64055710362936	2.34114832680357	0.125996643375639	0.387826169372585
"rna50694"	2.72437382725298	7.84829187730379	2.33735517437061	0.126303835426172	0.387826169372585
"Predict-miR-506"	-4.22757234604438	8.78804373669002	2.33071882971812	0.12684329128539	0.387826169372585
"Predict-miR-490"	1.50718082088223	12.0693855699734	2.27698309993916	0.131307072835164	0.396456110414763
"Predict-miR-439"	-1.7997399687201	9.84266059903139	2.26733610368378	0.13212684016518	0.396456110414763
"Predict-miR-37"	-1.43460179248054	9.87064914950797	2.26597525409762	0.132242939413741	0.396456110414763
"Predict-miR-355"	-4.25889064086376	8.62352242635779	2.25413610626825	0.13325780295793	0.396456110414763
"Predict-miR-215"	-1.80202534172669	9.86732008207768	2.25284086109905	0.133369359639649	0.396456110414763
"rna10531"	1.61443208394665	9.20479482306239	2.25031438540672	0.133587259991236	0.396456110414763
"Predict-miR-247"	-1.76903463089641	9.60612511349757	2.23585668762117	0.134841870172901	0.396456110414763
"Predict-miR-151"	-4.09280219479912	8.70361939456458	2.2184996388634	0.136365523930916	0.396456110414763
"Predict-miR-427"	-4.23361323540849	8.60324184543566	2.21783103254359	0.136424600478664	0.396456110414763
"Predict-miR-217"	2.0269305800075	8.24705677735465	2.21536757529683	0.136642513481304	0.396456110414763
"Predict-miR-443"	2.67063722258196	7.85849158200692	2.21297596921818	0.136854443674119	0.396456110414763
"Predict-miR-35"	-4.15036580978184	8.36598616257092	2.2107908456335	0.137048398517933	0.396456110414763
"Predict-miR-63"	2.85249561079258	7.94529799737071	2.20422360300352	0.137633173049492	0.396456110414763
"Predict-miR-152"	-4.09361884730716	8.59503021618406	2.20041062861348	0.137973978952081	0.396456110414763
"Predict-miR-278"	-1.14201245047227	10.7637922445449	2.18691990545314	0.139187406481384	0.396456110414763
"Predict-miR-267"	-4.15289906560457	8.65065054542607	2.17770185617115	0.140023411673392	0.396456110414763
"Predict-miR-87"	2.1033277552192	8.31748021447382	2.17303637542248	0.140448681762517	0.396456110414763
"Predict-miR-253"	-4.1922359551775	8.36876293165003	2.17207337842386	0.140536641785706	0.396456110414763
"Predict-miR-260"	-1.76052579267935	9.95130506964522	2.17174196103903	0.140566927715799	0.396456110414763
"Predict-miR-299"	-1.2736508740187	10.1464152788952	2.09785969559672	0.147505491190826	0.412994643855262
"Predict-miR-292"	-1.92728542205211	9.77259070953632	2.09150766799054	0.148119831366306	0.412994643855262
"Predict-miR-626"	-4.13080968064271	8.41626690384792	2.090435231987	0.14822383744733	0.412994643855262
"Predict-miR-497"	-4.16503262955348	8.90874126640152	2.04632955981415	0.152573635007984	0.421573818244197
"Predict-miR-12"	-3.98580923590401	8.56641582784659	2.04236733512541	0.152971418972419	0.421573818244197
"Predict-miR-98"	-3.99139422975314	8.62180882557673	2.04075939835519	0.153133181446156	0.421573818244197
"rna51016"	-0.692681563527228	11.2578142947779	2.03429394501469	0.153785582438145	0.421689831209359
"Predict-miR-348"	1.4439359423501	8.8185591654878	2.02061330525628	0.155176455024312	0.422975190140525
"Predict-miR-257"	-3.974627028168	8.37893115818652	2.01521226092223	0.155729490229928	0.422975190140525
"Predict-miR-48"	2.81471249480319	8.01831174123971	2.00962067717674	0.156304394680941	0.422975190140525
"rna44066"	-0.718922101490167	16.7748748989471	2.00086723357697	0.157209237521318	0.422975190140525
"rna60851"	1.44404520062127	8.89542343405765	1.99984840045216	0.157314940471946	0.422975190140525
"rna19198"	-1.65788560620364	9.24134423911573	1.98281670120624	0.159093987394341	0.426100563137557
"rna9093"	-4.02224710228727	8.57918591446487	1.97342821605394	0.16008444587792	0.427097884562326
"rna38012"	1.76932013480152	8.35991745508123	1.96091698713418	0.161415282296702	0.428992154103927
"rna50768"	-0.899913883313694	12.8766403508374	1.95122139156105	0.162455294935893	0.430101949427976
"Predict-miR-320"	-1.66650492346159	9.23533499679827	1.89263836695322	0.168904639943086	0.445392032145009
"Predict-miR-273"	-3.95616514935309	8.59488216673147	1.87995171491627	0.170339635753303	0.445392032145009
"Predict-miR-22"	-3.86725533322613	8.31830211311109	1.87742623977608	0.170626960925782	0.445392032145009
"Predict-miR-263"	-3.87008595213716	8.29198986216098	1.87379379324757	0.171041203429647	0.445392032145009
"Predict-miR-42"	-3.87440000172051	8.40641152653531	1.87018954101916	0.171453372721523	0.445392032145009
"Predict-miR-600"	-4.06654141138002	8.33085337010225	1.85752007590523	0.172911292104263	0.447497014397176
"rna30256"	0.87011958344342	10.7092676189618	1.84811726055749	0.174002526970831	0.448640843794194
"Predict-miR-441"	-1.69980591753526	9.91197363359268	1.82191349793797	0.17708567659067	0.454892946186443
"Predict-miR-625"	-1.63139452699206	9.02992003969963	1.80773437024233	0.178780252627361	0.457545016909284
"Predict-miR-183"	1.86510387517598	8.23093459935557	1.79325527726464	0.180530042426861	0.45821612021106
"rna848"	-0.632550988981555	11.7377319978968	1.79294093172759	0.180568249963135	0.45821612021106
"Predict-miR-287"	-1.59043390175244	9.19205660144877	1.78913295761573	0.181031839099305	0.45821612021106
"Predict-miR-605"	-1.69329984691938	9.67565605967671	1.78363189231218	0.181703982674453	0.45823887601477
"Predict-miR-334"	-1.61861070183527	8.99603621291798	1.76325174933474	0.184219438016401	0.462893206070301
"Predict-miR-162"	1.05783262400046	10.69433215859	1.75727246964014	0.184965087473824	0.463082882044971
"rna12554"	-3.94606653970947	8.36518894003644	1.7437188660287	0.186668310874954	0.464537357300266
"Predict-miR-31"	-3.91587707054337	8.57226987662962	1.74196079985654	0.186890572112118	0.464537357300266
"Predict-miR-440"	-1.25297468372055	10.0014613845614	1.73068864534073	0.18832297507502	0.465129552280443
"Predict-miR-203"	-1.62023135922587	9.09478682521643	1.72468423450935	0.189091196076044	0.465129552280443
"Predict-miR-39"	-3.83590815254742	8.53140023471492	1.72423984732677	0.189148197092337	0.465129552280443
"Predict-miR-229"	-3.83522312856839	8.65977688227527	1.71207788652001	0.190715997153582	0.465139933527697
"Predict-miR-473"	-3.84722571658716	8.78686845323021	1.71184694004978	0.190745914727185	0.465139933527697
"Predict-miR-420"	-3.73886179686906	8.21634866937664	1.70602023205933	0.191502540281059	0.465139933527697
"Predict-miR-332"	-3.96198017656032	8.60202604329664	1.70339195757246	0.191844979819672	0.465139933527697
"rna19536"	-0.813911867986059	12.9450741068605	1.68590539277745	0.194141609144339	0.468326164797179
"Predict-miR-220"	-3.73451061034601	8.45651002025239	1.68301608655048	0.194524167166292	0.468326164797179
"rna50769"	1.57331964204012	8.30053320432768	1.6681804521204	0.196502425228828	0.468326164797179
"Predict-miR-169"	1.27545466553784	10.1065966648299	1.65328408139541	0.198512538824692	0.468326164797179
"Predict-miR-319"	-1.63388116045501	9.23237411195862	1.65268936260237	0.198593289385091	0.468326164797179
"Predict-miR-549"	-3.74730206579601	8.38674168978745	1.6460109962938	0.199502726542263	0.468326164797179
"Predict-miR-85"	-3.79315246351917	8.2617766648036	1.64380362621689	0.199804393324126	0.468326164797179
"Predict-miR-470"	-3.83598465076067	8.5840308754385	1.64347687181518	0.199849094215674	0.468326164797179
"Predict-miR-310"	-3.77083799798419	8.60079640502422	1.64345254169263	0.199852423112574	0.468326164797179
"Predict-miR-349"	-1.74827058718711	9.52280702028295	1.63797208338323	0.200603933567199	0.468326164797179
"rna18860"	-3.73464179087367	8.54074603229351	1.63789598558812	0.200614391866809	0.468326164797179
"rna51239"	-1.54963990702341	9.37415454600787	1.62529823343393	0.202354604265119	0.4707980860175
"Predict-miR-557"	-3.95675316553836	8.39987943434986	1.60575649732785	0.205089335132668	0.475559498579442
"Predict-miR-615"	-3.74523102324927	8.00436246573449	1.5922915096115	0.206999046326379	0.47774372863356
"Predict-miR-616"	-1.51512938126625	9.30848810980508	1.58938470361816	0.207414064529765	0.47774372863356
"Predict-miR-212"	-3.7488326664245	8.21869757277845	1.54677977707232	0.21361146330106	0.49038379116622
"Predict-miR-568"	-3.59966830745355	8.37654637988661	1.53648104618534	0.215142355319253	0.490572109766026
"rna23853"	-3.59901980130499	8.28629807167707	1.53578926403703	0.21524565457665	0.490572109766026
"Predict-miR-391"	-3.59873853855148	8.79967879751343	1.52853860500574	0.216331906633586	0.490572109766026
"rna37802"	2.09659080971597	8.23377221864856	1.52541693739905	0.216801586035854	0.490572109766026
"rna55115"	-1.5271196011211	9.1164473076074	1.52248900507296	0.217243220822582	0.490572109766026
"Predict-miR-379"	2.10688663679688	9.83491003105417	1.50164193024467	0.220418896885804	0.496122012208764
"rna46984"	2.0771292138872	7.92066350630791	1.46071497072471	0.226816395697935	0.508864056582056
"Predict-miR-447"	2.06687758983104	7.98977338218814	1.43432274645072	0.231060257510671	0.515227674630521
"rna30134"	-0.580365261237507	11.9048612823613	1.43380717721267	0.231144108734387	0.515227674630521
"Predict-miR-77"	1.50314567132399	8.31179423787962	1.41492049952833	0.234241276660929	0.520452482870425
"Predict-miR-575"	2.07487286290626	7.88679136099305	1.40919607343499	0.235189895459903	0.520885313342286
"rna2228"	-1.06422725955515	11.2679048949464	1.3985887426335	0.236960004059744	0.523128954649467
"Predict-miR-239"	-1.13234576569552	9.63838728847048	1.39344245340314	0.237824610888964	0.523365624599598
"Predict-miR-454"	-3.62826126386349	8.17788535015074	1.37270717007934	0.241347298503895	0.529431692908544
"Predict-miR-594"	-3.44522401523288	8.21219721956944	1.36645452022234	0.242421981443556	0.530106294865498
"Predict-miR-539"	1.40035192539739	8.81593232452184	1.35226451321904	0.244882621395624	0.532422276032359
"Predict-miR-118"	-3.43671629519595	9.0574605571816	1.35146527725422	0.245022118347743	0.532422276032359
"rna61260"	-3.53002323576238	8.21412192663205	1.33872760698882	0.247258481960429	0.535597526754409
"Predict-miR-255"	-3.58430082472148	8.43715386445947	1.33120838193831	0.248590359132133	0.536799806750949
"Predict-miR-322"	-3.42780227099586	7.92137819536356	1.32161242834432	0.250302875140875	0.538813977328175
"rna41496"	-0.569740945565883	11.2834194671721	1.31398795883586	0.251673881138058	0.540082769771422
"Predict-miR-286"	-0.916394696775413	10.8867214982272	1.28380181472503	0.257193347136502	0.550218584740938
"Predict-miR-630"	-3.46901406097248	8.57215146914719	1.26144476013849	0.261377794295075	0.557444616845361
"rna31047"	0.746086045676516	10.3293225314708	1.23565664155628	0.266309769800104	0.566215541328837
"Predict-miR-84"	-3.58682195604113	8.17997129106796	1.22498251160401	0.268385043860837	0.568877500944289
"Predict-miR-51"	-1.40586450535587	9.75104523729322	1.22040172299242	0.269281828129995	0.569032853938307
"Predict-miR-115"	-3.40616785266339	8.50713443471732	1.21152459689209	0.271030389450357	0.570087101050114
"Predict-miR-137"	-3.33169349435371	8.18958929991853	1.19662007624659	0.273998264121973	0.570087101050114
"Predict-miR-213"	-3.27102738530502	8.17122573937028	1.19546148189141	0.274230672379277	0.570087101050114
"Predict-miR-488"	-3.27037457306786	8.38928631161834	1.19498322746647	0.274326679949227	0.570087101050114
"Predict-miR-2"	-3.26996331788217	8.0721339273452	1.19460235126571	0.274403169419135	0.570087101050114
"Predict-miR-148"	-3.29959854947594	8.78843465818496	1.19297227725736	0.274730831620388	0.570087101050114
"Predict-miR-181"	-3.29432551606696	8.42354643915719	1.18326143946479	0.276693030124097	0.572439771903446
"Predict-miR-241"	1.03630141756387	8.38787718981506	1.16463286418345	0.280506793209223	0.578169782267579
"Predict-miR-578"	-3.2544151722919	8.06244789375644	1.16158966122551	0.281136102520849	0.578169782267579
"rna49430"	-1.10868704007036	9.76569547251887	1.15431776078097	0.282647111778256	0.579249219172144
"rna20046"	-3.2594219064076	8.88936493406554	1.15101137192523	0.283337534124725	0.579249219172144
"Predict-miR-326"	-1.35138329616159	8.93918098402327	1.14123281905396	0.285391977312395	0.580043632782067
"Predict-miR-392"	-3.44687753664678	8.1726538280074	1.13670285653	0.286350110076954	0.580043632782067
"rna40085"	-0.79790454443915	10.1741052014231	1.13263457370709	0.287214076496814	0.580043632782067
"rna6960"	-0.487669160422315	11.7561090704988	1.12562965560756	0.288709464740564	0.580043632782067
"Predict-miR-436"	-3.23891048939736	8.20430173044795	1.12387150263917	0.289086343965711	0.580043632782067
"Predict-miR-479"	0.82011560803856	10.0802436202508	1.12338513310063	0.289190713155355	0.580043632782067
"Predict-miR-311"	-1.37159776784091	9.11838676291414	1.12147019440301	0.289602103197993	0.580043632782067
"Predict-miR-504"	-1.01780125489889	9.25786459173155	1.11628726597203	0.290719308452004	0.580598387688829
"Predict-miR-164"	-3.32599420041071	8.02864672350456	1.08793879558165	0.296928356733107	0.589373586090767
"Predict-miR-44"	-3.32745788101589	8.1014955968084	1.07910121287674	0.298898707825398	0.589373586090767
"Predict-miR-467"	-1.06087596185128	9.35295196671524	1.06684650791636	0.301658832867842	0.589373586090767
"Predict-miR-245"	-1.0528543516659	9.6300089799721	1.06387437698106	0.302333189852785	0.589373586090767
"Predict-miR-555"	0.763813467632162	11.4952475112931	1.06068174010639	0.303059747355148	0.589373586090767
"Predict-miR-132"	1.37386106739981	8.71969029469654	1.05203652899652	0.305038521779257	0.589373586090767
"Predict-miR-573"	0.802000956819404	10.0493204844553	1.03922440662494	0.308001923022278	0.589373586090767
"Predict-miR-218"	-3.2859359955366	8.28802082847187	1.0321305335725	0.309658791412825	0.589373586090767
"Predict-miR-272"	-3.10462403031985	8.65897170990676	1.03164489299068	0.309772642518362	0.589373586090767
"Predict-miR-519"	-3.11302384392292	8.14960470954338	1.03100748752288	0.309922155258508	0.589373586090767
"Predict-miR-460"	-3.1241766884576	8.0081306695197	1.03074887165867	0.309982844149827	0.589373586090767
"Predict-miR-356"	-1.25461826704893	9.23844180653295	1.03071918732167	0.309989811105724	0.589373586090767
"Predict-miR-29"	-3.07296996664808	8.40697061768428	1.02455542221381	0.311440881910681	0.589373586090767
"Predict-miR-608"	-3.07297060150377	8.012944721316	1.02450755880815	0.311452184470667	0.589373586090767
"Predict-miR-383"	-3.07297063105269	7.98720374187236	1.02450531453736	0.311452714450364	0.589373586090767
"Predict-miR-501"	-3.10570149624689	8.36907824054757	1.02394600238252	0.311584831458387	0.589373586090767
"Predict-miR-68"	-3.08006515787477	8.10416154127467	1.02272193722517	0.311874226974417	0.589373586090767
"Predict-miR-335"	-3.06979023367236	8.17877112763836	1.01903159056817	0.312748828755412	0.589373586090767
"Predict-miR-468"	1.65821995028534	8.18882088468909	1.01792588112922	0.313011501664982	0.589373586090767
"Predict-miR-569"	-3.09368010500479	9.79995630201463	1.01496442252092	0.313716447470964	0.589373586090767
"Predict-miR-450"	-3.07291522079043	8.36096832390371	1.01266481639612	0.3142652768373	0.589373586090767
"Predict-miR-346"	-0.793684131517096	10.3018273369294	1.00987394050825	0.314933040855522	0.589373586090767
"rna15526"	1.66813432948196	8.11462466574028	1.00933246073378	0.315062813873379	0.589373586090767
"Predict-miR-472"	-3.0586321673171	9.64571662452403	1.00716265026085	0.315583541032682	0.589373586090767
"Predict-miR-116"	0.441766873977063	11.7057724826134	1.00335881940048	0.31649913452794	0.589490301775759
"rna63088"	-3.08780849688814	8.19862737167404	0.994730524828496	0.318588934911706	0.591109481650065
"Predict-miR-363"	1.07924206385028	8.79354443418063	0.987077148390224	0.320457795739684	0.591109481650065
"rna34999"	1.64238072881576	7.94513371316303	0.986885542472217	0.320504768300499	0.591109481650065
"Predict-miR-204"	-3.06974964512115	8.10722541830559	0.985721869543383	0.320790239679847	0.591109481650065
"rna44409"	1.64655118819904	8.06635018844755	0.976963734461819	0.322949562565865	0.593505712055886
"Predict-miR-336"	-3.04001921288793	8.33334522400614	0.96960187766501	0.324779489523316	0.595285483449897
"Predict-miR-74"	-3.07305242794034	8.03406668685739	0.963043180950582	0.326421339660652	0.596712025675954
"Predict-miR-426"	-1.29858283424192	9.86734068429686	0.943030729449539	0.33149963250168	0.603486836393543
"Predict-miR-433"	1.63930856423532	8.21679753728616	0.941571216236376	0.331874092372716	0.603486836393543
"Predict-miR-406"	-0.986428165426997	10.1705041828197	0.930142378471823	0.334825930856463	0.607256478272483
"Predict-miR-423"	1.68000834827307	8.0400132059534	0.916243387804034	0.338463273056774	0.6122463918383
"Predict-miR-540"	-1.22498938079652	9.02187584702235	0.906344441796666	0.341086209966075	0.615380081165947
"Predict-miR-197"	-3.01501098349406	8.17420033215292	0.900144649136426	0.342742928363538	0.616758759112512
"Predict-miR-520"	-0.9434226569324	9.86424645046652	0.891719654956489	0.345011722846218	0.619228832433082
"Predict-miR-277"	0.837050925737924	9.16489854696745	0.881488707494531	0.347794258449279	0.622605783907906
"Predict-miR-207"	-1.16830320679231	8.88874379643202	0.873584498629702	0.349964875594369	0.624872684846794
"Predict-miR-565"	-1.267225166319	8.98683019490733	0.865747764082435	0.352135203434278	0.625151920435382
"rna27274"	-2.93495440907009	8.08210343939581	0.858966433218566	0.354028089585581	0.625151920435382
"Predict-miR-94"	-2.8684610782288	7.97912037611263	0.85599979495959	0.354860547091628	0.625151920435382
"Predict-miR-86"	-2.84374026385566	8.05121961084563	0.853789869165793	0.355482408378544	0.625151920435382
"Predict-miR-34"	-2.84374012328646	8.03990586423498	0.853789057840724	0.355482636955023	0.625151920435382
"Predict-miR-408"	-2.84333684799619	7.89796799874375	0.853551759040271	0.35554950033445	0.625151920435382
"Predict-miR-52"	-2.84286549713363	8.45193787189683	0.84857042430047	0.356957072588941	0.625428616792838
"Predict-miR-187"	-2.91414209520857	7.89950862956653	0.846596062961044	0.357517081958279	0.625428616792838
"Predict-miR-325"	-1.14721933939716	8.95409528647473	0.838631776857358	0.359788376706521	0.625956630084664
"Predict-miR-308"	-2.82923357112871	8.20162375587807	0.838584780660507	0.359801838153143	0.625956630084664
"rna35738"	-2.92660754512202	8.28950593087874	0.832199691088036	0.3616372356806	0.625956630084664
"Predict-miR-551"	-2.82259936548265	8.24256501532166	0.829587943754069	0.362391706420327	0.625956630084664
"Predict-miR-614"	-2.8615432042446	8.23255810342049	0.826489993178701	0.363289451686154	0.625956630084664
"Predict-miR-123"	-2.82840142583009	8.11153597603091	0.826234777396907	0.363363546875507	0.625956630084664
"Predict-miR-456"	-2.81656045028263	8.43688171310676	0.823488836507623	0.364162082790963	0.625956630084664
"Predict-miR-360"	-2.81547235802283	7.84159848406661	0.820390976410422	0.365065878327235	0.625956630084664
"Predict-miR-32"	-2.80086458431645	8.04922214039336	0.802117057013812	0.370461157119375	0.633573473801185
"Predict-miR-377"	-2.83472879774233	8.10966882151193	0.799169117845357	0.371341905773487	0.633573473801185
"Predict-miR-298"	1.36361841536085	8.68997740408605	0.787991721808002	0.374708076325794	0.637742070790946
"Predict-miR-347"	0.750312744688287	9.24501701015422	0.765282209399102	0.381680507225992	0.648012851334546
"Predict-miR-54"	0.393876250182959	11.5211791509614	0.755742722753437	0.384664119242319	0.650947237917624
"Predict-miR-333"	-2.83352916167499	8.07428174374096	0.753745594738941	0.385292938217523	0.650947237917624
"rna847"	-2.74803583907457	8.1560561558784	0.744332896584554	0.388276422264477	0.654387823865252
"Predict-miR-262"	-1.13271310175185	8.9433086137	0.738209056410504	0.390235185849525	0.655348050572309
"Predict-miR-210"	-2.74319604457254	8.11015233983805	0.736628681166746	0.390742976607513	0.655348050572309
"Predict-miR-290"	-1.1913242618025	8.87867037398784	0.726478702224005	0.394026964831168	0.658210120630132
"Predict-miR-395"	-1.14645059175258	8.84697954406906	0.719148827691781	0.396423251081335	0.658210120630132
"rna29117"	0.860598253166289	9.03063860696733	0.705823148332692	0.400833922450372	0.658210120630132
"Predict-miR-597"	1.07112658842547	8.91529615940744	0.704923465087077	0.401134267416249	0.658210120630132
"Predict-miR-163"	0.736144997779003	10.8338577848117	0.703455638141506	0.40162498024449	0.658210120630132
"Predict-miR-79"	-2.65913881673093	8.01888116553651	0.698006920993426	0.403454209133204	0.658210120630132
"Predict-miR-170"	-2.6399533599316	8.43439637972942	0.696720961886223	0.403887696953661	0.658210120630132
"Predict-miR-99"	-1.09613169435142	8.9845760504042	0.688144820044329	0.40679611386034	0.658210120630132
"Predict-miR-324"	-2.60565554242118	8.05483746652429	0.686736167448795	0.407276754728935	0.658210120630132
"Predict-miR-384"	-2.59151362613324	8.09372508779263	0.686571967625733	0.407332834820893	0.658210120630132
"Predict-miR-632"	-2.58976955370165	8.17198929522944	0.685686344901058	0.407635501675612	0.658210120630132
"Predict-miR-577"	1.33561595129781	8.36788698230284	0.683713617014373	0.408310879134519	0.658210120630132
"Predict-miR-11"	-2.57216604989769	8.19975821441776	0.683541753068278	0.408369795664435	0.658210120630132
"Predict-miR-125"	-2.57139926348141	8.26535259265327	0.683197017429221	0.408488011789282	0.658210120630132
"Predict-miR-477"	1.32124740358938	8.1168982005595	0.683111208099625	0.408517445173575	0.658210120630132
"Predict-miR-414"	-2.57916867124022	8.12891795781309	0.6829913548572	0.408558561139521	0.658210120630132
"Predict-miR-401"	-2.57042828112626	8.05878693136764	0.682745992798727	0.40864275217124	0.658210120630132
"Predict-miR-117"	-2.56868780804755	8.03399555084624	0.677780754068583	0.410351962480996	0.658238967201259
"Predict-miR-586"	-2.57871647787279	7.98678758202419	0.677161584270205	0.410565839166053	0.658238967201259
"Predict-miR-194"	1.33542059673397	8.3071952701806	0.672578687254495	0.412154001432546	0.659255590254373
"Predict-miR-192"	-2.55173151597209	8.2169603059316	0.663565321848994	0.415304065253893	0.660684817117775
"Predict-miR-134"	1.55364479289189	8.72041557931517	0.663208449469384	0.415429519953818	0.660684817117775
"Predict-miR-206"	-2.55194048278841	8.31765376067295	0.661826350626816	0.415915912367919	0.660684817117775
"Predict-miR-567"	-2.63097229400674	7.96991623759292	0.658649294335348	0.417037198503991	0.660946569188665
"Predict-miR-67"	1.31039237659428	7.95784231109425	0.655192587314712	0.418262288825932	0.661371262193865
"Predict-miR-529"	0.662629190913717	10.8927277722526	0.647698130877153	0.420936861949918	0.664080757094505
"Predict-miR-404"	-2.51750713909522	8.21629091030848	0.636953881885232	0.424815997921646	0.668264688211759
"Predict-miR-533"	-1.04722644907136	8.52584270401544	0.632477867563244	0.426447869968483	0.668264688211759
"Predict-miR-410"	-0.708068096830231	10.1063276362687	0.632362107381109	0.426490198988981	0.668264688211759
"Predict-miR-421"	-0.993083884618774	9.04476093733953	0.617943541500919	0.431812506841875	0.675073398705283
"Predict-miR-462"	-0.476422838373323	11.3769368493769	0.611191924238199	0.434339382264425	0.677491000326676
"Predict-miR-402"	-1.04352845291763	8.95035091550379	0.602303048170057	0.43770065559825	0.681196290581962
"Predict-miR-55"	1.26733457223505	7.96228813184194	0.597915369141864	0.439374514377024	0.681933274641348
"Predict-miR-357"	0.731742114664823	9.14900753825055	0.595896588918997	0.440147960188193	0.681933274641348
"rna55111"	0.527651366526356	13.2147327657316	0.588781432034619	0.44289071860982	0.684647620938224
"Predict-miR-121"	-0.641618244590234	10.432316482062	0.57261341358149	0.449222280359411	0.692885258322216
"Predict-miR-90"	1.24703805703432	8.0372123866844	0.561062968055047	0.45383227340101	0.698436750378838
"rna49429"	0.554479357179314	10.5254847146854	0.521273108487019	0.470299114865144	0.708288292469577
"Predict-miR-617"	-2.30260523376071	7.93190382184165	0.520704138549119	0.470541471016673	0.708288292469577
"Predict-miR-316"	-2.27592783222505	7.81741565715183	0.51862339466248	0.471429494057334	0.708288292469577
"Predict-miR-23"	-2.24713773581376	7.92666770659124	0.513289970314103	0.473718110911354	0.708288292469577
"Predict-miR-100"	-2.23578973674723	8.10438464727125	0.512676983887527	0.473982300875744	0.708288292469577
"Predict-miR-186"	-2.23957507291063	8.47799576453789	0.512603380597469	0.474014039096057	0.708288292469577
"Predict-miR-141"	-2.23541357151163	7.90412895194068	0.512544302776996	0.474039516332397	0.708288292469577
"Predict-miR-371"	-2.23511085326176	8.05411131806543	0.512444438726694	0.47408258762986	0.708288292469577
"Predict-miR-583"	-2.23511314201334	7.9571884512259	0.512443066031264	0.474083179716696	0.708288292469577
"Predict-miR-382"	-2.23470998794066	7.84882674205982	0.512303526450661	0.47414337379784	0.708288292469577
"Predict-miR-108"	-2.23442277643906	8.02841726071589	0.512209494597129	0.474183943912215	0.708288292469577
"Predict-miR-256"	-2.23430931141527	8.03761250415586	0.511931385110748	0.47430396742637	0.708288292469577
"Predict-miR-531"	-2.2331120362228	7.84853896791336	0.510040673374296	0.475121249421752	0.708288292469577
"Predict-miR-271"	-2.23051462881539	7.96266461445973	0.509815608579141	0.475218688610262	0.708288292469577
"Predict-miR-556"	-2.44059018139501	7.84622380878692	0.508914990955654	0.475608925768283	0.708288292469577
"Predict-miR-534"	-2.23060925921433	7.94034578270987	0.506541689543345	0.476639776716962	0.708296958519184
"Predict-miR-150"	0.838288404236306	9.08604765716523	0.500614828789193	0.479230096272375	0.710618018292299
"rna38809"	-2.20701328910866	7.78377407993715	0.493950272675817	0.482170450120471	0.713447068593674
"Predict-miR-16"	-1.00069386934938	8.63003059318651	0.49014147823423	0.483864201039835	0.714423425039585
"Predict-miR-78"	-2.19682333194996	8.1409953857343	0.486098714300734	0.485672759202121	0.715564768888413
"Predict-miR-191"	-2.16704542022745	8.12519570262024	0.475098942690371	0.490650721526585	0.721360954414618
"Predict-miR-81"	0.660077857072829	9.11789887303037	0.467416199108744	0.494178245388424	0.722837544095546
"Predict-miR-236"	-2.15109206228932	8.17776070086664	0.464748329906994	0.495413155787783	0.722837544095546
"Predict-miR-208"	0.33982871490241	11.7636608357212	0.462292931873399	0.496554313670908	0.722837544095546
"Predict-miR-254"	-2.16781830077091	8.25616737546081	0.458702319100823	0.498231071286815	0.722837544095546
"Predict-miR-550"	1.04891147531964	8.13826341283053	0.451678640360279	0.501538870945055	0.722837544095546
"Predict-miR-396"	1.04826386117103	8.25074208976962	0.451236283940386	0.501748446805526	0.722837544095546
"Predict-miR-411"	0.750746365302774	8.67361496161708	0.449803485776987	0.502428290599724	0.722837544095546
"Predict-miR-500"	1.00080529112259	8.30350206797548	0.447933746665464	0.503317821825426	0.722837544095546
"rna29819"	-0.677000397182328	9.53040729337849	0.44790051464174	0.503333656314323	0.722837544095546
"Predict-miR-606"	-0.89584676586564	8.72850840680299	0.447496838554942	0.503526068984443	0.722837544095546
"rna69979"	1.19941450721389	8.28645534779083	0.443468454952866	0.505453113178906	0.722837544095546
"Predict-miR-58"	-0.722330079428193	9.78175027996752	0.441885878784021	0.506213623718467	0.722837544095546
"Predict-miR-93"	-2.26039231370166	7.89782772870843	0.441793594020435	0.506258031942506	0.722837544095546
"Predict-miR-73"	1.04328939898677	8.18638234464386	0.439768956246324	0.507233991415734	0.722837544095546
"Predict-miR-47"	-2.11724310171699	7.8945984550988	0.439536653391812	0.507346177838408	0.722837544095546
"Predict-miR-560"	0.772615583148666	8.90370222779177	0.435318481734921	0.509390723250946	0.724257180589308
"Predict-miR-366"	-0.642565724204618	8.8738988218021	0.42308147119922	0.515403441196847	0.731301391924069
"Predict-miR-389"	-0.645753732849424	9.73971863399068	0.399383663413062	0.527407730469491	0.746800700316431
"Predict-miR-226"	-1.91515393903489	8.06342036742586	0.355314629941423	0.551119955688961	0.765302162490673
"Predict-miR-553"	-1.95115209035696	7.82887265729034	0.353461367009693	0.552160243956251	0.765302162490673
"Predict-miR-611"	-0.606922891513501	10.2616902536658	0.35023034937737	0.553982763840022	0.765302162490673
"Predict-miR-199"	-1.82778255965504	7.90217727336594	0.346256479450908	0.556239934568698	0.765302162490673
"rna39357"	-0.818310796862274	8.79238484301414	0.346023531803649	0.556372789951997	0.765302162490673
"Predict-miR-455"	0.649604955075485	8.78985843188788	0.344265185345181	0.55737756173287	0.765302162490673
"Predict-miR-624"	-1.84191081483563	7.81676970776838	0.344218306373814	0.557404396956986	0.765302162490673
"rna799"	-1.8249668997714	7.84545715006563	0.343833846187984	0.557624568641138	0.765302162490673
"Predict-miR-604"	-1.8210865901064	7.79006261915374	0.343632268976068	0.557740073477741	0.765302162490673
"Predict-miR-393"	-1.79610456520856	7.81894516893771	0.341732588681053	0.558830842135191	0.765302162490673
"Predict-miR-122"	-1.79569298049389	8.17828613666435	0.341642691720447	0.558882560396075	0.765302162490673
"Predict-miR-628"	-1.79569686049858	7.81529220500055	0.341639922111819	0.558884153913493	0.765302162490673
"Predict-miR-238"	-1.79499801004983	7.95152939290969	0.341482436402547	0.558974778888613	0.765302162490673
"rna9028"	-1.79422005655208	7.92849416487513	0.340973853644881	0.559267633834808	0.765302162490673
"Predict-miR-50"	-1.79815109221887	7.90120876225306	0.339834299883969	0.559924882775295	0.765302162490673
"Predict-miR-71"	-1.80403314927351	7.79155753875847	0.339652526710335	0.560029858768626	0.765302162490673
"Predict-miR-491"	-1.78584303499119	7.95261509982316	0.338418373209674	0.560743592635448	0.765302162490673
"Predict-miR-95"	-1.80063590189862	7.95587645426544	0.337849566942365	0.561073130426942	0.765302162490673
"Predict-miR-512"	-1.80165364597003	7.87164917792947	0.336975253494172	0.561580388116668	0.765302162490673
"Predict-miR-434"	-1.78283603600558	7.75472430152151	0.334652732496771	0.562932149567978	0.765302162490673
"Predict-miR-156"	-1.80545714607881	8.29047675131669	0.333283546855339	0.563731983658108	0.765302162490673
"Predict-miR-572"	-0.390443632455696	10.418628377911	0.329332240534896	0.566052553830437	0.766945715091828
"Predict-miR-250"	-1.7550958663971	7.81298636314671	0.327214092172259	0.567304154672747	0.767137320702285
"Predict-miR-62"	-1.81711665179782	7.88560697984477	0.320021645838908	0.571594636888662	0.771429480644659
"rna11059"	-1.70955138320017	8.10243069958928	0.307103895856399	0.579462811888486	0.779765389642971
"Predict-miR-508"	-1.70775174666695	7.9906370492997	0.306189238230079	0.580028090125163	0.779765389642971
"Predict-miR-403"	0.835339638617647	8.15905334805291	0.289837826806986	0.590324473400213	0.792038408746445
"Predict-miR-368"	0.376657265582703	11.7891807602104	0.284573378488915	0.59371921039193	0.792038408746445
"Predict-miR-494"	-0.402482438415472	10.0053784632134	0.284240757329227	0.593935050206485	0.792038408746445
"rna41819"	0.493372850204728	9.24393198833396	0.283432768080443	0.594460035441549	0.792038408746445
"Predict-miR-378"	0.839095934397587	9.97189869107035	0.28277446751564	0.594888471981773	0.792038408746445
"rna21373"	-0.275427393088022	12.4273811584204	0.276019768003142	0.599321948804612	0.796406666584591
"Predict-miR-301"	-0.546752872821956	9.28639258199586	0.268130439414179	0.604588655275256	0.801863264482154
"Predict-miR-270"	-0.549342700006448	9.50627252956206	0.264905716634651	0.60676971639815	0.802926874456801
"Predict-miR-483"	0.495017849909021	9.25806404806385	0.258796130632508	0.610948437970815	0.802926874456801
"Predict-miR-246"	0.789531672201975	9.07568171094338	0.258739379847617	0.610987543318874	0.802926874456801
"rna19197"	-0.324589684617835	13.0602794318771	0.25645534613572	0.612565905209166	0.802926874456801
"Predict-miR-178"	0.84826604026916	7.98520989494429	0.256408844240831	0.612598131550606	0.802926874456801
"Predict-miR-327"	-0.520814281300705	9.0042523719727	0.251033670851845	0.616348176710086	0.802926874456801
"rna10532"	0.414362413075305	10.2849372623409	0.230948707737566	0.630821266573681	0.802926874456801
"Predict-miR-342"	-0.632237317011989	9.14619278783346	0.225699034683963	0.634731432220885	0.802926874456801
"Predict-miR-587"	-0.655783307174329	12.0644737669933	0.220407668149456	0.638729471127542	0.802926874456801
"Predict-miR-171"	-0.469583775952003	9.08089080163828	0.219779997331296	0.639207600502923	0.802926874456801
"Predict-miR-293"	-0.6294803246486	9.81565778300622	0.217232793229474	0.641156528598799	0.802926874456801
"rna55116"	-0.270007872673637	13.0926682152402	0.215935812994818	0.642154228238095	0.802926874456801
"Predict-miR-180"	-0.515432053548747	9.62439903716052	0.212967037434117	0.644451743690522	0.802926874456801
"Predict-miR-303"	0.380973807239153	10.0700747702323	0.212412488340398	0.644883056030576	0.802926874456801
"Predict-miR-430"	-0.636073877235279	9.42146255419778	0.211965581806091	0.645231144075415	0.802926874456801
"Predict-miR-480"	-0.63815383702379	8.64118730871282	0.203229548585735	0.652126579342548	0.802926874456801
"Predict-miR-354"	-0.445200297950991	8.90806348374786	0.202302332163521	0.652868852813851	0.802926874456801
"rna25395"	0.24025565732856	13.1460907446358	0.200076848452717	0.654658823315243	0.802926874456801
"rna11055"	0.695151934653181	8.31512831619092	0.196384660951841	0.657655006947626	0.802926874456801
"Predict-miR-400"	-0.299131830210405	10.0778962928009	0.192819683698565	0.66058010794112	0.802926874456801
"Predict-miR-305"	0.719995884446722	8.63444162009376	0.190473652000696	0.662522693154238	0.802926874456801
"Predict-miR-53"	0.24251823067655	11.0055108387747	0.190394426781604	0.66258854212654	0.802926874456801
"Predict-miR-307"	-0.591969969036664	8.16756120365871	0.189663354144433	0.663196952707431	0.802926874456801
"Predict-miR-28"	-0.640302216793412	8.43466299545762	0.186421382364745	0.665911910897193	0.802926874456801
"rna6961"	0.686104094764653	8.36202812572678	0.184868265971701	0.667222484643337	0.802926874456801
"rna11272"	-1.21832013062453	8.06113085223675	0.175075275983932	0.675640084153925	0.802926874456801
"Predict-miR-387"	-1.20967027899838	8.18101444914108	0.174448177714194	0.676188454137674	0.802926874456801
"Predict-miR-409"	-1.18481687001871	8.05978441657104	0.172603582191497	0.677808212193685	0.802926874456801
"Predict-miR-4"	-1.18342133161387	7.75723087868409	0.172499989389315	0.677899478563994	0.802926874456801
"Predict-miR-145"	-1.1834185053038	7.75828128901194	0.172499779694348	0.677899663340092	0.802926874456801
"rna69774"	-1.18340280753353	7.76411619977462	0.172498615023655	0.677900689610838	0.802926874456801
"rna34998"	-1.18333552702785	7.78913933372262	0.172493623411758	0.67790508810638	0.802926874456801
"Predict-miR-136"	-1.18333233381707	7.79032755701742	0.172493386510396	0.677905296860359	0.802926874456801
"rna42423"	0.622326749948413	8.59141559360325	0.172362121947939	0.678020991109792	0.802926874456801
"Predict-miR-581"	-1.17431264380098	7.84895581777585	0.171827040888513	0.678493137126353	0.802926874456801
"Predict-miR-318"	-1.16915516127374	8.38931844763548	0.171449200183149	0.678827056228227	0.802926874456801
"Predict-miR-201"	-1.16576204193818	8.44521774216914	0.171202144260178	0.679045626578612	0.802926874456801
"Predict-miR-580"	-0.232111509926012	11.6397824479057	0.170934538808554	0.679282585584305	0.802926874456801
"Predict-miR-321"	-1.16119797420224	7.90380735784794	0.170871935891383	0.67933805049622	0.802926874456801
"Predict-miR-33"	-1.16119792951234	7.90463644198025	0.170871932670122	0.679338053350498	0.802926874456801
"Predict-miR-330"	-1.16119183311222	8.01255479408016	0.170871493291735	0.679338442672859	0.802926874456801
"Predict-miR-26"	-1.16089924449716	7.81572160887228	0.170837815663671	0.679368285333384	0.802926874456801
"Predict-miR-601"	-1.16049744685438	7.96386648228463	0.170792505127205	0.679408441664229	0.802926874456801
"Predict-miR-603"	-1.16336638404871	8.95676079672592	0.170624674963069	0.679557235011175	0.802926874456801
"Predict-miR-521"	-1.16349389188239	8.89321174652108	0.170611630580838	0.679568803368723	0.802926874456801
"Predict-miR-155"	-1.15907243695611	8.07310372201381	0.17055728817799	0.679617002280013	0.802926874456801
"Predict-miR-530"	-1.16421561763462	8.38189715419771	0.170533335571518	0.679638249861757	0.802926874456801
"rna27273"	-1.1642698436715	7.87702541812518	0.170527131124336	0.679643753910798	0.802926874456801
"Predict-miR-331"	-1.16543823505331	7.78887641616848	0.17038123524131	0.679773213917855	0.802926874456801
"Predict-miR-112"	-1.16543929779605	7.78677455391376	0.170381091128074	0.679773341828104	0.802926874456801
"Predict-miR-36"	-1.16543964702311	7.78608387917059	0.17038104376628	0.679773383864915	0.802926874456801
"Predict-miR-629"	-1.16543975764775	7.78586509587188	0.170381028762993	0.679773397181354	0.802926874456801
"Predict-miR-300"	-1.16545309929189	7.75948521824825	0.170379217557839	0.679775004754243	0.802926874456801
"rna51238"	-1.16588146119984	7.82000452722587	0.17031915217984	0.679828322698568	0.802926874456801
"Predict-miR-337"	-1.16746392112393	8.15558268261738	0.170060592517263	0.680057962813655	0.802926874456801
"Predict-miR-598"	-1.1551843758025	7.9811309993434	0.169903324429678	0.680197740599557	0.802926874456801
"Predict-miR-124"	-1.15293338359648	7.84621925674338	0.169516343252401	0.680542006858537	0.802926874456801
"Predict-miR-507"	-1.17068145043817	7.84527138635924	0.169273587084978	0.680758202269471	0.802926874456801
"rna57202"	-1.14276681550717	7.79107845191255	0.167687419121416	0.682175302887699	0.802926874456801
"Predict-miR-429"	-1.14276635439334	7.79085912305872	0.167687333011903	0.68217538003099	0.802926874456801
"Predict-miR-193"	-1.14275481738741	7.78537206825331	0.167685178466494	0.682177310240167	0.802926874456801
"rna62714"	-1.14275311274998	7.78456141992373	0.167684860108229	0.682177595451463	0.802926874456801
"rna38812"	-1.14269578652251	7.75731242034323	0.167674151485247	0.682187189293419	0.802926874456801
"Predict-miR-202"	-1.14269516758372	7.75701835372071	0.167674035841447	0.682187292900507	0.802926874456801
"Predict-miR-599"	-1.17423429396763	7.81991151237048	0.167531900354514	0.682314665855298	0.802926874456801
"Predict-miR-584"	-1.17479211485928	7.93545615669858	0.16707970958355	0.682720311084315	0.802926874456801
"Predict-miR-146"	-1.17653679712092	7.95226274833368	0.164909921925565	0.684675718773614	0.802926874456801
"Predict-miR-138"	-0.408550134266603	9.31273461815007	0.164049402296307	0.685455367287543	0.802926874456801
"Predict-miR-139"	0.755847333667391	8.1388722143488	0.163253873790291	0.686178252749394	0.802926874456801
"Predict-miR-216"	-1.11654273509804	8.13157159331142	0.162249142928967	0.687094171255208	0.802926874456801
"Predict-miR-345"	-1.10801116856482	7.93460269760794	0.160203849828088	0.688968906568356	0.802926874456801
"Predict-miR-343"	0.47432616749944	9.16218101501375	0.160112437304816	0.689053019613434	0.802926874456801
"Predict-miR-214"	-0.399693724130826	9.17215755291932	0.156150164358651	0.692725988489873	0.805847909169196
"Predict-miR-97"	0.347258578320838	9.75613516381396	0.15344517543963	0.695264528803921	0.807441662863041
"rna60848"	0.228195202301775	10.9468479437413	0.151732888915106	0.696884817694304	0.807965451387188
"Predict-miR-80"	0.285776583038921	10.0637511033776	0.136609205175214	0.711675464982618	0.823731568346715
"Predict-miR-417"	-0.327742416266643	9.50481473892253	0.135089203529633	0.713212657132176	0.824130344612598
"Predict-miR-9"	-0.266213302016487	14.8306346806919	0.128430093202109	0.72006535743521	0.82997282504008
"Predict-miR-113"	-0.513259274137535	8.90252197156267	0.127850651634095	0.720671049238854	0.82997282504008
"Predict-miR-135"	0.358159558005185	9.05910585297082	0.117421076339784	0.731848548496532	0.840694447640894
"Predict-miR-358"	0.3121214988624	9.04389716587609	0.116906671170161	0.732413976092356	0.840694447640894
"Predict-miR-143"	-0.288417028039384	9.61423708175188	0.101066185291067	0.750553902245318	0.860087473385597
"Predict-miR-265"	0.449321809005549	8.61184942643479	0.0929794317134522	0.760423054766974	0.866797412967906
"Predict-miR-372"	0.448913547037339	8.18425184229483	0.0928098922735456	0.760634897543095	0.866797412967906
"rna19535"	0.392195011984411	8.69964691734023	0.0923034723810794	0.761268940871762	0.866797412967906
"Predict-miR-407"	0.220032362547554	10.1022961052148	0.0921774953524448	0.761426960450823	0.866797412967906
"rna31044"	0.189206594401036	11.0410265117269	0.0869949647415105	0.768032771944064	0.872879351008797
"Predict-miR-543"	0.312320085721984	9.26277995570464	0.0827000052015592	0.773671252583227	0.877528476328576
"Predict-miR-142"	0.428241503997788	8.19426413268608	0.0819564860711663	0.774663343792231	0.877528476328576
"rna70267"	0.171315523218766	14.7219008422959	0.0735623257170914	0.786218943023275	0.889160866823376
"rna11058"	0.472794334759212	8.36653747536515	0.0634758901421826	0.801084178918991	0.904492103975527
"rna40590"	-0.154959348280445	10.5120068945259	0.0550755460791414	0.814455716708514	0.918089559943855
"Predict-miR-266"	0.396078778283442	8.13960898545537	0.0508756418151624	0.821546537046408	0.924574360096202
"rna34406"	0.332840299514366	8.72336417449406	0.0481269894712106	0.826355104423599	0.928357508898589
"rna9559"	-0.296508531216477	8.67774903884865	0.0474311536007681	0.827595116471101	0.928357508898589
"Predict-miR-561"	0.309787127951132	8.50699400533224	0.0438453260917022	0.834141647627171	0.934184568088129
"Predict-miR-432"	-0.207129268653689	9.16927489668793	0.0386334928219902	0.844176535317024	0.943893181074536
"Predict-miR-296"	-0.29299467566229	8.82728472035464	0.0373978442944427	0.846657287704929	0.945137618423434
"Predict-miR-173"	0.202584821803204	8.97528782827614	0.0320288093428243	0.857964442172144	0.956215208937018
"Predict-miR-221"	-0.211771950599815	9.43476014912868	0.0304989620138052	0.861362893131683	0.958456939056349
"rna41818"	0.188770567919135	8.89026424780761	0.029576565908668	0.863454519786312	0.959239667479649
"Predict-miR-394"	-0.187970782688161	8.97970614573142	0.0286546855147325	0.865578806232446	0.960056107715281
"Predict-miR-114"	-0.228789451474639	8.5436211331007	0.0263955462783692	0.87093806425464	0.964452247435828
"Predict-miR-323"	-0.195263175421406	9.91124145005783	0.0252849608049068	0.873659061114714	0.965917457968428
"Predict-miR-538"	-0.156355773751175	9.2363806286478	0.0219334268463385	0.882264337433235	0.97383821876831
"Predict-miR-120"	-0.202575753752752	8.53725347007962	0.0212408261110433	0.884124805354367	0.97383821876831
"rna58409"	-0.0714934087800485	13.1279379670187	0.0207050798923092	0.885585280434948	0.97383821876831
"rna70362"	0.125277515401551	10.2340974350821	0.0199157187181207	0.887772724880455	0.97383821876831
"rna10649"	-0.0894599073390072	14.6307786293945	0.0198810270358134	0.887869866604972	0.97383821876831
"Predict-miR-205"	-0.207368878601017	8.25016734276288	0.0187055445279682	0.891214008569548	0.975957020477904
"Predict-miR-459"	-0.218621577107599	8.3683043177155	0.0171054873068268	0.895943057306979	0.979583311074561
"Predict-miR-338"	0.100240678020482	10.1020673620764	0.015760907860674	0.900094117118018	0.982567195779701
"Predict-miR-496"	0.164444496508837	8.17711667159242	0.0121023561577758	0.912400881685628	0.99443061395074
"Predict-miR-182"	0.0949107715534553	9.770953324995	0.0108321845570423	0.917107623052439	0.997986405557851
"Predict-miR-315"	0.151102914459154	8.63895474047814	0.0104483763500802	0.918584196533879	0.998021509127218
"Predict-miR-471"	0.074300457650552	11.4935224304729	0.00870382383276791	0.925669771259177	1
"Predict-miR-399"	-0.0497876086497581	15.0022257786217	0.00839703404722059	0.926987778762374	1
"rna44578"	-0.0866618543276506	9.08145550192164	0.00384771380562654	0.950538986989584	1
"rna504"	-0.0404486634675254	11.2044355932828	0.00326394715975908	0.954440870209643	1
"Predict-miR-131"	0.0544213546428068	8.65231253741677	0.00261076835478313	0.959249279605479	1
"rna35737"	0.0219808523787922	11.7454064077172	0.00248258263414058	0.96026142839095	1
"rna41499"	-0.0190102601240304	12.3857470109457	0.0023515438824635	0.961323566302897	1
"Predict-miR-21"	0.0669499591977031	8.45670288435213	0.00193516503011182	0.964911967924813	1
"Predict-miR-405"	-0.0427848174481478	8.86516431685362	0.000974350564815651	0.975098405265307	1
"rna19202"	-0.0141380018587444	13.0613914964638	0.000789962401658073	0.977577393478883	1
"Predict-miR-268"	0.0241026569624834	9.20964066358724	0.000777137389237126	0.977760105879586	1
"Predict-miR-165"	-0.0164283958965965	10.7561910607176	0.000626794861435798	0.980026351254337	1
"Predict-miR-56"	0.0348029688440589	8.54472290417634	0.000555544774190508	0.981195604161401	1
"Predict-miR-198"	0.026820570082877	8.4596333049457	0.000441845268476015	0.983229609127918	1
"Predict-miR-82"	0.0190282871674667	8.2909382940745	0.000185773590153815	0.989125267021394	1
"Predict-miR-359"	-0.0141312506046498	8.48468175203515	0.000141825161902531	0.990498187855764	1
"Predict-miR-461"	0	7.80997171742813	0	1	1
"Predict-miR-157"	0	7.99419308808984	0	1	1
"Predict-miR-161"	0	7.76845812396175	0	1	1
"rna46223"	0	7.80007323308895	0	1	1
"rna65319"	0	8.11883429881765	0	1	1
"Predict-miR-428"	0	7.79949451854899	0	1	1
"Predict-miR-528"	0	7.85745859542837	0	1	1
"rna11800"	0	7.78935512496392	0	1	1
"rna438"	0	8.24830671526805	0	1	1
"rna44329"	0	7.86255977581759	0	1	1
"rna69972"	0	7.82825652688166	0	1	1
"rna7820"	0	7.85809979643892	0	1	1
"Predict-miR-309"	0	10.2510895405668	0	1	1
"Predict-miR-313"	0	9.02553142826858	0	1	1
"Predict-miR-532"	0	7.82057804500805	0	1	1
"Predict-miR-619"	0	7.75966252141236	0	1	1
"Predict-miR-264"	0	7.91367463937715	0	1	1
"Predict-miR-160"	0	7.85663465256246	0	1	1
"Predict-miR-232"	0	9.29758285952353	0	1	1
"Predict-miR-258"	0	7.87776618653078	0	1	1
"Predict-miR-289"	0	8.91238309826627	0	1	1
"Predict-miR-314"	0	8.06929597280799	0	1	1
"Predict-miR-328"	0	7.9973702818076	0	1	1
"Predict-miR-375"	0	7.87769564624724	0	1	1
"Predict-miR-457"	0	7.82174816495871	0	1	1
"Predict-miR-463"	0	7.76108248004421	0	1	1
"Predict-miR-91"	0	8.00963906059398	0	1	1
"Predict-miR-17"	0	7.75852390214921	0	1	1
"Predict-miR-196"	0	7.78808431441778	0	1	1
"Predict-miR-376"	0	7.92892932281108	0	1	1
"Predict-miR-482"	0	7.87632652991522	0	1	1
"Predict-miR-602"	0	7.78905283859549	0	1	1
"Predict-miR-109"	0	7.78612395573406	0	1	1
"Predict-miR-144"	0	7.75746873328363	0	1	1
"Predict-miR-184"	0	7.95458517039464	0	1	1
"Predict-miR-219"	0	7.78830756321825	0	1	1
"Predict-miR-537"	0	7.81521322073461	0	1	1
"Predict-miR-618"	0	7.92740616265619	0	1	1
"Predict-miR-622"	0	7.78583138753326	0	1	1
