"logFC"	"logCPM"	"LR"	"PValue"	"FDR"
"zma-miR398b-5p"	-4.72721450354951	12.4188748965417	12.3326113541994	0.000445113300916604	0.0169143054348309
"zma-miR1432-5p"	-3.1254934425951	12.1262124533465	9.03677228138135	0.00264602405478972	0.0502744570410047
"zma-miR529-5p"	-4.58531501197977	11.8150108351715	7.98888515230485	0.00470653873316308	0.0596161572867324
"zma-miR164f-5p"	-1.24065364245041	14.9825382883216	3.46690841049948	0.0626082225836467	0.594778114544644
"zma-miR159a-3p"	2.80100181452315	11.2413965155399	2.67960922500225	0.101640666969462	0.621640808237353
"zma-miR156b-5p"	0.679767236169883	18.4936315861816	2.19660078188169	0.138315450473819	0.621640808237353
"zma-miR156c"	1.45888905672941	11.799036738741	2.09281883686354	0.147992784647191	0.621640808237353
"zma-miR164d-5p"	-2.09448815103445	11.298467977173	1.9037164570872	0.167662918519251	0.621640808237353
"zma-miR164b-5p"	-2.10249719604624	11.1214048868961	1.88099981701812	0.170220555519831	0.621640808237353
"zma-miR396f-3p"	-2.004927974428	11.1199810392018	1.79815220039061	0.17993604546117	0.621640808237353
"zma-miR528a-5p"	-2.0048953836661	11.1485968563202	1.79804805282852	0.179948655016076	0.621640808237353
"zma-miR168a-5p"	-0.77321836483377	17.6245736067279	1.34062437899881	0.246923887741667	0.731414564848084
"zma-miR408b-5p"	1.91733420110925	11.6213723770212	1.32207064689161	0.250220772184871	0.731414564848084
"zma-miR399j-3p"	-1.53808919377683	11.1863070710664	1.03708312786704	0.308500830857619	0.808676973731028
"zma-miR156l-5p"	0.971590038649658	11.8771726813352	0.910775069172182	0.339908853678892	0.808676973731028
"zma-miR166j-3p"	1.53293817438067	11.2816366893193	0.908564568899065	0.340495567886749	0.808676973731028
"zma-miR164e-5p"	1.4938418184109	11.5114432229344	0.830580831878942	0.362104629182133	0.809410347583592
"zma-miR156k-5p"	0.747562647787957	11.7540026523893	0.545155635666434	0.460303882730364	0.964230992704104
"zma-miR171g-3p"	0.725752000024387	11.7807593952582	0.494074217862323	0.482115496352052	0.964230992704104
"zma-miR156a-5p"	0.627708321054079	12.0609996992424	0.415841757991281	0.519019252804647	0.98613658032883
"zma-miR167e-5p"	-0.531176822630482	11.6634160477472	0.306177635639704	0.580035267858015	1
"zma-miR167j-5p"	0.680268871825989	11.6955807720432	0.273416073087184	0.60104939249771	1
"zma-miR319a-3p"	-0.75939291400796	11.1876001105378	0.193268755740144	0.660209871854895	1
"zma-miR156j-5p"	0.512560074539616	11.814247343948	0.178813742762767	0.672394679381461	1
"zma-miR528b-5p"	-0.7336678798108	13.8551175103522	0.123002235573615	0.725800861499061	1
"zma-miR156d-5p"	0.231116459300676	11.7698355924278	0.0621023687059661	0.803203396584866	1
"zma-miR156i-5p"	0.198193518959401	11.8599069749284	0.0346363610424287	0.852359703150157	1
"zma-miR156h-5p"	-0.146883638318199	11.7465713270282	0.0286718042784893	0.865539041721304	1
"zma-miR156g-5p"	0.189721175748434	11.8053881420761	0.0270040459283098	0.869472091780786	1
"zma-miR156e-5p"	0.0763187578450006	11.9083098596119	0.005439450187124	0.94120722141877	1
"zma-miR156f-5p"	-0.0881033888198362	18.2523260137622	0.00536435516127654	0.941613737268771	1
"zma-miR398a-5p"	0	11.1529998915006	0	1	1
"zma-miR164h-5p"	0	11.1238640046182	0	1	1
"zma-miR169j-5p"	0	11.2195653112997	0	1	1
"zma-miR166m-3p"	0	11.1174513013077	0	1	1
"zma-miR166e"	0	11.1735712660905	0	1	1
"zma-miR399e-5p"	0	11.1171325743203	0	1	1
"zma-miR164c-5p"	0	11.1187645330546	0	1	1
