"logFC"	"logCPM"	"LR"	"PValue"	"FDR"
"all-m0212-3p"	4.72123577439651	17.3105971141672	15.6635139060476	7.56699318559648e-05	0.00749132325374051
"all-m0165-5p"	-4.94765202817531	15.5803547666172	10.6716947768485	0.0010878739859636	0.0467608607954928
"all-m0109-3p"	-5.19062204282288	15.4430507746627	10.1835438555011	0.0014169957816816	0.0467608607954928
"all-m0185-5p"	3.5777059407682	14.5098565551411	6.49492680462599	0.0108182750039777	0.267752306348449
"all-m0132-3p"	-1.79549589321942	16.8041834634828	5.82129214729458	0.0158333090726094	0.313499519637665
"all-m0111-5p"	3.72134978096376	14.4436421262943	4.65508234084797	0.0309617475069115	0.363255226469213
"all-m0015-3p"	-3.73412555838523	14.7125923754804	4.65347758191635	0.0309907029077781	0.363255226469213
"all-m0208-3p"	3.17606935513385	15.4038907389609	4.61312976755371	0.031728075787577	0.363255226469213
"all-m0192-3p"	3.70596938279758	14.5423987443616	4.52709647280785	0.0333621758202322	0.363255226469213
"all-m0135-5p"	3.55454062245885	14.4395699971491	4.35376939743078	0.0369271291678788	0.363255226469213
"all-m0191-5p"	-3.5115554110819	14.6237288618925	4.19925303481241	0.0404417894954715	0.363255226469213
"all-m0117-3p"	3.91427648989502	14.5905467171873	4.03935145598309	0.0444509011079046	0.363255226469213
"all-m0182-3p"	3.3721010363973	14.4606479519022	3.92051797410218	0.047700181253533	0.363255226469213
"all-m0033-5p"	3.11334170314489	14.4437457309259	3.40808687676903	0.0648776213264455	0.367706895242874
"all-m0153-5p"	3.11334170314489	14.4437457309259	3.40808687676903	0.0648776213264455	0.367706895242874
"all-m0025-3p"	3.11295120307842	14.4070294679535	3.31818627096421	0.0685173801556439	0.367706895242874
"all-m0113-3p"	3.11272465168064	14.3929754310602	3.28183037233907	0.0700507643434916	0.367706895242874
"all-m0070-5p"	2.9137528981744	14.4406492921478	3.14162799410659	0.0763175959167309	0.367706895242874
"all-m0081-5p"	2.9137528981744	14.4406492921478	3.14162799410659	0.0763175959167309	0.367706895242874
"all-m0027-3p"	2.91256059901254	14.4366473550915	3.13155431729074	0.0767904943760276	0.367706895242874
"all-m0223-5p"	2.90954417499355	14.4266796539953	3.10612278731625	0.077998432324246	0.367706895242874
"all-m0095-3p"	-2.36457400419245	15.1494015228755	2.96749246029123	0.0849534424256705	0.382290490915517
"all-m0184-3p"	-1.55914835479331	16.8109497340102	2.3719735472078	0.123530794352236	0.486347562109079
"all-m0181-3p"	2.25051555890863	14.4787252675867	2.33436024769068	0.126546970777504	0.486347562109079
"all-m0178-3p"	2.29542453391307	15.1654623006024	2.28490748914685	0.13063793105336	0.486347562109079
"all-m0028-5p"	2.32301298176768	14.5344446811568	2.24101970391325	0.134392327804128	0.486347562109079
"all-m0087-5p"	-2.67502389408457	14.5864947210758	2.21362372392283	0.136797007095159	0.486347562109079
"all-m0080-5p"	-2.5823872549291	14.4370461957508	2.13842631236176	0.143649182779756	0.486347562109079
"all-m0112-5p"	2.39993431882667	14.4307274656564	2.07478342611274	0.149751194881941	0.486347562109079
"all-m0052-3p"	2.40886359982595	14.3950471150695	2.04915542474564	0.152290650761429	0.486347562109079
"all-m0192-5p"	2.40886359982595	14.3950471150695	2.04915542474564	0.152290650761429	0.486347562109079
"all-m0094-5p"	2.14622610572277	14.4426982869063	1.87376259215146	0.171044766587497	0.500339401048801
"all-m0155-5p"	2.1404584001218	14.4153133094828	1.84718175584881	0.174111528920739	0.500339401048801
"all-m0129-3p"	2.13842433512207	14.406102669307	1.83779966052836	0.175209059583131	0.500339401048801
"all-m0173-5p"	2.1353428538284	14.3925474929385	1.82358052911798	0.176887667037455	0.500339401048801
"all-m0225-3p"	2.47565856680963	14.4854710064639	1.76572650379155	0.183911843330673	0.50575756915935
"all-m0036-3p"	-3.99228343598012	14.4778565020936	1.71761294572371	0.190000601431624	0.508379987614346
"all-m0151-5p"	-2.69765300472999	14.3996222722397	1.61610045380713	0.203636382045682	0.517720438487021
"all-m0018-3p"	-2.67689624783722	14.4207883813532	1.61385698163263	0.203950475767614	0.517720438487021
"all-m0177-3p"	-2.12295878473597	14.4696328593735	1.45823162257437	0.227211697782249	0.559901251645328
"all-m0168-3p"	2.0209016227967	14.4650891767471	1.42930255166863	0.231878296135944	0.559901251645328
"all-m0207-5p"	-2.3801118848335	14.5887190007015	1.34081861084307	0.246889656138351	0.580573130802243
"all-m0012-3p"	-2.06234027824433	14.4872625503491	1.29261654802336	0.255566313578038	0.580573130802243
"all-m0216-5p"	-1.57293198494052	14.9157828825682	1.23877596580679	0.265707085518634	0.580573130802243
"all-m0226-3p"	-2.03801577006962	14.4559130320491	1.23129122041872	0.267156073345512	0.580573130802243
"all-m0086-5p"	-2.73794775487138	14.51556508728	1.21796062033478	0.269761252695992	0.580573130802243
"all-m0195-5p"	-1.99826588196662	14.4124114892946	1.1358548695219	0.286529921383541	0.591612290741502
"all-m0016-3p"	-1.99763555789876	14.4099525513126	1.13438319583472	0.286842322783759	0.591612290741502
"all-m0145-3p"	0.999627704735213	16.3216353832508	1.07368991864778	0.30011346551995	0.606351695642348
"all-m0071-3p"	-2.20071500463529	14.3956073558145	1.01544872106062	0.313601023312918	0.620930026159577
"all-m0222-5p"	-1.90138799603562	14.5104521821713	0.921298972719396	0.337134135454765	0.654167716065241
"all-m0118-5p"	-1.83940714073895	16.2868595503866	0.87648645519408	0.349165820218113	0.654167716065241
"all-m0019-5p"	1.55458966857878	14.4292224723332	0.851448040198846	0.356143016760206	0.654167716065241
"all-m0017-3p"	1.01331151269638	14.6073147288906	0.836376667172918	0.360435106217237	0.654167716065241
"all-m0167-5p"	-1.41958940871897	14.4803737920789	0.729191378567204	0.393145419787263	0.654167716065241
"all-m0044-5p"	-0.82800479927492	14.9681040761034	0.700619939094628	0.402575464113869	0.654167716065241
"all-m0211-5p"	-1.37327796500598	14.4509242105167	0.663241417144369	0.415417928163968	0.654167716065241
"all-m0190-3p"	-1.36872882989658	14.4513288976398	0.656962264687476	0.417634430916695	0.654167716065241
"all-m0036-5p"	-1.35573036246655	14.4292224723332	0.639183511446949	0.424006614206827	0.654167716065241
"all-m0078-3p"	-1.35566850317294	14.4288159501003	0.639099451396673	0.424037087079699	0.654167716065241
"all-m0209-5p"	-1.35566850317294	14.4288159501003	0.639099451396673	0.424037087079699	0.654167716065241
"all-m0234-3p"	-1.35086098120992	14.3985936481722	0.63258162729988	0.426409934420645	0.654167716065241
"all-m0136-5p"	-1.35019639009211	14.3946126875098	0.631682907982924	0.426738683410625	0.654167716065241
"all-m0021-3p"	-1.34857290591656	14.3850701915181	0.6294897915465	0.427542523463174	0.654167716065241
"all-m0089-5p"	-1.34462060383938	14.4430070550226	0.62416415505482	0.429504056002431	0.654167716065241
"all-m0047-3p"	1.17487210801299	14.4332202080696	0.486545852774102	0.485472179725053	0.72820826958758
"all-m0144-3p"	-1.20375430125842	14.4432213161942	0.353326618357489	0.552236026012732	0.815864920334375
"all-m0128-5p"	1.04201576542166	14.4357201470774	0.313095214336664	0.575787020013325	0.815864920334375
"all-m0139-3p"	1.05301782143586	14.4083532158043	0.312206590998789	0.576329279042815	0.815864920334375
"all-m0206-5p"	1.06267049401582	14.3855345583982	0.31131529674256	0.576874186095013	0.815864920334375
"all-m0152-5p"	0.785004715804372	14.4422221888063	0.26838098125429	0.604419897081772	0.829304610886517
"all-m0115-5p"	0.574551669561789	15.1303951584628	0.268275449013431	0.604490968556292	0.829304610886517
"all-m0048-5p"	-0.48799702274991	15.7477134347365	0.233823879828848	0.628702861297517	0.829304610886517
"all-m0183-5p"	0.787154335815168	14.4198017179234	0.200821266389258	0.654058758530872	0.829304610886517
"all-m0032-5p"	0.786316046152314	14.4058754233899	0.198286967686861	0.65610712380291	0.829304610886517
"all-m0102-5p"	0.78577405279062	14.3970518112092	0.196648713123522	0.657439616189875	0.829304610886517
"all-m0045-3p"	0.785542505081362	14.4865997418587	0.195948909068264	0.658010834523634	0.829304610886517
"all-m0217-3p"	0.785051288326691	14.4713786428524	0.19446449687215	0.659226543200811	0.829304610886517
"all-m0187-3p"	0.781038147418557	14.5456012036923	0.182351399844578	0.669360223919011	0.829304610886517
"all-m0091-5p"	0.495123086023608	14.4513005112775	0.181432397051043	0.670145140110317	0.829304610886517
"all-m0213-5p"	-0.499892295689148	14.8433573883087	0.14337078004973	0.704952732614501	0.861608895417723
"all-m0043-3p"	-0.775170974279043	14.5336289927108	0.113733507423747	0.735932979904956	0.888504451348666
"all-m0148-5p"	0.84135647469033	14.4922829883817	0.105348742654033	0.745502969940802	0.889214385833004
"all-m0105-5p"	-0.48561043624445	14.5783436243165	0.0551796586841968	0.814283625743325	0.959691416054633
"all-m0025-5p"	0.245853358777739	14.4326963148786	0.035500279132139	0.850551202801591	0.984136742868007
"all-m0103-5p"	0.226635163942762	14.4096149858094	0.0331948163608606	0.855430131051511	0.984136742868007
"all-m0042-5p"	0.138494481366585	16.1859976727576	0.0289703822202654	0.864847440702188	0.984136742868007
"all-m0224-3p"	-0.365013459329043	14.6131039020566	0.0224705769832081	0.880842019622105	0.990947272074868
"all-m0003-3p"	0.147734111228918	14.6281577542157	0.0136459299783427	0.907006026791444	1
"all-m0100-3p"	0.136695282556147	14.4887817996876	0.00654301042658378	0.935530325825274	1
"all-m0198-5p"	0.141630370378611	14.4103557906034	0.00618775918895897	0.937301223928228	1
"all-m0166-3p"	-0.0499715207355447	15.8174119805574	0.00585915453015051	0.938985423174055	1
"all-m0141-3p"	0	14.4287535953495	0	1	1
"all-m0164-5p"	0	14.3925090799529	0	1	1
"all-m0006-5p"	0	14.4308305112949	0	1	1
"all-m0026-3p"	0	14.3921025349461	0	1	1
"all-m0157-5p"	0	15.3280071589601	0	1	1
"all-m0007-5p"	0	14.4056937243237	0	1	1
"all-m0160-3p"	0	14.5848619380089	0	1	1
