"logFC"	"logCPM"	"LR"	"PValue"	"FDR"
"rna53549"	7.46906073401075	9.08344749105145	17.278195041819	3.22870700583406e-05	0.0133564666553097
"Predict-miR-64"	-7.64806482689239	10.0798582763356	16.936148082425	3.86583694799124e-05	0.0133564666553097
"rna9752"	-2.43077178004994	13.2189554497289	14.3755805689565	0.000149731534553684	0.0344881634588651
"rna48653"	6.79595867785523	9.34315043568135	12.7284009408611	0.000360144339802022	0.0622149347007994
"Predict-miR-587"	-3.92536376943522	12.0644737669933	12.063131260857	0.000514288366782979	0.0710746522894077
"Predict-miR-369"	2.49792669364085	12.547926138088	9.50069222172283	0.00205394395841133	0.203139496957489
"rna15912"	6.37565995706256	8.36765599346247	9.25699158247281	0.00234598075243404	0.203139496957489
"Predict-miR-368"	-2.08390238383386	11.7891807602104	9.09322049719784	0.00256558709752602	0.203139496957489
"Predict-miR-309"	-6.65343488758217	10.2510895405668	9.03691941248627	0.00264581110364312	0.203139496957489
"Predict-miR-612"	-6.7156587200251	10.3456910410862	8.73150003783424	0.00312759085433629	0.212144383033463
"Predict-miR-486"	-2.89486573769366	10.8419276572925	8.53565299172856	0.00348256365851394	0.212144383033463
"Predict-miR-415"	-6.36979884074138	9.30991391469203	8.37991791455517	0.00379389558561539	0.212144383033463
"rna35737"	1.89407642998157	11.7454064077172	8.28784207667228	0.00399113889932708	0.212144383033463
"Predict-miR-569"	-6.39263072561843	9.79995630201463	7.75040394975761	0.00537005283691634	0.265050465022085
"Predict-miR-385"	-6.26151224699909	9.69990889849673	7.43253825743727	0.00640549280236251	0.295079701762166
"Predict-miR-490"	-2.34990774924862	12.0693855699734	7.30506343682199	0.00687605692917581	0.296328968757373
"rna33835"	2.72623876548389	9.47656991282232	7.16344254091087	0.00744042637597002	0.296328968757373
"rna34928"	3.30401868139484	8.26125668934063	7.05802929118271	0.00789107567229425	0.296328968757373
"Predict-miR-269"	-6.2953490353108	9.17822116233357	7.00065833353748	0.00814797453891473	0.296328968757373
"Predict-miR-130"	-6.0784045011114	10.5486592965734	6.60739690068263	0.0101556009915365	0.336025593089834
"Predict-miR-634"	2.33103956989809	9.76960450359329	6.35405896751265	0.0117113045324223	0.336025593089834
"Predict-miR-274"	-6.07471653723629	10.0406619368336	6.34508481044186	0.011770698180228	0.336025593089834
"Predict-miR-431"	-1.89943123355393	10.996428880749	6.31298447232987	0.0119856915217626	0.336025593089834
"Predict-miR-390"	-5.96295336877374	9.76991297199503	6.30682397725614	0.012027410747782	0.336025593089834
"Predict-miR-277"	5.83790774758648	9.16489854696745	6.24196580942394	0.01247579239088	0.336025593089834
"Predict-miR-603"	-5.97444285550905	8.95676079672592	6.12250855549331	0.0133471261079709	0.336025593089834
"rna34405"	5.82213973668045	8.33814228444226	6.12171548371934	0.0133531153545477	0.336025593089834
"rna68981"	-5.97175657620035	9.4707251316082	6.08724967764989	0.0136160877084158	0.336025593089834
"Predict-miR-261"	2.63647569532265	9.65981011781234	5.70764181252996	0.0168912150874677	0.402476883635867
"Predict-miR-472"	-5.78213276908959	9.64571662452403	5.56381198643057	0.0183354476644718	0.413018208698516
"Predict-miR-571"	3.31326576860518	8.1917847805543	5.54542687538276	0.018529036859123	0.413018208698516
"Predict-miR-244"	2.09620057836784	12.6752102152864	5.24895190742206	0.0219599943846232	0.421108012885958
"Predict-miR-349"	-3.09737854715586	9.52280702028295	5.15104448384932	0.0232323944576743	0.421108012885958
"Predict-miR-72"	-5.81828813021749	9.84111443801896	5.14844011318531	0.023267265732652	0.421108012885958
"Predict-miR-323"	-2.75562254883442	9.91124145005783	5.13349233706662	0.0234684616492563	0.421108012885958
"rna51016"	1.86292270782112	11.2578142947779	5.12974305473393	0.0235192091356153	0.421108012885958
"rna29820"	-1.28067002473067	12.9306049202199	5.12809837895853	0.0235415061340992	0.421108012885958
"rna63727"	-1.92709130015892	11.0986476727301	5.121291324346	0.0236340232877773	0.421108012885958
"Predict-miR-206"	-5.77049735239268	8.31765376067295	5.10301141411678	0.0238843429612236	0.421108012885958
"Predict-miR-49"	-2.75266015768523	10.5232153485508	5.03106128365316	0.0248966379296256	0.421108012885958
"Predict-miR-306"	5.41130745905425	8.38094333908445	4.96572028315059	0.025854544906675	0.421108012885958
"Predict-miR-241"	5.41308742643145	8.38787718981506	4.95636773598571	0.0259947542701015	0.421108012885958
"Predict-miR-57"	-1.63668766915513	12.8186309137668	4.91703907787237	0.0265930554312548	0.421108012885958
"Predict-miR-453"	-5.64761315823815	9.25100675403269	4.86803957910611	0.027358563525533	0.421108012885958
"Predict-miR-15"	5.3966094678597	8.04437092693266	4.85706908941494	0.0275330711576796	0.421108012885958
"Predict-miR-292"	-3.01911497539933	9.77259070953632	4.82602207699265	0.0280332396421911	0.421108012885958
"rna21851"	-1.22296054310627	13.2688130789	4.69676853708146	0.0302193841273089	0.439569593914833
"Predict-miR-233"	-5.88294020431875	9.41717947670357	4.67894465655451	0.030534501458628	0.439569593914833
"Predict-miR-27"	-5.45972856164869	9.52083827354088	4.51428191028127	0.0336129931391168	0.441095383531767
"Predict-miR-478"	-5.47703533933688	8.82362795697825	4.50348395356678	0.0338258690499058	0.441095383531767
"Predict-miR-422"	-5.44935333854059	9.12643149478958	4.465346583933	0.0345890719002019	0.441095383531767
"Predict-miR-152"	-5.43497530940502	8.59503021618406	4.46235319692472	0.0346497323353535	0.441095383531767
"Predict-miR-52"	-5.42269094446182	8.45193787189683	4.3928555664061	0.0360898190619695	0.441095383531767
"Predict-miR-75"	-5.50451826646271	9.47708005216057	4.36245727440698	0.0367392741787714	0.441095383531767
"Predict-miR-404"	-5.56166775569813	8.21629091030848	4.30199503146856	0.0380676917755238	0.441095383531767
"Predict-miR-474"	-5.40587246053346	8.74485672284428	4.29836603665065	0.0381490086781246	0.441095383531767
"Predict-miR-129"	-5.40131387652758	10.6589031607194	4.27288648364371	0.0387250950380685	0.441095383531767
"Predict-miR-328"	-5.39394824361988	7.9973702818076	4.23183592754608	0.0396725051314231	0.441095383531767
"rna11059"	-5.9703969272517	8.10243069958928	4.21106417510242	0.0401611342568801	0.441095383531767
"Predict-miR-215"	-2.5707176464739	9.86732008207768	4.19234931728499	0.0406067877444288	0.441095383531767
"Predict-miR-45"	-2.63485081195909	9.21376432874003	4.15950851755433	0.041401415725844	0.441095383531767
"Predict-miR-148"	-5.37487707306156	8.78843465818496	4.12622875135622	0.0422233471079055	0.441095383531767
"Predict-miR-18"	-5.37341445211215	8.96626216967296	4.11817005528514	0.0424249452873374	0.441095383531767
"rna2228"	-1.93832977177631	11.2679048949464	4.11525474589239	0.0424981243391901	0.441095383531767
"Predict-miR-329"	-1.20646014189604	12.4924459520995	4.11071791185664	0.0426122703785056	0.441095383531767
"Predict-miR-99"	-2.6208398228298	8.9845760504042	4.10096714949406	0.0428586903099711	0.441095383531767
"Predict-miR-541"	-2.56203870520384	10.2358951540259	4.099988026517	0.0428835172216495	0.441095383531767
"Predict-miR-143"	-1.8853288234184	9.61423708175188	4.07946656561376	0.0434073604633288	0.441095383531767
"Predict-miR-458"	-5.41566568461702	8.88667087147664	3.9636888468996	0.0464917155046484	0.465590948024812
"Predict-miR-623"	-5.33801127024423	9.09225778229754	3.92487340891016	0.0475767722419295	0.468322355201944
"Predict-miR-471"	-1.70144296698991	11.4935224304729	3.90579161825844	0.0481199525605471	0.468322355201944
"rna41815"	1.72330741786894	10.2216404154509	3.8127300968673	0.050864480610038	0.488157723632448
"Predict-miR-39"	-5.31121590330087	8.53140023471492	3.78083188533909	0.0518428798241921	0.48919565943688
"rna19201"	2.34594636541997	9.91703009894555	3.76331758289574	0.0523885366111854	0.48919565943688
"Predict-miR-222"	1.46574664879337	14.1310885108698	3.66841360655793	0.0554529407768471	0.495950705750555
"Predict-miR-260"	-2.43020928535016	9.95130506964522	3.65184848791678	0.0560070190723504	0.495950705750555
"Predict-miR-104"	-5.28546880727807	10.3215060768955	3.6442598699121	0.0562628056081611	0.495950705750555
"rna24415"	-0.892914497311105	13.6768377746363	3.62320207568354	0.0569791064620245	0.495950705750555
"Predict-miR-479"	-1.47724149908957	10.0802436202508	3.6103847898788	0.0574198326846007	0.495950705750555
"rna54469"	1.27024654638915	13.1925964150171	3.5442141553257	0.0597534655449642	0.495950705750555
"Predict-miR-314"	-5.05490105415328	8.06929597280799	3.43923384936473	0.0636652092789698	0.495950705750555
"Predict-miR-231"	-5.05123822083816	8.86177546687586	3.4339646060023	0.0638686069936162	0.495950705750555
"Predict-miR-151"	-5.05107961039177	8.70361939456458	3.43328313195197	0.0638949630897837	0.495950705750555
"Predict-miR-102"	-5.05307815288262	9.53580799578378	3.37644436475768	0.0661345868177974	0.495950705750555
"Predict-miR-510"	-5.14531809811144	9.14756758292003	3.35930449466904	0.0668262863402898	0.495950705750555
"rna44410"	-0.980034200725142	13.6512952182184	3.35260746695298	0.0670986491653144	0.495950705750555
"Predict-miR-398"	-5.05311321628775	10.5526192323479	3.34180818915566	0.0675403492463081	0.495950705750555
"Predict-miR-232"	-5.02899136405538	9.29758285952353	3.3388485586058	0.0676619426371845	0.495950705750555
"Predict-miR-295"	-5.02314280299458	8.8834592668901	3.31400028459259	0.0686920887016926	0.495950705750555
"Predict-miR-361"	-5.05304853864274	9.96621943013775	3.30686108812623	0.0689911544613215	0.495950705750555
"rna505"	-1.79284327669013	11.7160050827304	3.29656794748557	0.0694247960397383	0.495950705750555
"Predict-miR-115"	-5.21405543693203	8.50713443471732	3.27488685015921	0.0703477774051685	0.495950705750555
"Predict-miR-171"	4.84244536254896	9.08089080163828	3.27113103876334	0.0705089961382104	0.495950705750555
"Predict-miR-288"	-1.14611935053235	11.5818451357992	3.26557587940149	0.0707481780909885	0.495950705750555
"rna15913"	-1.10983670531002	12.8583544652376	3.24391648011835	0.0716890766096923	0.495950705750555
"rna44577"	4.84490186875512	7.86241164994298	3.23521548925501	0.0720708214709974	0.495950705750555
"rna38012"	4.82512046069192	8.35991745508123	3.22051729953901	0.072720645433258	0.495950705750555
"rna20046"	-5.05236501883539	8.88936493406554	3.21238315885126	0.0730829640144399	0.495950705750555
"rna38013"	-1.09469707963272	12.994935840491	3.21168219657177	0.0731142774491341	0.495950705750555
"Predict-miR-552"	4.82323751924087	7.99026461894876	3.21072082206412	0.0731572474485963	0.495950705750555
"Predict-miR-131"	4.81892204632764	8.65231253741677	3.18820492922006	0.0741714169932031	0.495950705750555
"Predict-miR-105"	-5.05202762421309	9.62749058207378	3.18504090650095	0.074315137266376	0.495950705750555
"Predict-miR-65"	-4.99172771296292	8.82423657624039	3.18165706457117	0.0744691734172433	0.495950705750555
"Predict-miR-521"	-4.98852183854545	8.89321174652108	3.16825890397418	0.0750824472755782	0.495950705750555
"rna39993"	-4.98399293510379	9.43751705232614	3.14936545783194	0.0759564949403133	0.495950705750555
"Predict-miR-456"	-4.97976516227976	8.43688171310676	3.1317642066581	0.0767806092528604	0.495950705750555
"Predict-miR-106"	-4.97845383726269	10.0620558254681	3.12631189982914	0.0770378401976085	0.495950705750555
"Predict-miR-8"	-4.97051030269874	8.97547443093246	3.09335531246543	0.0786125536386473	0.495950705750555
"Predict-miR-133"	4.79810548125098	7.98863067888942	3.07840142103047	0.0793384705264085	0.495950705750555
"Predict-miR-426"	-2.43315768948039	9.86734068429686	3.07051449334489	0.0797242366938364	0.495950705750555
"Predict-miR-217"	4.84747295527259	8.24705677735465	3.06125813209813	0.0801795646839372	0.495950705750555
"Predict-miR-255"	-5.17063040356626	8.43715386445947	3.05708738188338	0.0803856426107991	0.495950705750555
"Predict-miR-341"	-4.95803372712565	9.1712077610241	3.04184003073945	0.0811438922007127	0.496198491245066
"Predict-miR-223"	-4.94279402802529	9.38364841422402	2.97932844108673	0.0843342576273551	0.508112570217399
"Predict-miR-436"	-4.94172181354141	8.20430173044795	2.97494744493661	0.0845628734804643	0.508112570217399
"rna44329"	-6.72954906440975	7.86255977581759	2.938486586187	0.0864917360365984	0.515222324149048
"Predict-miR-430"	-2.30758011847354	9.42146255419778	2.90968948701827	0.088048825515363	0.520014858385606
"Predict-miR-303"	-1.41789445734499	10.0700747702323	2.85761730932014	0.090942116391859	0.531203896231192
"Predict-miR-254"	-5.12795729092817	8.25616737546081	2.84812018077098	0.0914808446476293	0.531203896231192
"Predict-miR-87"	4.74330202262844	8.31748021447382	2.78103259191912	0.0953866515899361	0.537993982222983
"rna69979"	-2.88572984919394	8.28645534779083	2.77493241883019	0.0957506978629101	0.537993982222983
"rna19535"	4.74153292043376	8.69964691734023	2.77125973776277	0.0959706057421237	0.537993982222983
"Predict-miR-438"	2.26581584626767	8.56128040375312	2.76659668997598	0.0962506064759468	0.537993982222983
"Predict-miR-79"	-4.8888561042603	8.01888116553651	2.7617420255679	0.0965430590385672	0.537993982222983
"rna68982"	-0.999074129529675	12.8758218896994	2.71405812097856	0.0994676662702203	0.549857259141778
"Predict-miR-80"	-1.30661767277121	10.0637511033776	2.68877208558868	0.10105766410234	0.554213062656484
"rna29118"	-0.983192791670982	12.8185879610229	2.59985242832512	0.106873665971169	0.581493725874627
"Predict-miR-559"	0.863785677404796	14.2269457051603	2.5230248987535	0.11219518203967	0.603643650511574
"Predict-miR-500"	4.68336050695016	8.30350206797548	2.44510061982982	0.117892325369001	0.603643650511574
"Predict-miR-611"	-1.65635270324694	10.2616902536658	2.42149485077709	0.119680675596244	0.603643650511574
"rna37546"	1.39283534962628	11.085053326615	2.37227307744494	0.123507097968519	0.603643650511574
"rna48654"	-0.976648909037146	13.624955637025	2.35534072429987	0.124854602795296	0.603643650511574
"Predict-miR-163"	-1.4106183453452	10.8338577848117	2.33263077526581	0.126687610546146	0.603643650511574
"Predict-miR-186"	-4.51940059040683	8.47799576453789	2.30542401228834	0.128923095256692	0.603643650511574
"Predict-miR-293"	-2.04162840876045	9.81565778300622	2.29046392153192	0.130171009820865	0.603643650511574
"Predict-miR-195"	-4.4881115632454	8.45591962502155	2.29006907650302	0.130204128170032	0.603643650511574
"Predict-miR-401"	-4.48798259876904	8.05878693136764	2.28969960618236	0.130235126677548	0.603643650511574
"Predict-miR-289"	-4.48567652715306	8.91238309826627	2.28309608644423	0.130790551319753	0.603643650511574
"Predict-miR-229"	-4.62291365555435	8.65977688227527	2.2756391696943	0.131420934182819	0.603643650511574
"Predict-miR-263"	-4.48284486177602	8.29198986216098	2.27499567183622	0.131475492036896	0.603643650511574
"Predict-miR-607"	-4.50050315957211	8.89448552421086	2.2712676552462	0.131792063302188	0.603643650511574
"Predict-miR-391"	-4.48048733022563	8.79967879751343	2.26825847062545	0.132048214240722	0.603643650511574
"rna70363"	2.41581289130641	8.96867952364288	2.2652058429621	0.132308631203006	0.603643650511574
"Predict-miR-118"	-4.47802950366656	9.0574605571816	2.26124132608602	0.13264769703304	0.603643650511574
"Predict-miR-230"	-4.50608851612061	8.82600566427128	2.25927794939763	0.132815974292329	0.603643650511574
"Predict-miR-578"	-4.50899133527312	8.06244789375644	2.25282215935074	0.133370971145071	0.603643650511574
"Predict-miR-201"	-4.47145493138891	8.44521774216914	2.24250439418699	0.134263366696688	0.603643650511574
"Predict-miR-264"	-4.47059170837724	7.91367463937715	2.24004793170932	0.134476811530355	0.603643650511574
"rna39160"	1.96809128695305	8.59711509227398	2.24003308336388	0.134478102873249	0.603643650511574
"rna438"	-4.46989075362337	8.24830671526805	2.23805385779338	0.134650357949212	0.603643650511574
"rna12553"	-0.986831039281731	12.8608125074129	2.23641523399785	0.134793156659797	0.603643650511574
"Predict-miR-501"	-4.51721939301432	8.36907824054757	2.23359823638952	0.135039041452416	0.603643650511574
"Predict-miR-475"	-4.46752066433351	8.78491103897303	2.23131558171568	0.135238653587123	0.603643650511574
"Predict-miR-596"	-4.52203992329195	9.11090639776035	2.22163101958627	0.136089223149855	0.603643650511574
"Predict-miR-566"	-4.4612128803821	9.3244138918325	2.2134135223072	0.136815642767425	0.603643650511574
"Predict-miR-428"	-4.52920815721442	7.79949451854899	2.20272898382302	0.137766650423468	0.603643650511574
"Predict-miR-543"	-1.55299228173462	9.26277995570464	2.19601399713152	0.138368127377203	0.603643650511574
"Predict-miR-313"	-4.44943111829636	9.02553142826858	2.18009826239056	0.139805535480171	0.603643650511574
"Predict-miR-493"	-4.44844621271294	9.83377380753136	2.17732050784166	0.140058118201709	0.603643650511574
"rna20252"	0.844310327046017	13.1449065868966	2.1719621944759	0.140546801296562	0.603643650511574
"rna44065"	1.29479036161441	9.48578741228696	2.16502980746162	0.14118188531796	0.603643650511574
"Predict-miR-506"	-4.43944985857937	8.78804373669002	2.1519999935019	0.142384308039405	0.603643650511574
"rna37801"	5.16237198611691	7.96618345740545	2.14377938165513	0.143148848883356	0.603643650511574
"Predict-miR-181"	-4.43607028110971	8.42354643915719	2.14251243059967	0.14326708926758	0.603643650511574
"Predict-miR-470"	-4.55356227591719	8.5840308754385	2.12511522487122	0.144901883405604	0.603978052818425
"Predict-miR-549"	-4.42913300128865	8.38674168978745	2.12307912329755	0.145094582876785	0.603978052818425
"Predict-miR-137"	-4.41124995704319	8.18958929991853	2.07324485404503	0.149902291809481	0.620254393055996
"Predict-miR-253"	-4.39697375995848	8.36876293165003	2.03373404809528	0.153842227316918	0.631252315479531
"Predict-miR-487"	-4.39502445945568	8.53052590601621	2.02835804454253	0.15438732462524	0.631252315479531
"Predict-miR-476"	-4.38109836287678	8.53917755388688	1.99008372782163	0.158332125149875	0.643573520462141
"Predict-miR-400"	1.45122773427219	10.0778962928009	1.9390543859784	0.163771244182909	0.654038255733396
"rna39161"	1.43965275190137	9.61469180309796	1.92202884511945	0.165633174138802	0.654038255733396
"Predict-miR-439"	-1.93273705097765	9.84266059903139	1.92118919762012	0.165725623190807	0.654038255733396
"Predict-miR-31"	-4.35527051759934	8.57226987662962	1.91971900538086	0.165887640324296	0.654038255733396
"rna46224"	1.80229354285524	8.94098126647345	1.91561061461093	0.166341352106084	0.654038255733396
"rna21854"	-0.703187995050323	13.661192166112	1.89097931526129	0.169091505958019	0.654038255733396
"Predict-miR-387"	-4.32714793641117	8.18101444914108	1.84402822348899	0.174479547785923	0.654038255733396
"Predict-miR-425"	-1.34518182609494	10.3684733640161	1.82201850368642	0.177073196489201	0.654038255733396
"rna34927"	-0.81471413846087	13.2757257079128	1.80285295608827	0.179367968718447	0.654038255733396
"Predict-miR-211"	1.03974658361375	10.6530939896661	1.75067044043043	0.185792470865359	0.654038255733396
"Predict-miR-416"	-1.88387343440799	9.60737968577729	1.71436073393111	0.190420563681996	0.654038255733396
"Predict-miR-58"	-1.53452717194023	9.78175027996752	1.68935862911361	0.193685537543008	0.654038255733396
"rna39356"	-0.951989864546269	14.3034995452275	1.66064231232645	0.197516622457032	0.654038255733396
"rna37802"	3.8926634507145	8.23377221864856	1.65704738890323	0.198002451457301	0.654038255733396
"Predict-miR-468"	3.89265827840401	8.18882088468909	1.65703417889904	0.198004239280581	0.654038255733396
"Predict-miR-550"	3.89265289972856	8.13826341283053	1.65702044175689	0.198006098466049	0.654038255733396
"Predict-miR-120"	3.89897511687617	8.53725347007962	1.65344783603941	0.198490311083093	0.654038255733396
"Predict-miR-73"	3.89911282904774	8.18638234464386	1.64938634780263	0.199042473013003	0.654038255733396
"rna15526"	3.90061608157652	8.11462466574028	1.64705718669359	0.199359937423264	0.654038255733396
"rna54457"	0.861620752648044	13.1856587656258	1.64377483877953	0.199808331052089	0.654038255733396
"Predict-miR-533"	3.91355953774444	8.52584270401544	1.64054835896657	0.200250247705869	0.654038255733396
"Predict-miR-606"	3.9147775296862	8.72850840680299	1.63943876140492	0.200402489688111	0.654038255733396
"Predict-miR-228"	3.88575553041539	7.86448897830629	1.63933343924411	0.200416947448865	0.654038255733396
"Predict-miR-397"	3.88569577249153	9.47607951943754	1.63917958501822	0.200438069496026	0.654038255733396
"Predict-miR-326"	3.90568764672549	8.93918098402327	1.63904785602483	0.200456156135194	0.654038255733396
"Predict-miR-82"	3.88529681197367	8.2909382940745	1.63815214230901	0.20057919019602	0.654038255733396
"Predict-miR-209"	3.88403636501679	7.82488495424953	1.63490304448453	0.20102622763353	0.654038255733396
"Predict-miR-114"	3.88369694689549	8.5436211331007	1.63402731942053	0.201146917391332	0.654038255733396
"Predict-miR-605"	3.92111227975539	9.67565605967671	1.63358401295865	0.201208045018673	0.654038255733396
"Predict-miR-496"	3.9097462029873	8.17711667159242	1.63246433897973	0.201362534412399	0.654038255733396
"Predict-miR-149"	3.92480920412546	10.0294972134368	1.63010088650947	0.201689095099622	0.654038255733396
"rna39357"	3.9263788917375	8.79238484301414	1.62860685998707	0.201895847709393	0.654038255733396
"Predict-miR-251"	3.88133531867591	9.66930443429034	1.62792483569361	0.201990313339101	0.654038255733396
"Predict-miR-625"	3.88089482627071	9.02992003969963	1.62678480336733	0.20214833277803	0.654038255733396
"Predict-miR-307"	3.88078558954785	8.16756120365871	1.62650200235789	0.202187554234533	0.654038255733396
"Predict-miR-142"	3.88029139336058	8.19426413268608	1.62522215534227	0.202365167269495	0.654038255733396
"Predict-miR-67"	3.88004532934399	7.95784231109425	1.62458464665829	0.202453707186965	0.654038255733396
"rna44409"	3.87743787163569	8.06635018844755	1.61781847210155	0.203396238984253	0.654038255733396
"Predict-miR-523"	3.87708492040368	8.76466404709007	1.6169010893916	0.20352442837863	0.654038255733396
"Predict-miR-317"	3.91898772456386	7.76436023592968	1.61686099896614	0.203530032537503	0.654038255733396
"rna11484"	3.91899582502923	7.76178388046727	1.61684693240704	0.203531998916221	0.654038255733396
"Predict-miR-518"	-1.20504840683553	10.6497763147839	1.61413081072946	0.203912108188661	0.654038255733396
"rna46984"	3.87503491546977	7.92066350630791	1.6115657406156	0.204271846835918	0.654038255733396
"rna50694"	3.8749478887092	7.84829187730379	1.61133898013284	0.204303684871961	0.654038255733396
"rna9999"	1.53198524913958	8.91963743880327	1.60024984806165	0.205867807216153	0.654038255733396
"Predict-miR-423"	3.95781642679164	8.0400132059534	1.5966453328812	0.206379264586437	0.654038255733396
"Predict-miR-417"	-1.23728474346321	9.50481473892253	1.59096312314716	0.20718858435644	0.654038255733396
"Predict-miR-55"	3.86499486737062	7.96228813184194	1.58526494319923	0.208003947939021	0.654038255733396
"Predict-miR-178"	3.93917548795139	7.98520989494429	1.5794642697581	0.208837877984081	0.654038255733396
"Predict-miR-565"	3.8584969637161	8.98683019490733	1.56809548782802	0.210483810728468	0.654038255733396
"Predict-miR-575"	3.85627454491733	7.88679136099305	1.5621971684988	0.211343802345741	0.654038255733396
"Predict-miR-381"	1.88793808262879	8.56324781714602	1.55684915929154	0.212127160917339	0.654038255733396
"rna19197"	0.945678484946659	13.0602794318771	1.55244021487559	0.212775560343378	0.654038255733396
"Predict-miR-290"	3.85242918623902	8.87867037398784	1.55196074058481	0.212846215756069	0.654038255733396
"Predict-miR-509"	2.00147379679664	8.32894308880511	1.55115712092005	0.212964699768472	0.654038255733396
"rna6961"	3.84941363104102	8.36202812572678	1.54390626738864	0.214037300348656	0.654423781154519
"Predict-miR-365"	-1.14678115301774	10.4365161510492	1.53680320291492	0.215094269910694	0.654583240060329
"Predict-miR-266"	3.96784222961929	8.13960898545537	1.51677080972092	0.218108820789201	0.654583240060329
"Predict-miR-459"	3.82105583146011	8.3683043177155	1.46705586580701	0.225810786826244	0.654583240060329
"Predict-miR-165"	1.09629317240309	10.7561910607176	1.46533333349476	0.226083434360176	0.654583240060329
"rna7820"	-4.42663910416442	7.85809979643892	1.45778971637263	0.2272821276415	0.654583240060329
"Predict-miR-495"	-0.917970327005818	11.3447282189518	1.45338787740721	0.2279851159547	0.654583240060329
"Predict-miR-9"	0.91739100837494	14.8306346806919	1.44539962278281	0.229267558798765	0.654583240060329
"rna9029"	-1.17252363587055	11.7347930771964	1.44209291532321	0.229800961331728	0.654583240060329
"rna54456"	1.26661926600329	9.34373161135416	1.40500725912905	0.235886988109124	0.654583240060329
"Predict-miR-182"	-1.13543036346309	9.770953324995	1.37423122777252	0.241086228481428	0.654583240060329
"Predict-miR-299"	1.81013776924779	10.1464152788952	1.36199268202729	0.243192430769737	0.654583240060329
"rna34406"	-1.73183335813479	8.72336417449406	1.3577127061581	0.243934283213791	0.654583240060329
"Predict-miR-364"	-1.92397544623047	9.24753365436051	1.34939990308214	0.24538305394881	0.654583240060329
"Predict-miR-406"	-1.32754915325137	10.1705041828197	1.31041217522001	0.25232004235946	0.654583240060329
"rna798"	-0.678595904634463	13.6350918482623	1.30626283931729	0.253072404991775	0.654583240060329
"Predict-miR-363"	1.81653025416657	8.79354443418063	1.29782200490634	0.254611443007375	0.654583240060329
"rna58409"	0.637366689466833	13.1279379670187	1.2922169835188	0.255639790498001	0.654583240060329
"rna31208"	1.32969447272707	8.62945302641125	1.26874029396049	0.260003132962144	0.654583240060329
"rna55382"	1.76590340214553	8.31189706921139	1.23152609083854	0.267110454919349	0.654583240060329
"Predict-miR-427"	-3.77104264778378	8.60324184543566	1.22560880344481	0.268262724047597	0.654583240060329
"Predict-miR-421"	-1.55111952723592	9.04476093733953	1.19760866487196	0.273800153486397	0.654583240060329
"rna17900"	1.07088358888045	9.08072432257166	1.18974440592759	0.275381118698634	0.654583240060329
"rna7683"	0.737474841677787	11.8141607382242	1.1784333281651	0.277675169702368	0.654583240060329
"Predict-miR-226"	-3.84237755961716	8.06342036742586	1.1779923935181	0.277765083583424	0.654583240060329
"rna69972"	-3.73748872019821	7.82825652688166	1.17546207840487	0.278281766188791	0.654583240060329
"Predict-miR-69"	-3.65600170067742	8.88341491404841	1.16540769597425	0.280346848518593	0.654583240060329
"Predict-miR-245"	-1.25766725562146	9.6300089799721	1.16509826205209	0.280410709620772	0.654583240060329
"Predict-miR-204"	-3.64592582017006	8.10722541830559	1.16384476974251	0.280669593831038	0.654583240060329
"Predict-miR-62"	-3.95072247283439	7.88560697984477	1.15297253387278	0.282927757657541	0.654583240060329
"Predict-miR-68"	-3.57036435486301	8.10416154127467	1.15043449431808	0.283458213224067	0.654583240060329
"Predict-miR-3"	-3.56059387850901	8.89960979254248	1.14851107116252	0.283861051566415	0.654583240060329
"Predict-miR-568"	-3.55353067044248	8.37654637988661	1.14709679650992	0.28415771741697	0.654583240060329
"Predict-miR-489"	-3.55171269228596	8.90118925680199	1.14612202652311	0.284362419100736	0.654583240060329
"Predict-miR-22"	-3.55155164280213	8.31830211311109	1.14589124376964	0.284410910830099	0.654583240060329
"rna23853"	-3.55154613460158	8.28629807167707	1.1458833507129	0.284412569492778	0.654583240060329
"Predict-miR-125"	-3.55154268908182	8.26535259265327	1.14587841341008	0.284413607033669	0.654583240060329
"Predict-miR-420"	-3.5515350907622	8.21634866937664	1.14586752531214	0.284415895110972	0.654583240060329
"Predict-miR-594"	-3.55153447541908	8.21219721956944	1.14586664354991	0.284416080409754	0.654583240060329
"Predict-miR-11"	-3.55153265697895	8.19975821441776	1.14586403779895	0.284416627998712	0.654583240060329
"Predict-miR-122"	-3.55152960480984	8.17828613666435	1.14585966416714	0.284417547104321	0.654583240060329
"Predict-miR-34"	-3.55151221486485	8.03990586423498	1.14583474515484	0.284422783831832	0.654583240060329
"Predict-miR-608"	-3.55150920595033	8.012944721316	1.14583043352553	0.284423689932627	0.654583240060329
"Predict-miR-601"	-3.55150396674588	7.96386648228463	1.14582292600551	0.284425267667399	0.654583240060329
"Predict-miR-583"	-3.55150327446923	7.9571884512259	1.14582193400822	0.28442547614035	0.654583240060329
"Predict-miR-258"	-3.55149532448716	7.87776618653078	1.14581054209783	0.2844278702184	0.654583240060329
"Predict-miR-155"	-3.54831117374653	8.07310372201381	1.14124954631858	0.285388446871854	0.654583240060329
"Predict-miR-335"	-3.54744924123293	8.17877112763836	1.14001550479076	0.285649051301762	0.654583240060329
"Predict-miR-613"	-1.56321468466873	10.4760330909133	1.1394548112141	0.285767558119502	0.654583240060329
"Predict-miR-339"	-3.54672206164101	9.20156910547839	1.1389745895982	0.285869106185502	0.654583240060329
"Predict-miR-157"	-3.54591652943876	7.99419308808984	1.13782173004966	0.286113077847782	0.654583240060329
"Predict-miR-42"	-3.54563712138955	8.40641152653531	1.13742189992206	0.286197752844975	0.654583240060329
"rna44328"	-3.54504571956002	8.64055710362936	1.13657569899158	0.286377064048489	0.654583240060329
"Predict-miR-91"	-3.54412314177985	8.00963906059398	1.13525588095218	0.286657020266508	0.654583240060329
"rna19536"	-0.708281347782515	12.9450741068605	1.13370496220319	0.286986441334815	0.654583240060329
"Predict-miR-502"	-3.54197225439198	8.48757844042982	1.13218002485126	0.2873108129564	0.654583240060329
"Predict-miR-101"	-3.54129557155946	8.48791799616583	1.13121267620207	0.287516820640172	0.654583240060329
"Predict-miR-110"	-3.54047278333052	9.05418476358546	1.13003668042548	0.287767515021288	0.654583240060329
"Predict-miR-117"	-3.54012827200042	8.03399555084624	1.12954434778051	0.287872551184611	0.654583240060329
"Predict-miR-595"	-3.53862549128384	9.03523188013504	1.1273972521942	0.288331191331964	0.654583240060329
"Predict-miR-450"	-3.53708446843176	8.36096832390371	1.12519635169416	0.288802290046327	0.654583240060329
"Predict-miR-318"	-3.53680749464492	8.38931844763548	1.12480086546643	0.288887046952833	0.654583240060329
"Predict-miR-384"	-3.5356425553293	8.09372508779263	1.12313776886923	0.289243813020276	0.654583240060329
"Predict-miR-234"	-3.53461019015778	8.88673962454618	1.12166434574461	0.289560359342261	0.654583240060329
"Predict-miR-124"	-3.53430637287748	7.84621925674338	1.12123080153929	0.289653584842366	0.654583240060329
"Predict-miR-294"	-3.5324690168176	8.7080880675786	1.11860962394069	0.290218034934992	0.654583240060329
"Predict-miR-6"	-3.53216310354691	8.9221147156059	1.11817332599593	0.290312124333112	0.654583240060329
"Predict-miR-534"	-3.53060110079846	7.94034578270987	1.11594610605349	0.290793039704454	0.654583240060329
"Predict-miR-190"	-3.53054138540909	8.49926054458513	1.1158609770645	0.290811441442262	0.654583240060329
"Predict-miR-551"	-3.53002536270603	8.24256501532166	1.1151254003941	0.290970507784902	0.654583240060329
"Predict-miR-546"	-3.52849618323745	8.67961928743108	1.1129461687907	0.291442412371778	0.654583240060329
"Predict-miR-20"	-3.52792971547086	10.3848370841291	1.11213911452277	0.291617424812626	0.654583240060329
"rna15527"	-3.52785077424629	9.72986097162187	1.11202665528177	0.291641822626035	0.654583240060329
"Predict-miR-70"	-3.52784156827727	9.05875698148576	1.11201354065776	0.291644667987826	0.654583240060329
"Predict-miR-581"	-3.52719353209962	7.84895581777585	1.11109044094574	0.291845033680935	0.654583240060329
"Predict-miR-452"	-3.52625997307065	9.14658592944097	1.10976089909155	0.292133929664637	0.654583240060329
"Predict-miR-51"	-1.56075522891771	9.75104523729322	1.10839346236418	0.292431440930442	0.654583240060329
"Predict-miR-373"	-3.5230224632899	9.28502326807549	1.10515266062366	0.2931380850875	0.654583240060329
"rna18860"	-3.52292026090499	8.54074603229351	1.10500725049016	0.293169842332925	0.654583240060329
"rna57201"	1.15564504157006	8.58773617222539	1.09998011854701	0.294270467493703	0.654583240060329
"Predict-miR-564"	-3.51877279285573	9.74596886338653	1.09910968680894	0.294461573869015	0.654583240060329
"Predict-miR-498"	-3.51526249209313	8.84118944727881	1.094123250088	0.295559432331548	0.654583240060329
"Predict-miR-336"	-3.5115614663132	8.33334522400614	1.08887100231119	0.296721493667748	0.654583240060329
"rna69774"	-3.5100246739127	7.76411619977462	1.0866916457791	0.297205397379589	0.654583240060329
"Predict-miR-463"	-3.51000911286902	7.76108248004421	1.08666958304038	0.297210301361174	0.654583240060329
"Predict-miR-626"	-3.50205624864459	8.41626690384792	1.07540628473298	0.299727479143065	0.654583240060329
"Predict-miR-484"	-3.49896177484585	8.40989304691851	1.07103048247706	0.300712800201628	0.654583240060329
"Predict-miR-85"	-3.49730550857897	8.2617766648036	1.068689981195	0.301241535573739	0.654583240060329
"Predict-miR-473"	-3.49702871095409	8.78686845323021	1.06829894078036	0.301329991096324	0.654583240060329
"Predict-miR-355"	-3.49656224404512	8.62352242635779	1.06764001864198	0.301479118730823	0.654583240060329
"rna63087"	-0.595559234831895	13.6285897679488	1.06734292950555	0.301546387240109	0.654583240060329
"Predict-miR-579"	-3.49354338947152	8.70842508470495	1.06337776903373	0.302446056541222	0.654583240060329
"Predict-miR-614"	-3.48859522564577	8.23255810342049	1.05639959398639	0.304037792837276	0.654583240060329
"Predict-miR-337"	-3.48839195656816	8.15558268261738	1.05611314711254	0.304103363009982	0.654583240060329
"Predict-miR-92"	-3.48749673077845	8.81881994884398	1.05485179690048	0.304392314654918	0.654583240060329
"Predict-miR-457"	-3.48455329033791	7.82174816495871	1.05070689711952	0.305344338282633	0.654583240060329
"Predict-miR-617"	-3.4815475557264	7.93190382184165	1.04647798653324	0.306319634876304	0.654583240060329
"Predict-miR-74"	-3.478220006832	8.03406668685739	1.04180070408869	0.30740304531151	0.654583240060329
"Predict-miR-497"	-3.47521502973158	8.90874126640152	1.03758084022823	0.308384772656016	0.654583240060329
"Predict-miR-286"	-0.966401570823091	10.8867214982272	1.03680182478294	0.308566451130387	0.654583240060329
"Predict-miR-212"	-3.47388807893995	8.21869757277845	1.03571863068665	0.308819299941631	0.654583240060329
"Predict-miR-377"	-3.46940150791001	8.10966882151193	1.02942784218101	0.310293088967781	0.654870413847277
"Predict-miR-236"	-3.46578564041622	8.17776070086664	1.02436417776933	0.311486045953988	0.654870413847277
"rna12554"	-3.46484264316096	8.36518894003644	1.02304453039512	0.311797924972148	0.654870413847277
"Predict-miR-160"	-3.45914200951217	7.85663465256246	1.01507518231496	0.313690044901223	0.656847942505289
"Predict-miR-156"	-3.45198834750162	8.29047675131669	1.00509467559311	0.316080877804957	0.659355621072169
"Predict-miR-454"	-3.44642677602784	8.17788535015074	0.997351057772102	0.317952324400722	0.659355621072169
"Predict-miR-210"	-3.44460579416479	8.11015233983805	0.994818630128773	0.318567504169709	0.659355621072169
"Predict-miR-332"	-3.44414532283861	8.60202604329664	0.994178491530175	0.318723254649675	0.659355621072169
"Predict-miR-216"	-3.44138459589559	8.13157159331142	0.990342583326182	0.31965865855163	0.659355621072169
"rna30133"	0.813208388466463	10.3095483987365	0.974488809468179	0.323563228495099	0.665423187172956
"Predict-miR-567"	-3.42703200213425	7.96991623759292	0.970456152130305	0.324566442228004	0.66550567234288
"Predict-miR-375"	-3.41664843363167	7.87769564624724	0.956128355246647	0.328164267369496	0.668472328967365
"rna54466"	0.618531567546595	13.2198224693218	0.955616046076553	0.328293888939155	0.668472328967365
"Predict-miR-278"	-0.892092489697097	10.7637922445449	0.953163057466169	0.328915473008544	0.668472328967365
"Predict-miR-557"	-3.40926879742316	8.39987943434986	0.945976313500944	0.33074561119963	0.668750486085715
"rna55111"	0.735419047728865	13.2147327657316	0.945028683580041	0.330987939567749	0.668750486085715
"rna60849"	0.661351185891766	11.6841358969496	0.914238339841482	0.338992357783923	0.682799144898531
"Predict-miR-599"	-3.38350847393409	7.81991151237048	0.910742929106542	0.339917374594927	0.682799144898531
"Predict-miR-584"	-3.37036084227582	7.93545615669858	0.892885656282589	0.344696518642541	0.688987343388068
"rna46361"	0.913231593798901	9.09204776197801	0.888526267694532	0.345876988035181	0.688987343388068
"Predict-miR-407"	0.9082532123808	10.1022961052148	0.888112547212961	0.34598930268547	0.688987343388068
"Predict-miR-270"	-1.11579986389351	9.50627252956206	0.864903907924553	0.352369996658781	0.699677206009245
"Predict-miR-399"	-0.506126013108495	15.0022257786217	0.828563640709232	0.362688196337198	0.718101844323793
"rna55112"	0.872242850587056	9.79838891016123	0.769687889554959	0.380313623504019	0.75084775383222
"rna63728"	0.973105931426727	11.7005433356215	0.764110000457059	0.38204536118391	0.752117790820745
"rna25395"	0.526989226872871	13.1460907446358	0.742018391453463	0.389015081547434	0.761987080438062
"Predict-miR-343"	-1.05474515249006	9.16218101501375	0.738478700256151	0.39014864086473	0.761987080438062
"rna19202"	0.497474346691294	13.0613914964638	0.737799302502445	0.390366753220078	0.761987080438062
"rna54463"	0.539126131066313	13.2540219390037	0.72586344338562	0.394227302412348	0.76735511539981
"rna11056"	-1.96839073077289	7.93271859662945	0.721455266899276	0.39566696974811	0.767994033977371
"Predict-miR-621"	-0.669621821960301	16.4287379977371	0.713139349548026	0.398403589817267	0.771139721467035
"Predict-miR-311"	-1.30681205566787	9.11838676291414	0.680748051082544	0.409329254411319	0.790074063682183
"rna6960"	0.506077714746796	11.7561090704988	0.676350305291232	0.410846323490284	0.790793341314168
"Predict-miR-173"	1.35525505016833	8.97528782827614	0.649466264175549	0.420303568668162	0.801807107871528
"Predict-miR-631"	1.29309770671751	8.52164077371017	0.644674523591993	0.422023136125657	0.801807107871528
"Predict-miR-327"	1.33568518865609	9.0042523719727	0.644076237398201	0.422238575589546	0.801807107871528
"Predict-miR-411"	1.29206560554982	8.67361496161708	0.643774821687548	0.422347176003763	0.801807107871528
"rna50769"	1.29213857431274	8.30053320432768	0.643661881240321	0.42238787933559	0.801807107871528
"Predict-miR-464"	1.50349686990188	8.02054159890914	0.640497984450763	0.423530527312746	0.801807107871528
"Predict-miR-366"	1.30152368874964	8.8738988218021	0.634821546537816	0.425592234904121	0.803508836936469
"rna29819"	1.30917406614902	9.53040729337849	0.627430187126011	0.428299507876973	0.804295586468636
"Predict-miR-221"	-1.08360995637881	9.43476014912868	0.627328679743481	0.428336868046972	0.804295586468636
"Predict-miR-338"	0.835498203387739	10.1020673620764	0.616737977054594	0.43226206331825	0.808779597902691
"Predict-miR-467"	1.32260756199474	9.35295196671524	0.614587417946758	0.433065776011571	0.808779597902691
"Predict-miR-249"	-0.527018292306214	12.8863121446539	0.604030701804728	0.437044250191683	0.812934963418775
"Predict-miR-593"	1.31946002136014	8.18188187644513	0.602452760857439	0.437643714025737	0.812934963418775
"Predict-miR-616"	-1.17844080615983	9.30848810980508	0.599115244573905	0.438915799599446	0.813112111322299
"Predict-miR-351"	0.599597581309952	9.07358579562581	0.591418793866668	0.441871003788976	0.814850418547722
"Predict-miR-248"	-0.454842880316896	12.9182346847149	0.590534253569086	0.442212600514321	0.814850418547722
"Predict-miR-77"	1.27874505717119	8.31179423787962	0.579976489691781	0.446321536369182	0.819514461580049
"rna41499"	0.366010035495586	12.3857470109457	0.577953242098543	0.447115704798377	0.819514461580049
"Predict-miR-150"	-0.921382224728132	9.08604765716523	0.574756071695909	0.448375145566197	0.819648744937149
"rna44578"	-1.14094984111941	9.08145550192164	0.569826600996162	0.450327828749208	0.819677588735483
"Predict-miR-356"	-1.14309382232422	9.23844180653295	0.565610833761724	0.452008344713255	0.819677588735483
"rna60848"	0.55044524700564	10.9468479437413	0.562909186317665	0.453090456333982	0.819677588735483
"Predict-miR-247"	-1.15204330920719	9.60612511349757	0.562796196046738	0.453135801587488	0.819677588735483
"Predict-miR-168"	1.17526848355689	9.28794537738811	0.554521288659284	0.456476160244788	0.823564038457306
"Predict-miR-503"	-0.921621652466543	9.69309841591149	0.550509897939785	0.458109424948089	0.824358366247733
"Predict-miR-214"	1.05127975003701	9.17215755291932	0.543630507657417	0.46093200873003	0.827283163720652
"Predict-miR-545"	0.983086155118768	8.43464515617042	0.531166288183924	0.466116940073502	0.834421776141943
"Predict-miR-494"	0.805680268056797	10.0053784632134	0.525579765424242	0.468471169406668	0.836469193953507
"rna21855"	0.494978741260597	13.2825033617394	0.520975767673724	0.470425743855257	0.836917228794118
"rna40086"	-0.433840493468797	12.9343065476749	0.519290641037767	0.471144431260365	0.836917228794118
"Predict-miR-358"	0.919197642356902	9.04389716587609	0.509744429610111	0.475249511477116	0.839541057318392
"rna55381"	0.387284922762506	12.6919851466835	0.50463435885502	0.477470872164404	0.839541057318392
"Predict-miR-548"	-0.596652932625277	11.5599412351597	0.50281337894511	0.478266549446987	0.839541057318392
"rna29117"	0.958403103748369	9.03063860696733	0.500413855574516	0.479318334073394	0.839541057318392
"rna50768"	-0.486380958867779	12.8766403508374	0.500312288833282	0.479362937322837	0.839541057318392
"Predict-miR-437"	-1.09455192808855	9.58074966316415	0.499064836081958	0.479911313517749	0.839541057318392
"rna9998"	0.920307013485409	8.26790730543047	0.48687716851879	0.485323644903408	0.846038724960346
"rna51554"	1.19596207187534	7.77359335136515	0.484146592825792	0.486550059727911	0.846038724960346
"Predict-miR-83"	-0.657608905894207	10.8717533044986	0.48248533022773	0.487298715679042	0.846038724960346
"rna31043"	0.399275424520708	11.5664869235503	0.478807369351291	0.488963026468303	0.846800629798489
"Predict-miR-357"	0.874876026181864	9.14900753825055	0.466126391784854	0.494774627870965	0.853784047432802
"rna66916"	0.738705598971045	11.7497090514342	0.464633177727883	0.495466574559412	0.853784047432802
"Predict-miR-480"	-1.0908063667089	8.64118730871282	0.461065847372989	0.497126268879429	0.854496376111812
"Predict-miR-21"	-1.06829297767031	8.45670288435213	0.458441657054028	0.498353168701968	0.854496376111812
"Predict-miR-441"	-1.05232428231717	9.91197363359268	0.440475584906626	0.506893000073589	0.866987779828837
"rna11049"	0.738920308515417	8.34057314411914	0.423194260315421	0.515347458592918	0.879271836759768
"Predict-miR-465"	0.91905491088048	8.33697533479827	0.41596429225433	0.518957684190729	0.882185260715524
"Predict-miR-225"	0.639764335752525	10.5203200424509	0.414670534276992	0.519608395240548	0.882185260715524
"Predict-miR-16"	-1.06422418472523	8.63003059318651	0.410892734651149	0.521516735985559	0.883255060210836
"Predict-miR-538"	0.915919263396145	9.2363806286478	0.408075362944086	0.522947995025613	0.883513605287772
"rna52801"	0.694990283415493	8.80242464821676	0.403040436242783	0.525523211718315	0.885698876335014
"rna44066"	-0.323823498386796	16.7748748989471	0.399190307757513	0.527507712120663	0.886880362713816
"rna34588"	-0.411471152474101	13.212220275305	0.395280845470666	0.529536544407284	0.888130466469498
"Predict-miR-572"	0.58501530565897	10.418628377911	0.386739813224409	0.534018091783943	0.893478211677251
"rna55116"	0.410162753603485	13.0926682152402	0.375042353006037	0.540268501161512	0.901589488922359
"rna69973"	-1.12306346517361	8.33819959924235	0.372811751826823	0.541475597543819	0.901589488922359
"Predict-miR-374"	-0.601831686878577	11.2585404649055	0.364004281708642	0.546290726658977	0.907420413753253
"rna41819"	-0.605056152424526	9.24393198833396	0.354605630735017	0.551517501776401	0.913905500545546
"rna504"	-0.465266433853246	11.2044355932828	0.343584605368548	0.557767391637606	0.922050879477479
"Predict-miR-462"	0.458061664175667	11.3769368493769	0.331282878715886	0.564904657283824	0.931620807119623
"rna31044"	-0.417314611789655	11.0410265117269	0.325887578626642	0.56809072402947	0.934644500724675
"Predict-miR-121"	-0.568397557952643	10.432316482062	0.298017271023667	0.585128091865541	0.960388388311375
"Predict-miR-344"	0.400925854925027	10.2549446633077	0.286775034951603	0.592294614390718	0.969847342521294
"rna69978"	-1.03123451186981	7.8668592686531	0.283270204350619	0.594565776093905	0.971264660238506
"Predict-miR-208"	0.303235404567744	11.7636608357212	0.266100406597261	0.605959730259937	0.987542862286832
"Predict-miR-529"	-0.468051227524314	10.8927277722526	0.262683080405079	0.608282805836306	0.988996279606794
"rna11052"	-0.67760803677601	8.18073902577238	0.259470544188236	0.61048413150321	0.99024538701577
"Predict-miR-54"	0.279029159684975	11.5211791509614	0.253008716770513	0.614964470101687	0.993479667496596
"Predict-miR-504"	-0.620667560667334	9.25786459173155	0.252343252292423	0.61542993311831	0.993479667496596
"Predict-miR-346"	-0.480679289795285	10.3018273369294	0.250403243770592	0.616791284162141	0.993479667496596
"rna40590"	-0.39213094218424	10.5120068945259	0.245636128271357	0.620164715063142	0.996590274671235
"Predict-miR-301"	-0.626906477444	9.28639258199586	0.241636155753362	0.623026886380501	0.998866771436023
"rna41496"	0.322503837901627	11.2834194671721	0.228412102116449	0.632703738531585	1
"Predict-miR-389"	-0.57565218141309	9.73971863399068	0.211414887003718	0.645660683258904	1
"Predict-miR-140"	-0.520221628282448	10.3536489908152	0.20658685636956	0.649455846219335	1
"rna40085"	-0.423582067469342	10.1741052014231	0.199097093362294	0.655450635381765	1
"rna65320"	0.337711532701859	10.924295726072	0.19349274830893	0.660025393686605	1
"rna41818"	-0.540619627479792	8.89026424780761	0.190611403484596	0.662408238195149	1
"Predict-miR-37"	-0.547524329411329	9.87064914950797	0.189935050812469	0.662970679649976	1
"Predict-miR-520"	0.581166014502389	9.86424645046652	0.18616239321571	0.666130003995867	1
"Predict-miR-134"	-0.760090881986621	8.72041557931517	0.152301331183295	0.696345753721145	1
"Predict-miR-198"	-0.690515117310431	8.4596333049457	0.148613703934258	0.699863688089814	1
"Predict-miR-262"	-0.650224560705759	8.9433086137	0.143760102907187	0.704571210002082	1
"Predict-miR-319"	-0.65016529727518	9.23237411195862	0.142844819037586	0.705469097504	1
"rna437"	0.226539892310009	10.9812916256853	0.141956198933396	0.706343978804532	1
"rna34999"	-0.616612131111435	7.94513371316303	0.136949535866561	0.711332618490169	1
"rna19198"	-0.610103223606714	9.24134423911573	0.135707853969749	0.712585830683449	1
"rna42423"	-0.595456780242684	8.59141559360325	0.132400069507365	0.715956429358848	1
"Predict-miR-340"	-0.405514658318367	8.93848618265588	0.131670230816498	0.716706533480541	1
"Predict-miR-561"	-0.60107926438361	8.50699400533224	0.130210898520073	0.718213472281242	1
"rna55115"	-0.603687447193514	9.1164473076074	0.128439821420432	0.720055201674605	1
"Predict-miR-378"	-0.606340977259645	9.97189869107035	0.126315647916693	0.722283111886911	1
"Predict-miR-402"	-0.607885262016766	8.95035091550379	0.124872018802639	0.723809310793504	1
"Predict-miR-162"	-0.318922836980026	10.69433215859	0.124854032926567	0.723828387837164	1
"Predict-miR-200"	-0.583289342012013	8.50275290803005	0.12321366251898	0.7255748165303	1
"rna46983"	0.318813410803844	8.98565305673993	0.123162507757947	0.725629488135278	1
"Predict-miR-325"	-0.575083185433897	8.95409528647473	0.120940214526023	0.728016979929007	1
"Predict-miR-342"	-0.571985263083784	9.14619278783346	0.119240759246001	0.729859410514946	1
"Predict-miR-320"	-0.577418576413221	9.23533499679827	0.118893788643406	0.730237375471688	1
"rna10649"	0.227250442453786	14.6307786293945	0.118775745944433	0.730366103408685	1
"Predict-miR-359"	-0.599236288518012	8.48468175203515	0.117269661209404	0.73201483812577	1
"Predict-miR-585"	-0.563710609130881	9.8469826107126	0.114781489311349	0.734764793843036	1
"Predict-miR-116"	0.17923696520324	11.7057724826134	0.113234246944517	0.736491614394879	1
"rna60851"	0.389094686117169	8.89542343405765	0.108004312143148	0.74242773834285	1
"rna21373"	0.194402715592814	12.4273811584204	0.104322822270444	0.746702484568567	1
"Predict-miR-180"	-0.428690710697866	9.62439903716052	0.103846381396252	0.747261758345936	1
"Predict-miR-540"	-0.540781949122432	9.02187584702235	0.103021199441354	0.748233764763373	1
"Predict-miR-203"	-0.538953613888533	9.09478682521643	0.10278667688844	0.748510799004305	1
"Predict-miR-348"	0.36495094889702	8.8185591654878	0.0965430649523675	0.756018205992431	1
"rna9092"	-0.191483714229256	11.8700808205735	0.0958090268259522	0.756918142159129	1
"Predict-miR-562"	0.266269122576707	9.68182304156824	0.0956976086809505	0.757055071502297	1
"rna11055"	-0.525148242149248	8.31512831619092	0.095490735541091	0.757309543805635	1
"Predict-miR-97"	-0.309963833540467	9.75613516381396	0.094102993484217	0.759024448752146	1
"Predict-miR-483"	0.372694615994407	9.25806404806385	0.0919723438018334	0.761684545381719	1
"Predict-miR-183"	0.480816846924062	8.23093459935557	0.0891654080564823	0.765240859603201	1
"rna31047"	-0.230376788498961	10.3293225314708	0.0868636567673065	0.768202886557155	1
"Predict-miR-597"	0.447542032544825	8.91529615940744	0.0836687648744139	0.772385835995828	1
"Predict-miR-410"	-0.321955244414013	10.1063276362687	0.082633950245981	0.773759195029793	1
"Predict-miR-432"	0.406266879277634	9.16927489668793	0.0794769899713934	0.778007432595843	1
"Predict-miR-268"	0.33322624794984	9.20964066358724	0.0786908081340219	0.779079488912189	1
"Predict-miR-169"	-0.28837921817775	10.1065966648299	0.0735439136146496	0.786245049065945	1
"Predict-miR-138"	0.382798851417063	9.31273461815007	0.0729969518589133	0.787022177806594	1
"rna11058"	-0.558154542406283	8.36653747536515	0.0729791758928933	0.787047486411126	1
"Predict-miR-24"	0.376439342181669	8.34187619310046	0.0694875852263497	0.792084321112369	1
"Predict-miR-354"	0.368477871149927	8.90806348374786	0.068975629372261	0.792834142281045	1
"Predict-miR-455"	0.354669565793072	8.78985843188788	0.0651760356212971	0.798494507293413	1
"Predict-miR-48"	0.596883558132273	8.01831174123971	0.0648985639600959	0.79891467728981	1
"rna31209"	0.35373618663598	7.873389427655	0.0647975105430652	0.79906793809868	1
"Predict-miR-139"	0.59028046342751	8.1388722143488	0.0642023907478695	0.799973107764221	1
"rna70362"	-0.248952324133569	10.2340974350821	0.0546202303335441	0.81521034604145	1
"Predict-miR-53"	-0.150513856244888	11.0055108387747	0.0522831146989784	0.819137063325145	1
"Predict-miR-305"	0.465070621189743	8.63444162009376	0.0503792822483131	0.822404603889205	1
"rna20253"	0.315620697947064	7.89663908261102	0.04873613558164	0.825277268290414	1
"Predict-miR-394"	0.320107710408305	8.97970614573142	0.0472540632295644	0.827912218340374	1
"Predict-miR-28"	0.44060941918442	8.43466299545762	0.0459359497744529	0.830292270092431	1
"Predict-miR-298"	-0.334664306354703	8.68997740408605	0.0440276720183945	0.833802137323468	1
"Predict-miR-113"	0.417564111284245	8.90252197156267	0.0434905023519185	0.834804413390945	1
"Predict-miR-135"	0.268319786677821	9.05910585297082	0.0423176811701182	0.83701540168743	1
"Predict-miR-610"	-0.197857353494707	9.07940179293748	0.0414770390834089	0.83861988641879	1
"rna49429"	0.179576477858949	10.5254847146854	0.040810139331338	0.839904844567844	1
"Predict-miR-159"	0.394752086241534	9.48025569034	0.0402071633650465	0.841076076552468	1
"Predict-miR-405"	0.387353862705973	8.86516431685362	0.039148836317505	0.843154093207561	1
"Predict-miR-315"	0.38339539810634	8.63895474047814	0.0385841535146021	0.844274795157733	1
"rna70267"	-0.126277077927092	14.7219008422959	0.0374211199792054	0.846610168459839	1
"Predict-miR-41"	0.373686571766432	10.1897174483946	0.036985303631301	0.847494971691513	1
"Predict-miR-194"	0.371719887990853	8.3071952701806	0.0367217726392166	0.848032622416319	1
"Predict-miR-379"	0.370285254093961	9.83491003105417	0.03652959514244	0.848425961356537	1
"rna51239"	0.366049197380895	9.37415454600787	0.036124587934955	0.849258435789909	1
"Predict-miR-403"	0.36086480135842	8.15905334805291	0.0352692267599135	0.851032628539596	1
"Predict-miR-577"	0.357220200889739	8.36788698230284	0.0347824940626467	0.852052165784238	1
"Predict-miR-287"	0.355940211532906	9.19205660144877	0.0347039727825376	0.852217330773546	1
"rna9559"	0.343634084856455	8.67774903884865	0.0329738245570521	0.855906882008415	1
"Predict-miR-372"	0.342229715395419	8.18425184229483	0.032794699482003	0.856294525133505	1
"Predict-miR-265"	0.341923908369791	8.61184942643479	0.0327469089764927	0.856398132844795	1
"Predict-miR-396"	0.341125149824141	8.25074208976962	0.0326005374128631	0.85671594663296	1
"Predict-miR-477"	0.341129313010162	8.1168982005595	0.0325999397747765	0.856717245781744	1
"Predict-miR-334"	0.344625174999316	8.99603621291798	0.0320913354288113	0.857827345359966	1
"Predict-miR-246"	0.345393669631843	9.07568171094338	0.0319778721655339	0.858076230865675	1
"Predict-miR-56"	0.34765326281214	8.54472290417634	0.0316412898327307	0.858817228117315	1
"Predict-miR-447"	0.347818339042812	7.98977338218814	0.0316165409084785	0.858871873833155	1
"Predict-miR-395"	0.349372973240751	8.84697954406906	0.0313825124297367	0.859389704171794	1
"Predict-miR-205"	0.350646241363305	8.25016734276288	0.0311896740069422	0.859817892482194	1
"Predict-miR-443"	0.351377335269512	7.85849158200692	0.0310785295476279	0.860065303596447	1
"Predict-miR-296"	0.35282931607169	8.82728472035464	0.0308569998425625	0.860559800128659	1
"Predict-miR-574"	0.36080301958473	8.61567423009946	0.0296292376910614	0.863334184555888	1
"Predict-miR-560"	0.243897555941274	8.90370222779177	0.0293310615509572	0.864016865838241	1
"Predict-miR-132"	0.267698961857192	8.71969029469654	0.0291689200549641	0.864389592315827	1
"Predict-miR-207"	0.31843673668229	8.88874379643202	0.028270590334456	0.866474239623037	1
"Predict-miR-239"	-0.211807716908186	9.63838728847048	0.025835115177518	0.872303653279056	1
"Predict-miR-539"	-0.198061300649336	8.81593232452184	0.0239547113829257	0.877000201526546	1
"rna49430"	-0.1712794177322	9.76569547251887	0.0157768717543796	0.900043799024587	1
"Predict-miR-440"	-0.16392924559153	10.0014613845614	0.0156486514362904	0.900448682065062	1
"Predict-miR-40"	0.236419861763504	10.0462189404975	0.0154957485233052	0.90093371440989	1
"Predict-miR-573"	0.110974949043841	10.0493204844553	0.015142549520462	0.902063492094477	1
"rna33836"	-0.0627866858723926	13.1735413613415	0.0109188914995215	0.916777726453563	1
"rna848"	-0.0612113398125126	11.7377319978968	0.0108763705552661	0.916939341106521	1
"Predict-miR-580"	0.0720355165273526	11.6397824479057	0.0106438687466444	0.917828742290657	1
"Predict-miR-90"	0.184366706049249	8.0372123866844	0.00942901166405008	0.922644520548806	1
"rna30256"	0.0706447770715568	10.7092676189618	0.00937373589771973	0.922870884970127	1
"Predict-miR-433"	0.166507891183623	8.21679753728616	0.0082566290957331	0.927599070226262	1
"rna11053"	0.155778147343469	7.92683457098374	0.00696068451461151	0.933509065128836	1
"Predict-miR-63"	0.165110620259881	7.94529799737071	0.00637929698709883	0.936340251361305	1
"Predict-miR-555"	-0.061522779178396	11.4952475112931	0.00612764893741513	0.937605882481088	1
"rna37547"	-0.0338328858718644	13.1731209451404	0.00350494095474829	0.95279078513769	1
"rna10532"	-0.0550768780660313	10.2849372623409	0.00313508328121337	0.955348328085291	1
"Predict-miR-347"	0.0325340793821742	9.24501701015422	0.00104763413603415	0.974179237860133	1
"rna30134"	0.016811253064426	11.9048612823613	0.000794689425253736	0.977510424398091	1
"rna10531"	0.0171025501649524	9.20479482306239	0.000184337528020606	0.989167377760271	1
"Predict-miR-81"	-0.00488723702429092	9.11789887303037	2.5571108261957e-05	0.995965283855863	1
"Predict-miR-119"	0	8.48813419938108	0	1	1
"Predict-miR-146"	0	7.95226274833368	0	1	1
"Predict-miR-197"	0	8.17420033215292	0	1	1
"Predict-miR-35"	0	8.36598616257092	0	1	1
"Predict-miR-461"	0	7.80997171742813	0	1	1
"Predict-miR-508"	0	7.9906370492997	0	1	1
"Predict-miR-524"	0	8.91217620534813	0	1	1
"Predict-miR-582"	0	8.48640545369518	0	1	1
"Predict-miR-600"	0	8.33085337010225	0	1	1
"Predict-miR-7"	0	8.98363983060416	0	1	1
"Predict-miR-98"	0	8.62180882557673	0	1	1
"Predict-miR-123"	0	8.11153597603091	0	1	1
"Predict-miR-78"	0	8.1409953857343	0	1	1
"rna27273"	0	7.87702541812518	0	1	1
"Predict-miR-161"	0	7.76845812396175	0	1	1
"Predict-miR-531"	0	7.84853896791336	0	1	1
"Predict-miR-553"	0	7.82887265729034	0	1	1
"rna46223"	0	7.80007323308895	0	1	1
"rna65319"	0	8.11883429881765	0	1	1
"Predict-miR-12"	0	8.56641582784659	0	1	1
"Predict-miR-13"	0	8.75760431973649	0	1	1
"Predict-miR-141"	0	7.90412895194068	0	1	1
"Predict-miR-185"	0	8.80815921165808	0	1	1
"Predict-miR-19"	0	8.58784750849343	0	1	1
"Predict-miR-191"	0	8.12519570262024	0	1	1
"Predict-miR-218"	0	8.28802082847187	0	1	1
"Predict-miR-220"	0	8.45651002025239	0	1	1
"Predict-miR-256"	0	8.03761250415586	0	1	1
"Predict-miR-257"	0	8.37893115818652	0	1	1
"Predict-miR-267"	0	8.65065054542607	0	1	1
"Predict-miR-271"	0	7.96266461445973	0	1	1
"Predict-miR-285"	0	8.68509886773635	0	1	1
"Predict-miR-308"	0	8.20162375587807	0	1	1
"Predict-miR-310"	0	8.60079640502422	0	1	1
"Predict-miR-330"	0	8.01255479408016	0	1	1
"Predict-miR-360"	0	7.84159848406661	0	1	1
"Predict-miR-382"	0	7.84882674205982	0	1	1
"Predict-miR-383"	0	7.98720374187236	0	1	1
"Predict-miR-388"	0	9.3274632917553	0	1	1
"Predict-miR-414"	0	8.12891795781309	0	1	1
"Predict-miR-429"	0	7.79085912305872	0	1	1
"Predict-miR-46"	0	8.19209768949801	0	1	1
"Predict-miR-517"	0	8.5631631614969	0	1	1
"Predict-miR-528"	0	7.85745859542837	0	1	1
"Predict-miR-586"	0	7.98678758202419	0	1	1
"Predict-miR-604"	0	7.79006261915374	0	1	1
"Predict-miR-615"	0	8.00436246573449	0	1	1
"Predict-miR-630"	0	8.57215146914719	0	1	1
"Predict-miR-84"	0	8.17997129106796	0	1	1
"Predict-miR-95"	0	7.95587645426544	0	1	1
"rna11800"	0	7.78935512496392	0	1	1
"rna35738"	0	8.28950593087874	0	1	1
"rna51238"	0	7.82000452722587	0	1	1
"rna57202"	0	7.79107845191255	0	1	1
"rna61260"	0	8.21412192663205	0	1	1
"rna63088"	0	8.19862737167404	0	1	1
"rna847"	0	8.1560561558784	0	1	1
"rna9028"	0	7.92849416487513	0	1	1
"Predict-miR-108"	0	8.02841726071589	0	1	1
"Predict-miR-136"	0	7.79032755701742	0	1	1
"Predict-miR-153"	0	8.5068171064924	0	1	1
"Predict-miR-192"	0	8.2169603059316	0	1	1
"Predict-miR-202"	0	7.75701835372071	0	1	1
"Predict-miR-213"	0	8.17122573937028	0	1	1
"Predict-miR-273"	0	8.59488216673147	0	1	1
"Predict-miR-300"	0	7.75948521824825	0	1	1
"Predict-miR-321"	0	7.90380735784794	0	1	1
"Predict-miR-322"	0	7.92137819536356	0	1	1
"Predict-miR-33"	0	7.90463644198025	0	1	1
"Predict-miR-333"	0	8.07428174374096	0	1	1
"Predict-miR-392"	0	8.1726538280074	0	1	1
"Predict-miR-393"	0	7.81894516893771	0	1	1
"Predict-miR-408"	0	7.89796799874375	0	1	1
"Predict-miR-409"	0	8.05978441657104	0	1	1
"Predict-miR-442"	0	8.46857989577417	0	1	1
"Predict-miR-460"	0	8.0081306695197	0	1	1
"Predict-miR-485"	0	8.42539409225206	0	1	1
"Predict-miR-488"	0	8.38928631161834	0	1	1
"Predict-miR-530"	0	8.38189715419771	0	1	1
"Predict-miR-532"	0	7.82057804500805	0	1	1
"Predict-miR-619"	0	7.75966252141236	0	1	1
"rna11272"	0	8.06113085223675	0	1	1
"rna34998"	0	7.78913933372262	0	1	1
"rna38812"	0	7.75731242034323	0	1	1
"rna9093"	0	8.57918591446487	0	1	1
"Predict-miR-100"	0	8.10438464727125	0	1	1
"Predict-miR-112"	0	7.78677455391376	0	1	1
"Predict-miR-164"	0	8.02864672350456	0	1	1
"Predict-miR-170"	0	8.43439637972942	0	1	1
"Predict-miR-187"	0	7.89950862956653	0	1	1
"Predict-miR-2"	0	8.0721339273452	0	1	1
"Predict-miR-23"	0	7.92666770659124	0	1	1
"Predict-miR-26"	0	7.81572160887228	0	1	1
"Predict-miR-272"	0	8.65897170990676	0	1	1
"Predict-miR-29"	0	8.40697061768428	0	1	1
"Predict-miR-316"	0	7.81741565715183	0	1	1
"Predict-miR-331"	0	7.78887641616848	0	1	1
"Predict-miR-36"	0	7.78608387917059	0	1	1
"Predict-miR-371"	0	8.05411131806543	0	1	1
"Predict-miR-434"	0	7.75472430152151	0	1	1
"Predict-miR-507"	0	7.84527138635924	0	1	1
"Predict-miR-519"	0	8.14960470954338	0	1	1
"Predict-miR-624"	0	7.81676970776838	0	1	1
"Predict-miR-629"	0	7.78586509587188	0	1	1
"Predict-miR-71"	0	7.79155753875847	0	1	1
"Predict-miR-86"	0	8.05121961084563	0	1	1
"Predict-miR-93"	0	7.89782772870843	0	1	1
"Predict-miR-94"	0	7.97912037611263	0	1	1
"rna34589"	0	8.94291903570432	0	1	1
"rna38809"	0	7.78377407993715	0	1	1
"rna799"	0	7.84545715006563	0	1	1
"Predict-miR-193"	0	7.78537206825331	0	1	1
"Predict-miR-238"	0	7.95152939290969	0	1	1
"Predict-miR-250"	0	7.81298636314671	0	1	1
"Predict-miR-32"	0	8.04922214039336	0	1	1
"Predict-miR-324"	0	8.05483746652429	0	1	1
"Predict-miR-345"	0	7.93460269760794	0	1	1
"Predict-miR-44"	0	8.1014955968084	0	1	1
"Predict-miR-47"	0	7.8945984550988	0	1	1
"Predict-miR-491"	0	7.95261509982316	0	1	1
"Predict-miR-50"	0	7.90120876225306	0	1	1
"Predict-miR-512"	0	7.87164917792947	0	1	1
"Predict-miR-598"	0	7.9811309993434	0	1	1
"Predict-miR-628"	0	7.81529220500055	0	1	1
"Predict-miR-632"	0	8.17198929522944	0	1	1
"rna27274"	0	8.08210343939581	0	1	1
"rna62714"	0	7.78456141992373	0	1	1
"Predict-miR-145"	0	7.75828128901194	0	1	1
"Predict-miR-199"	0	7.90217727336594	0	1	1
"Predict-miR-4"	0	7.75723087868409	0	1	1
"Predict-miR-556"	0	7.84622380878692	0	1	1
"Predict-miR-17"	0	7.75852390214921	0	1	1
"Predict-miR-196"	0	7.78808431441778	0	1	1
"Predict-miR-376"	0	7.92892932281108	0	1	1
"Predict-miR-482"	0	7.87632652991522	0	1	1
"Predict-miR-602"	0	7.78905283859549	0	1	1
"Predict-miR-109"	0	7.78612395573406	0	1	1
"Predict-miR-144"	0	7.75746873328363	0	1	1
"Predict-miR-184"	0	7.95458517039464	0	1	1
"Predict-miR-219"	0	7.78830756321825	0	1	1
"Predict-miR-537"	0	7.81521322073461	0	1	1
"Predict-miR-618"	0	7.92740616265619	0	1	1
"Predict-miR-622"	0	7.78583138753326	0	1	1
