"logFC"	"logCPM"	"LR"	"PValue"	"FDR"
"all-m0166-3p"	3.75318320937951	15.8174119805574	1.92225056305654	0.165608771820523	1
"all-m0148-5p"	3.72692507825216	14.4922829883817	1.58526482577701	0.20800396478024	1
"all-m0178-3p"	1.37294668430052	15.1654623006024	1.52587621762734	0.216732407573525	1
"all-m0167-5p"	-3.09841659718092	14.4803737920789	0.937294776186304	0.332974528413992	1
"all-m0132-3p"	-3.08407444019133	16.8041834634828	0.922783270018435	0.336745236121058	1
"all-m0109-3p"	-3.09672064408882	15.4430507746627	0.919660704781785	0.337564075879838	1
"all-m0145-3p"	-3.0648283917699	16.3216353832508	0.893324110288853	0.344578092489652	1
"all-m0184-3p"	-3.06060716189557	16.8109497340102	0.886744572482476	0.346361025174671	1
"all-m0208-3p"	-0.599788551723984	15.4038907389609	0.445687777146933	0.504389905925036	1
"all-m0157-5p"	0.419025800265009	15.3280071589601	0.190256731483675	0.662703028007302	1
"all-m0118-5p"	-0.324482177962387	16.2868595503866	0.139834293875069	0.708445802177361	1
"all-m0212-3p"	0.194581458011327	17.3105971141672	0.068897317357214	0.79294910170715	1
"all-m0003-3p"	0	14.6281577542157	0	1	1
"all-m0012-3p"	0	14.4872625503491	0	1	1
"all-m0015-3p"	0	14.7125923754804	0	1	1
"all-m0018-3p"	0	14.4207883813532	0	1	1
"all-m0027-3p"	0	14.4366473550915	0	1	1
"all-m0036-5p"	0	14.4292224723332	0	1	1
"all-m0042-5p"	0	16.1859976727576	0	1	1
"all-m0043-3p"	0	14.5336289927108	0	1	1
"all-m0044-5p"	0	14.9681040761034	0	1	1
"all-m0045-3p"	0	14.4865997418587	0	1	1
"all-m0048-5p"	0	15.7477134347365	0	1	1
"all-m0078-3p"	0	14.4288159501003	0	1	1
"all-m0080-5p"	0	14.4370461957508	0	1	1
"all-m0086-5p"	0	14.51556508728	0	1	1
"all-m0087-5p"	0	14.5864947210758	0	1	1
"all-m0095-3p"	0	15.1494015228755	0	1	1
"all-m0115-5p"	0	15.1303951584628	0	1	1
"all-m0135-5p"	0	14.4395699971491	0	1	1
"all-m0136-5p"	0	14.3946126875098	0	1	1
"all-m0141-3p"	0	14.4287535953495	0	1	1
"all-m0144-3p"	0	14.4432213161942	0	1	1
"all-m0164-5p"	0	14.3925090799529	0	1	1
"all-m0165-5p"	0	15.5803547666172	0	1	1
"all-m0190-3p"	0	14.4513288976398	0	1	1
"all-m0191-5p"	0	14.6237288618925	0	1	1
"all-m0209-5p"	0	14.4288159501003	0	1	1
"all-m0211-5p"	0	14.4509242105167	0	1	1
"all-m0216-5p"	0	14.9157828825682	0	1	1
"all-m0222-5p"	0	14.5104521821713	0	1	1
"all-m0006-5p"	0	14.4308305112949	0	1	1
"all-m0016-3p"	0	14.4099525513126	0	1	1
"all-m0017-3p"	0	14.6073147288906	0	1	1
"all-m0021-3p"	0	14.3850701915181	0	1	1
"all-m0026-3p"	0	14.3921025349461	0	1	1
"all-m0028-5p"	0	14.5344446811568	0	1	1
"all-m0032-5p"	0	14.4058754233899	0	1	1
"all-m0047-3p"	0	14.4332202080696	0	1	1
"all-m0052-3p"	0	14.3950471150695	0	1	1
"all-m0071-3p"	0	14.3956073558145	0	1	1
"all-m0089-5p"	0	14.4430070550226	0	1	1
"all-m0100-3p"	0	14.4887817996876	0	1	1
"all-m0112-5p"	0	14.4307274656564	0	1	1
"all-m0113-3p"	0	14.3929754310602	0	1	1
"all-m0139-3p"	0	14.4083532158043	0	1	1
"all-m0155-5p"	0	14.4153133094828	0	1	1
"all-m0173-5p"	0	14.3925474929385	0	1	1
"all-m0177-3p"	0	14.4696328593735	0	1	1
"all-m0182-3p"	0	14.4606479519022	0	1	1
"all-m0183-5p"	0	14.4198017179234	0	1	1
"all-m0187-3p"	0	14.5456012036923	0	1	1
"all-m0192-5p"	0	14.3950471150695	0	1	1
"all-m0195-5p"	0	14.4124114892946	0	1	1
"all-m0198-5p"	0	14.4103557906034	0	1	1
"all-m0206-5p"	0	14.3855345583982	0	1	1
"all-m0207-5p"	0	14.5887190007015	0	1	1
"all-m0213-5p"	0	14.8433573883087	0	1	1
"all-m0217-3p"	0	14.4713786428524	0	1	1
"all-m0223-5p"	0	14.4266796539953	0	1	1
"all-m0226-3p"	0	14.4559130320491	0	1	1
"all-m0007-5p"	0	14.4056937243237	0	1	1
"all-m0019-5p"	0	14.4292224723332	0	1	1
"all-m0036-3p"	0	14.4778565020936	0	1	1
"all-m0224-3p"	0	14.6131039020566	0	1	1
"all-m0033-5p"	0	14.4437457309259	0	1	1
"all-m0117-3p"	0	14.5905467171873	0	1	1
"all-m0129-3p"	0	14.406102669307	0	1	1
"all-m0152-5p"	0	14.4422221888063	0	1	1
"all-m0153-5p"	0	14.4437457309259	0	1	1
"all-m0160-3p"	0	14.5848619380089	0	1	1
"all-m0181-3p"	0	14.4787252675867	0	1	1
"all-m0185-5p"	0	14.5098565551411	0	1	1
"all-m0025-3p"	0	14.4070294679535	0	1	1
"all-m0070-5p"	0	14.4406492921478	0	1	1
"all-m0081-5p"	0	14.4406492921478	0	1	1
"all-m0094-5p"	0	14.4426982869063	0	1	1
"all-m0102-5p"	0	14.3970518112092	0	1	1
"all-m0105-5p"	0	14.5783436243165	0	1	1
"all-m0128-5p"	0	14.4357201470774	0	1	1
"all-m0192-3p"	0	14.5423987443616	0	1	1
"all-m0225-3p"	0	14.4854710064639	0	1	1
"all-m0234-3p"	0	14.3985936481722	0	1	1
"all-m0103-5p"	0	14.4096149858094	0	1	1
"all-m0111-5p"	0	14.4436421262943	0	1	1
"all-m0151-5p"	0	14.3996222722397	0	1	1
"all-m0168-3p"	0	14.4650891767471	0	1	1
"all-m0025-5p"	0	14.4326963148786	0	1	1
"all-m0091-5p"	0	14.4513005112775	0	1	1
