"logFC"	"logCPM"	"LR"	"PValue"	"FDR"
"Predict-miR-529"	-7.48943304054859	10.8927277722526	48.3613833244594	3.54480489183793e-12	2.44946018026001e-09
"Predict-miR-286"	-6.57334145654604	10.8867214982272	38.2587447593043	6.19587943676642e-10	2.1406763454028e-07
"Predict-miR-169"	-7.33421478211157	10.1065966648299	36.5371344301145	1.49785336970466e-09	3.45005559488641e-07
"Predict-miR-163"	-6.52959081405024	10.8338577848117	35.2208987905493	2.94347803995067e-09	5.08485831401478e-07
"Predict-miR-162"	-6.04940841946746	10.69433215859	31.0659599099927	2.49407117353719e-08	3.4468063618284e-06
"Predict-miR-471"	-5.71272453447082	11.4935224304729	26.1717089954177	3.12365531682629e-07	3.59740970654494e-05
"Predict-miR-426"	-7.22240067265462	9.86734068429686	23.8950566003797	1.01732663255905e-06	0.000100424671871186
"Predict-miR-574"	-9.47328510993376	8.61567423009946	20.7461075980863	5.24380562593967e-06	0.000452933710940539
"rna55381"	4.61012969523729	12.6919851466835	18.584311458155	1.62552824171032e-05	0.00124804446113536
"Predict-miR-368"	-3.82866111943056	11.7891807602104	17.8111429359816	2.4395039046898e-05	0.00168569719814065
"Predict-miR-58"	-5.7216480317685	9.78175027996752	17.5537958832281	2.79292679996363e-05	0.00175446583524988
"Predict-miR-299"	-6.5263745150538	10.1464152788952	16.4945553473957	4.87899800498974e-05	0.00280948968453992
"Predict-miR-613"	-6.31182188817786	10.4760330909133	16.2529896663167	5.54220721431028e-05	0.00294589629622185
"rna19536"	4.99758725362235	12.9450741068605	14.6272278175231	0.000131008021156383	0.00611593625080739
"rna40086"	4.83719055554507	12.9343065476749	14.6021537169881	0.00013276272613909	0.00611593625080739
"Predict-miR-612"	-9.19703412054064	10.3456910410862	13.9607353643075	0.000186668632340139	0.00806175155918977
"Predict-miR-374"	-4.5242550998349	11.2585404649055	13.0901238230168	0.000296856728368392	0.0120663529001505
"Predict-miR-462"	-3.69440247308425	11.3769368493769	12.5898586111938	0.000387845483075988	0.0148889571558615
"Predict-miR-296"	-7.13761095805273	8.82728472035464	12.4218327400314	0.000424343594532874	0.0154327065169587
"Predict-miR-292"	-5.78219278920165	9.77259070953632	12.3218110506472	0.00044769612205314	0.015467901016936
"rna798"	4.7025177252979	13.6350918482623	12.164024630004	0.000487201358725224	0.01603124470853
"rna24415"	3.20008399384803	13.6768377746363	11.70479678406	0.000623391891978644	0.0195801726071474
"rna33836"	3.3983127532261	13.1735413613415	11.3442442902858	0.000756821600330423	0.0227375532968836
"Predict-miR-566"	-8.96728321620711	9.3244138918325	11.1675709014789	0.000832395406522283	0.0239660510794541
"Predict-miR-248"	3.922698562098	12.9182346847149	11.0646516962476	0.00087989116747061	0.0243201918688877
"Predict-miR-53"	8.5076771034928	11.0055108387747	10.8744245698697	0.000975013177279892	0.025912850211554
"Predict-miR-565"	-9.29940240046292	8.98683019490733	10.7274357886781	0.00105558623324845	0.027015188413877
"Predict-miR-510"	-8.77564771191576	9.14756758292003	10.5361951643309	0.00117059158689547	0.0288885280908847
"Predict-miR-524"	-11.8981124114985	8.91217620534813	10.0847560358461	0.00149500954946891	0.0354850450568171
"Predict-miR-9"	4.03699992706375	14.8306346806919	10.0294201237409	0.00154059529913822	0.0354850450568171
"Predict-miR-87"	-8.95279821474632	8.31748021447382	9.87117780277941	0.00167888000624603	0.0374227769134196
"Predict-miR-208"	4.08998568142955	11.7636608357212	9.78512228765843	0.00175929528629401	0.0379897825884112
"rna68982"	3.67795813594493	12.8758218896994	9.64136763526211	0.00190243533647864	0.0398358429547497
"Predict-miR-568"	-8.91252613743677	8.37654637988661	9.50738205431662	0.00204646921889092	0.0415325939720481
"rna63087"	3.4543999038811	13.6285897679488	9.45680046638493	0.00210367697398218	0.0415325939720481
"rna15913"	3.73412428416049	12.8583544652376	9.18338344407821	0.00244222137781432	0.0468770825574915
"Predict-miR-399"	2.66012917757465	15.0022257786217	8.96397945047514	0.00275354467243861	0.0506878964924631
"rna70267"	3.2358207698069	14.7219008422959	8.94161111359227	0.00278746753504139	0.0506878964924631
"rna29118"	3.57020008315891	12.8185879610229	8.79824300047649	0.00301520784972951	0.0529527138434076
"Predict-miR-165"	-3.54396700813918	10.7561910607176	8.7681987748825	0.00306528010670956	0.0529527138434076
"Predict-miR-573"	9.17672214304638	10.0493204844553	8.70856194314239	0.00316718953736187	0.0533787309833427
"Predict-miR-555"	5.16291067297586	11.4952475112931	8.56965153453631	0.0034181256979728	0.0533904750778478
"rna34588"	4.27599596623095	13.212220275305	8.53377254363546	0.0034861635354255	0.0533904750778478
"Predict-miR-222"	3.54378606924951	14.1310885108698	8.52336877257761	0.00350614870159321	0.0533904750778478
"rna65320"	4.30776361290412	10.924295726072	8.49248386539703	0.00356616611690593	0.0533904750778478
"Predict-miR-621"	-3.44493340082534	16.4287379977371	8.42070515586372	0.00370971889133192	0.0533904750778478
"rna44065"	8.42897242283609	9.48578741228696	8.39750125872993	0.00375737139396624	0.0533904750778478
"Predict-miR-56"	-6.00842586131347	8.54472290417634	8.38669405894948	0.00377977757319003	0.0533904750778478
"rna437"	3.21846544373549	10.9812916256853	8.38369929077056	0.00378601053374029	0.0533904750778478
"rna20252"	2.66464874900188	13.1449065868966	8.06722035204704	0.00450732082531081	0.0622911738057954
"rna55116"	3.33481444518379	13.0926682152402	8.03015834099781	0.0046004817574529	0.062332017537254
"rna37547"	2.56880388632492	13.1731209451404	7.66003532731835	0.00564573992790065	0.0742828736335029
"rna41496"	-2.56119890160952	11.2834194671721	7.64356234013722	0.00569752865785189	0.0742828736335029
"rna31043"	3.24602649882989	11.5664869235503	7.52963196017935	0.0060692305056097	0.0776636718403019
"Predict-miR-562"	8.41659671943859	9.68182304156824	7.16363526477288	0.00743962702218468	0.0934687685878111
"rna12553"	3.40712499657369	12.8608125074129	7.05777589414891	0.00789219194341196	0.097384011301744
"Predict-miR-453"	-7.68047817444233	9.25100675403269	6.92173995754519	0.00851540825265536	0.101940874191247
"Predict-miR-373"	-8.40562673536659	9.28502326807549	6.91312279884606	0.00855654226207279	0.101940874191247
"Predict-miR-548"	8.2615469472505	11.5599412351597	6.80396385683055	0.00909557201832851	0.1060028486562
"rna11049"	11.7882775485399	8.34057314411914	6.78274963151773	0.00920429944916356	0.1060028486562
"rna65319"	-11.4975701810023	8.11883429881765	6.68754212328172	0.0097088972012779	0.109758375594069
"Predict-miR-338"	11.5676298712294	10.1020673620764	6.66217323585944	0.00984807422117553	0.109758375594069
"rna41819"	11.4573606117808	9.24393198833396	6.60724102388584	0.0101564900244091	0.111398962013757
"Predict-miR-461"	-10.8916745904452	7.80997171742813	6.52037121934782	0.0106645740796939	0.113417984011285
"rna54466"	2.58846431958242	13.2198224693218	6.51965983045623	0.0106688407535941	0.113417984011285
"Predict-miR-400"	11.4615544419598	10.0778962928009	6.47247754197615	0.010955769630595	0.114703588102138
"Predict-miR-364"	-5.59907989463026	9.24753365436051	6.39128423810428	0.0114682029403789	0.118276540773162
"Predict-miR-473"	-8.34503391546501	8.78686845323021	6.36221930990197	0.0116575640599922	0.118461423021391
"rna19202"	2.53023804017851	13.0613914964638	6.29704005740944	0.0120939747686385	0.121115022683032
"Predict-miR-104"	-7.41938077165474	10.3215060768955	6.11596608645261	0.0133966172944105	0.132243750720538
"rna10532"	8.17923202354716	10.2849372623409	6.08375034054194	0.0136430836360686	0.132779870317231
"rna50768"	2.96496952278646	12.8766403508374	5.9281114569218	0.0149012030591553	0.141253165646496
"rna25395"	2.46510569757602	13.1460907446358	5.92558908861317	0.0149225486138846	0.141253165646496
"Predict-miR-582"	-10.3414341803156	8.48640545369518	5.87075527118336	0.0153944458093724	0.143750838571302
"Predict-miR-278"	7.99758763419237	10.7637922445449	5.84641412039172	0.0156088252548998	0.143809310015143
"Predict-miR-211"	3.85017272317598	10.6530939896661	5.77496681996756	0.0162560270433571	0.147801509038944
"Predict-miR-341"	-7.37606245478083	9.1712077610241	5.73185021637459	0.0166599209608261	0.149506563427673
"rna70362"	7.97822158851708	10.2340974350821	5.52287104381722	0.0187694297762648	0.1662778971205
"rna46361"	7.74070800138968	9.09204776197801	5.39528298192618	0.0201912510831449	0.176609550613331
"rna21851"	2.48996302118693	13.2688130789	5.33693737320833	0.0208781220711828	0.180334779389842
"rna504"	4.02610853262908	11.2044355932828	5.28028695147161	0.0215681930503006	0.183995325898244
"Predict-miR-407"	7.59795547562615	10.1022961052148	5.13197745675443	0.0234889522534598	0.197937390330985
"rna54463"	2.28372401730346	13.2540219390037	5.06840768271723	0.024365755724612	0.202124009940161
"rna49429"	-2.77970574155257	10.5254847146854	5.05388468642833	0.0245707913675449	0.202124009940161
"rna21854"	2.08160591663152	13.661192166112	5.02544880165753	0.0249774516097948	0.203051988969038
"Predict-miR-431"	-2.36093550651008	10.996428880749	4.97259554299834	0.0257519751846085	0.20691412619261
"Predict-miR-361"	-6.82781253934171	9.96621943013775	4.84804701582518	0.0276774528192248	0.219828964345797
"rna39356"	2.59540877579541	14.3034995452275	4.73661449209597	0.0295271225659869	0.231764085666906
"Predict-miR-244"	4.38330557360135	12.6752102152864	4.71785568289274	0.0298509459107882	0.231764085666906
"rna9029"	7.21374058505934	11.7347930771964	4.53755881379507	0.0331588480815756	0.25458626693743
"rna31208"	10.3209952815237	8.62945302641125	4.46784772979382	0.0345384717869463	0.262264659393186
"Predict-miR-143"	7.00154768799917	9.61423708175188	4.43851450577732	0.0351368074947955	0.263907978031562
"Predict-miR-98"	-9.37503501286459	8.62180882557673	4.41339707418191	0.0356577649419551	0.264941027686999
"rna54469"	2.21852855510807	13.1925964150171	4.38726464235096	0.0362083602333049	0.266169967246954
"Predict-miR-349"	10.9570495981993	9.52280702028295	4.35716830543845	0.0368535162452766	0.267331443960029
"Predict-miR-249"	2.50062916673807	12.8863121446539	4.34397514271008	0.0371401137773701	0.267331443960029
"Predict-miR-146"	-10.4546609168344	7.95226274833368	4.3197323727794	0.0376728468169675	0.268370486087882
"rna44410"	2.05083732485766	13.6512952182184	4.25604561079168	0.0391108640977486	0.268941741116938
"Predict-miR-70"	-7.47752880037504	9.05875698148576	4.25555156884242	0.0391222416395348	0.268941741116938
"rna46223"	-9.35366702775761	7.80007323308895	4.24816814943207	0.039292692383093	0.268941741116938
"Predict-miR-161"	-9.35359173762248	7.76845812396175	4.24742620022029	0.0393098637522586	0.268941741116938
"rna2228"	6.73711981384745	11.2679048949464	4.19781175532864	0.0404761777241455	0.274206262817496
"rna19197"	2.51939761086272	13.0602794318771	4.15701696552557	0.0414623650406886	0.278160138282678
"Predict-miR-221"	-3.56957143782502	9.43476014912868	4.12736616807503	0.0421949744237478	0.280353147373171
"Predict-miR-180"	10.2112957025643	9.62439903716052	4.08641588595898	0.0432292182777278	0.283436842190265
"Predict-miR-75"	-6.35214554648588	9.47708005216057	4.07666257841668	0.0434794577021246	0.283436842190265
"Predict-miR-99"	10.4402524973396	8.9845760504042	3.98198496493286	0.0459893374700391	0.295553599271239
"rna55112"	6.57495584275379	9.79838891016123	3.95788271047097	0.0466523479164326	0.295553599271239
"Predict-miR-233"	-6.62011819101924	9.41717947670357	3.95717111597696	0.0466720750806606	0.295553599271239
"Predict-miR-385"	-6.03015329617621	9.69990889849673	3.91818829135797	0.0477663302064392	0.295553599271239
"rna34928"	10.3659978583681	8.26125668934063	3.90311856767986	0.0481965643189678	0.295553599271239
"Predict-miR-315"	-4.52240403790819	8.63895474047814	3.89974956617485	0.0482933059887826	0.295553599271239
"Predict-miR-347"	7.00557542534868	9.24501701015422	3.8900555377924	0.0485728173332048	0.295553599271239
"Predict-miR-539"	9.88431403277143	8.81593232452184	3.87151852773441	0.0491120675328535	0.295553599271239
"rna52801"	7.08243841426085	8.80242464821676	3.86893763472994	0.0491876467672828	0.295553599271239
"rna9998"	9.9357325877528	8.26790730543047	3.84470039757852	0.0499034365774829	0.296559982971628
"Predict-miR-260"	10.2433391134942	9.95130506964522	3.83431567907782	0.050213484815746	0.296559982971628
"rna55382"	10.3724577441618	8.31189706921139	3.81040006857333	0.0509352831425024	0.296832793282836
"Predict-miR-495"	3.36241790315267	11.3447282189518	3.80437609951894	0.0511188167882164	0.296832793282836
"Predict-miR-545"	9.86108082260746	8.43464515617042	3.72175831115251	0.0537077855743393	0.309267331932237
"rna29117"	9.82937868836643	9.03063860696733	3.67880436388687	0.0551083547907966	0.31470969554083
"Predict-miR-572"	-2.50982470540967	10.418628377911	3.64767113110576	0.0561476705707256	0.318016724298126
"Predict-miR-329"	2.11156677837953	12.4924459520995	3.52862989963058	0.0603176118980941	0.338857478224252
"Predict-miR-68"	-6.75870666256368	8.10416154127467	3.42861393378896	0.0640758572070282	0.356598973044769
"rna60849"	2.29919111755359	11.6841358969496	3.41752202644069	0.0645077737056384	0.356598973044769
"Predict-miR-294"	-6.78067739922228	8.7080880675786	3.3963971231986	0.0653389882964759	0.358327308832261
"rna46983"	6.143299446838	8.98565305673993	3.37879360994431	0.0660403777980243	0.359322055578227
"Predict-miR-57"	-1.95134850216471	12.8186309137668	3.35105121483249	0.0671621104120387	0.36257045542749
"rna29820"	1.84601312244923	12.9306049202199	3.33177044881205	0.0679536896765769	0.363999996639648
"Predict-miR-261"	6.8345168406414	9.65981011781234	3.22040163069289	0.0727257841379793	0.385599324707689
"Predict-miR-354"	9.32975227143405	8.90806348374786	3.18516745684264	0.0743093831984842	0.385599324707689
"Predict-miR-132"	9.58712420827647	8.71969029469654	3.18140030203398	0.0744808755124678	0.385599324707689
"rna20253"	9.37434075577492	7.89663908261102	3.18114104962053	0.0744926930887225	0.385599324707689
"Predict-miR-138"	9.32883023169952	9.31273461815007	3.16985798368597	0.0750089683529996	0.385599324707689
"Predict-miR-323"	-2.93993612485633	9.91124145005783	3.162793606927	0.0753341661874646	0.385599324707689
"Predict-miR-465"	7.10480237815078	8.33697533479827	3.13492615606342	0.0766318569531695	0.389357449666472
"Predict-miR-340"	6.6073645825849	8.93848618265588	3.11989309820125	0.0773418574104582	0.390096521683406
"Predict-miR-410"	6.50468641170187	10.1063276362687	3.10239492778476	0.078177208448407	0.391452543752531
"rna11053"	10.1177631963183	7.92683457098374	3.07469824976451	0.0795193493397766	0.393475939877695
"rna60848"	2.67652201289099	10.9468479437413	3.07059759536737	0.0797201614802855	0.393475939877695
"Predict-miR-269"	-5.60468840300994	9.17822116233357	3.05229580912977	0.0806231006191344	0.394174338058491
"rna41815"	5.88313612922717	10.2216404154509	3.03156149575659	0.0816593938281911	0.394174338058491
"Predict-miR-438"	9.36902501492083	8.56128040375312	3.02691081365453	0.0818938005576993	0.394174338058491
"rna54457"	1.82721334763534	13.1856587656258	3.02197403348594	0.0821434221134916	0.394174338058491
"Predict-miR-421"	9.33121286423115	9.04476093733953	3.00300977151302	0.0831099892117046	0.396062086519227
"Predict-miR-51"	9.31049362467148	9.75104523729322	2.92987309734061	0.0869543272945658	0.411544110688664
"Predict-miR-229"	-6.1952539404617	8.65977688227527	2.91325644836581	0.0878543191209241	0.412975064711283
"rna10649"	1.7700719712799	14.6307786293945	2.88646869901871	0.0893265199916836	0.414523615482544
"rna63727"	3.42179622337391	11.0986476727301	2.88544102077118	0.0893835292429799	0.414523615482544
"Predict-miR-226"	-6.88971129172669	8.06342036742586	2.86520006772815	0.0905144541831155	0.416969918936886
"Predict-miR-65"	-5.88322126610953	8.82423657624039	2.79316005936564	0.0946673760091472	0.433212959088217
"rna55111"	1.99494808875208	13.2147327657316	2.77647689101022	0.0956583839958387	0.434868048296872
"rna34927"	1.76788894072669	13.2757257079128	2.74148317096432	0.0977739799984126	0.438775226591284
"rna40085"	5.75022591257051	10.1741052014231	2.74125694171776	0.0977878218452356	0.438775226591284
"Predict-miR-494"	6.22038910453504	10.0053784632134	2.67476812285483	0.101950174284814	0.454446582689142
"Predict-miR-616"	8.95161693291531	9.30848810980508	2.66346215947765	0.102677023376555	0.454446582689142
"Predict-miR-247"	8.95418513745918	9.60612511349757	2.65455851850513	0.103253420379443	0.454446582689142
"Predict-miR-97"	5.73262917431324	9.75613516381396	2.60768372945962	0.106346991340228	0.459888484464026
"Predict-miR-596"	-5.88793282221836	9.11090639776035	2.60650004168648	0.106426414335694	0.459888484464026
"Predict-miR-509"	9.01303008246959	8.32894308880511	2.59961184960364	0.106889890732472	0.459888484464026
"rna11056"	10.0410114475438	7.93271859662945	2.59573056980082	0.107152020258622	0.459888484464026
"Predict-miR-518"	-2.19719994619987	10.6497763147839	2.54853465836934	0.110396602197804	0.47088921060915
"Predict-miR-129"	-5.55248911032919	10.6589031607194	2.53402545783243	0.111415656850152	0.472320361248191
"Predict-miR-121"	5.72766820361706	10.432316482062	2.49833045810199	0.113967058004846	0.480190470008222
"Predict-miR-363"	8.83547346111079	8.79354443418063	2.48651921243477	0.114825424978649	0.480874961577251
"Predict-miR-298"	6.85729287323583	8.68997740408605	2.46449139960793	0.11644538914724	0.48217985260952
"rna39161"	3.10171530398353	9.61469180309796	2.4633149715798	0.116532612714602	0.48217985260952
"rna69973"	6.92902253694576	8.33819959924235	2.44917516234943	0.117586642829922	0.483645060687357
"Predict-miR-16"	8.76493263706669	8.63003059318651	2.42375613132093	0.119508069955871	0.488639504967495
"Predict-miR-594"	-5.82088933969441	8.21219721956944	2.29196239542004	0.13004540800825	0.500797666006905
"Predict-miR-534"	-5.8325421738413	7.94034578270987	2.24647870469566	0.133918836014587	0.500797666006905
"Predict-miR-231"	-5.29410308206174	8.86177546687586	2.24440779152328	0.134098238789821	0.500797666006905
"Predict-miR-262"	8.47059934859454	8.9433086137	2.23856660022416	0.134605709508496	0.500797666006905
"Predict-miR-295"	-5.32154188210807	8.8834592668901	2.23620668323148	0.134811343070974	0.500797666006905
"Predict-miR-631"	8.39628665459605	8.52164077371017	2.23391665813282	0.135011222516803	0.500797666006905
"Predict-miR-411"	8.39533899323621	8.67361496161708	2.23339581324618	0.135056729497033	0.500797666006905
"rna50769"	8.39523566932406	8.30053320432768	2.23317641832872	0.135075903488402	0.500797666006905
"rna42423"	8.38090062077858	8.59141559360325	2.23273802230459	0.135114226177323	0.500797666006905
"rna51016"	-1.82584231931347	11.2578142947779	2.23148129010378	0.135224151717945	0.500797666006905
"Predict-miR-561"	8.40174570347843	8.50699400533224	2.22603554226224	0.135701645466969	0.500797666006905
"rna39160"	3.69237275374549	8.59711509227398	2.22492243565236	0.135799476912392	0.500797666006905
"Predict-miR-452"	-5.81739972796707	9.14658592944097	2.22389339729467	0.135889989792334	0.500797666006905
"rna34999"	8.38535606007874	7.94513371316303	2.21660959948894	0.136532597568463	0.500797666006905
"Predict-miR-543"	5.54309328348258	9.26277995570464	2.21089261217458	0.13703935873356	0.500797666006905
"rna51554"	8.47725733600177	7.77359335136515	2.20770871314022	0.13732249696426	0.500797666006905
"Predict-miR-359"	8.46187207300882	8.48468175203515	2.20407883178288	0.137646095540945	0.500797666006905
"Predict-miR-327"	8.39959548371422	9.0042523719727	2.20106674365953	0.137915267679327	0.500797666006905
"Predict-miR-417"	-2.16777336581614	9.50481473892253	2.20064843810457	0.137952695761577	0.500797666006905
"Predict-miR-200"	8.35259567605106	8.50275290803005	2.1970074797364	0.138278953544619	0.500797666006905
"rna69978"	8.65446148620229	7.8668592686531	2.19569578358572	0.138396703485319	0.500797666006905
"Predict-miR-173"	8.40698546233678	8.97528782827614	2.19454315275258	0.138500267075419	0.500797666006905
"Predict-miR-575"	-5.49488471177715	7.88679136099305	2.17920485913992	0.139886717292847	0.500797666006905
"rna60851"	5.80429903923977	8.89542343405765	2.1727645154344	0.140473507154191	0.500797666006905
"Predict-miR-268"	5.70980351301224	9.20964066358724	2.16686300696241	0.141013630815204	0.500797666006905
"Predict-miR-149"	-5.43149753914916	10.0294972134368	2.16347292141752	0.141324956398476	0.500797666006905
"Predict-miR-593"	8.35664054199847	8.18188187644513	2.15090456694559	0.142485920170423	0.500982240982131
"Predict-miR-77"	8.3297493981698	8.31179423787962	2.14710500469284	0.142839001413926	0.500982240982131
"Predict-miR-503"	5.88397872887001	9.69309841591149	2.13946362690309	0.143552074840032	0.500982240982131
"Predict-miR-64"	-4.59612565628677	10.0798582763356	2.11570118524928	0.145795264185352	0.506253907296877
"Predict-miR-464"	8.42276640730659	8.02054159890914	2.0777256115447	0.149462733968037	0.516393745859569
"Predict-miR-567"	-5.98174234580021	7.96991623759292	2.05705590047728	0.151502639929751	0.520837433788349
"Predict-miR-301"	-2.62126702090156	9.28639258199586	2.04521261282903	0.152685651141018	0.522305866031898
"rna11052"	5.71939826901624	8.18073902577238	2.01657802562043	0.155589432870468	0.529617232086173
"Predict-miR-140"	-2.22387733833199	10.3536489908152	1.99197770963767	0.158134245967069	0.535640999819825
"Predict-miR-504"	5.63143195407853	9.25786459173155	1.9455250009528	0.163069891748992	0.546951325389716
"Predict-miR-319"	-3.46648503211959	9.23237411195862	1.94220228984224	0.163429612311871	0.546951325389716
"rna41818"	5.52004624326226	8.89026424780761	1.92990197791836	0.164769169400547	0.546951325389716
"Predict-miR-422"	-4.90598749999308	9.12643149478958	1.92508121452257	0.165297590868238	0.546951325389716
"Predict-miR-474"	-4.92622858985065	8.74485672284428	1.92386683615952	0.165431008692403	0.546951325389716
"Predict-miR-406"	5.42673239456516	10.1705041828197	1.90663062624431	0.167338014948129	0.549160280310662
"rna31044"	1.9440553258075	11.0410265117269	1.90348643197042	0.167688595000795	0.549160280310662
"Predict-miR-389"	5.45847462761046	9.73971863399068	1.86558576623386	0.171981504609715	0.560562357006192
"Predict-miR-320"	-3.31492008622059	9.23533499679827	1.83971553394566	0.174984292066228	0.567672046092786
"Predict-miR-81"	5.1462190858344	9.11789887303037	1.82516658059315	0.176699513317078	0.569676577818793
"Predict-miR-45"	5.69408417064974	9.21376432874003	1.81845327419483	0.177497498110533	0.569676577818793
"rna38013"	1.35246059288789	12.994935840491	1.81361272086415	0.178075457031634	0.569676577818793
"Predict-miR-571"	-2.66550960021528	8.1917847805543	1.78629687949986	0.181378003076071	0.577567742514124
"Predict-miR-587"	-2.25176776564476	12.0644737669933	1.7348870932067	0.187787972000785	0.595236186479552
"Predict-miR-270"	5.09055481768691	9.50627252956206	1.6850093568579	0.194260154403848	0.611438792635993
"Predict-miR-580"	1.72109547349754	11.6397824479057	1.64475568241046	0.199674216392602	0.611438792635993
"Predict-miR-40"	7.59128287089438	10.0462189404975	1.63499577372978	0.201013452957995	0.611438792635993
"Predict-miR-358"	5.18548005289307	9.04389716587609	1.62964355988313	0.201752356313478	0.611438792635993
"Predict-miR-433"	7.55982973048419	8.21679753728616	1.61542250055306	0.203731237662162	0.611438792635993
"Predict-miR-80"	2.11006920901373	10.0637511033776	1.60178444865575	0.20565051157436	0.611438792635993
"Predict-miR-265"	7.44516069679723	8.61184942643479	1.60165762410505	0.205668459350951	0.611438792635993
"Predict-miR-372"	7.44529059943374	8.18425184229483	1.6016351459567	0.205671640574484	0.611438792635993
"Predict-miR-396"	7.44420586452814	8.25074208976962	1.6011484027659	0.205740541229727	0.611438792635993
"Predict-miR-477"	7.4441721936607	8.1168982005595	1.6011154058898	0.205745213069727	0.611438792635993
"rna9559"	7.44474387755374	8.67774903884865	1.60047632950767	0.205835720963158	0.611438792635993
"rna9999"	4.99631208088396	8.91963743880327	1.59565877310656	0.20651951247766	0.611438792635993
"Predict-miR-287"	7.4442260171693	9.19205660144877	1.59422226400129	0.206723925849609	0.611438792635993
"Predict-miR-577"	7.44144658235135	8.36788698230284	1.5910434864411	0.207177112062221	0.611438792635993
"Predict-miR-403"	7.44056575075136	8.15905334805291	1.58849795834328	0.20754086498246	0.611438792635993
"Predict-miR-194"	7.43794952823668	8.3071952701806	1.58087673543603	0.208634452030472	0.611438792635993
"Predict-miR-41"	7.43747650191519	10.1897174483946	1.57948943101036	0.208834252160702	0.611438792635993
"Predict-miR-405"	7.44203253135729	8.86516431685362	1.5771011881258	0.209178738530591	0.611438792635993
"Predict-miR-334"	7.41593091112217	8.99603621291798	1.57341336036723	0.209712002684125	0.611438792635993
"Predict-miR-113"	7.44019779699888	8.90252197156267	1.56041745972927	0.211604106610735	0.614363183479066
"Predict-miR-447"	7.39023068594601	7.98977338218814	1.54815995888699	0.213407286458135	0.615907225843298
"Predict-miR-395"	7.37776744610501	8.84697954406906	1.53589882600639	0.215229290479842	0.615907225843298
"Predict-miR-305"	7.43771956069655	8.63444162009376	1.53363063842173	0.215568367443446	0.615907225843298
"Predict-miR-28"	7.42138845475938	8.43466299545762	1.53093118143891	0.215972744798855	0.615907225843298
"Predict-miR-205"	7.36758943631677	8.25016734276288	1.5258789339629	0.216731998507385	0.615907225843298
"Predict-miR-443"	7.36175867642379	7.85849158200692	1.52013597535449	0.217598917282792	0.615907225843298
"rna69979"	5.62982783413403	8.28645534779083	1.51263967799827	0.218736736370238	0.615907225843298
"Predict-miR-83"	-1.72303050139304	10.8717533044986	1.50916504238871	0.21926653770977	0.615907225843298
"Predict-miR-214"	5.24334379782368	9.17215755291932	1.50112423930914	0.22049846034876	0.616860065186208
"Predict-miR-54"	1.24840443613694	11.5211791509614	1.49136742877903	0.222004416715387	0.618568757864244
"Predict-miR-90"	-3.29262103298163	8.0372123866844	1.47621076747018	0.224368325264218	0.622644629548492
"rna70363"	5.485042993415	8.96867952364288	1.45202916520004	0.228202634698013	0.630158061647377
"rna49430"	5.09955086260619	9.76569547251887	1.44768565424352	0.22889967217582	0.630158061647377
"Predict-miR-293"	5.12144388420953	9.81565778300622	1.43194230637108	0.231447714471971	0.634644328175126
"Predict-miR-116"	1.23214517879535	11.7057724826134	1.4100484499828	0.235048350434402	0.639673912743626
"Predict-miR-139"	7.38219606601809	8.1388722143488	1.40953626008	0.235133391949176	0.639673912743626
"Predict-miR-48"	7.38025985240905	8.01831174123971	1.40366095328352	0.236111568240414	0.639816053545593
"rna54456"	2.5755546270661	9.34373161135416	1.39520129482595	0.237528685560435	0.641141881727582
"rna505"	2.32556153370274	11.7160050827304	1.35379171791863	0.244616335828345	0.655418937837673
"Predict-miR-49"	4.95423529748912	10.5232153485508	1.34822374403501	0.245588884433654	0.655418937837673
"Predict-miR-105"	-4.3914532818037	9.62749058207378	1.34779745405818	0.245663538205438	0.655418937837673
"rna44066"	0.897003485463305	16.7748748989471	1.33299316913847	0.248273427183941	0.659834377631167
"Predict-miR-439"	4.94211743150577	9.84266059903139	1.31282014068902	0.251884687673331	0.666867123303724
"Predict-miR-479"	1.55110240237785	10.0802436202508	1.26429469521258	0.260839726198219	0.687939888560951
"Predict-miR-560"	4.75820694034397	8.90370222779177	1.20293910302667	0.272735036662648	0.714703632734106
"rna31209"	4.69736420137123	7.873389427655	1.19752151115799	0.273817611645485	0.714703632734106
"Predict-miR-455"	4.5953934773915	8.78985843188788	1.19616064279547	0.274090394608594	0.714703632734106
"Predict-miR-24"	4.65749964048291	8.34187619310046	1.1570078005612	0.282086961722498	0.732789814098669
"Predict-miR-394"	4.68976669472114	8.97970614573142	1.14894060319781	0.283771028295408	0.734403672479875
"Predict-miR-365"	1.96328169541372	10.4365161510492	1.13461493411565	0.286793101556831	0.739455347670784
"rna30133"	1.77716078112631	10.3095483987365	1.09768336737136	0.294775070995556	0.757210312483009
"Predict-miR-430"	4.38658157081638	9.42146255419778	1.0545428844308	0.304463134824887	0.778331738098014
"rna46224"	4.21247310636697	8.94098126647345	1.05111592803965	0.305250218559424	0.778331738098014
"rna21855"	-1.07069962623161	13.2825033617394	1.04389988967601	0.306916192182421	0.779702532345783
"rna30134"	-0.926519550918751	11.9048612823613	1.01709778052462	0.313208414291592	0.792562222471911
"rna30256"	1.36039803963367	10.7092676189618	1.01048474590754	0.314786736908023	0.792562222471911
"Predict-miR-183"	4.42172401787684	8.23093459935557	1.00784727193138	0.315419118928764	0.792562222471911
"Predict-miR-559"	0.792491422440737	14.2269457051603	0.925189928535428	0.336115946257946	0.841507677044349
"Predict-miR-390"	-3.41572592225883	9.76991297199503	0.902514234462949	0.342108445914756	0.852897916050341
"Predict-miR-520"	-1.86380343289679	9.86424645046652	0.898686926347054	0.343134038584652	0.852897916050341
"Predict-miR-437"	4.27254934270892	9.58074966316415	0.890442154450744	0.345357516381649	0.855347827310821
"Predict-miR-441"	4.12798920485238	9.91197363359268	0.859953050572894	0.353751830374222	0.870844141573442
"rna48654"	0.988535272553657	13.624955637025	0.858585320932594	0.354134882463295	0.870844141573442
"Predict-miR-346"	1.73672677920531	10.3018273369294	0.81427077702471	0.366860599077703	0.898938560151392
"Predict-miR-432"	3.61189261417376	9.16927489668793	0.73397690900225	0.391597146946622	0.956161231590515
"rna31047"	1.22335930372396	10.3293225314708	0.726841557587582	0.393908882284737	0.958419146685751
"Predict-miR-402"	3.79334748351555	8.95035091550379	0.671340368899225	0.412584683445418	0.994250416058721
"rna19198"	3.64152985382402	9.24134423911573	0.667042109588073	0.414084766886712	0.994250416058721
"rna55115"	3.75697544018631	9.1164473076074	0.666482064839816	0.414280814614794	0.994250416058721
"Predict-miR-134"	3.8624066793273	8.72041557931517	0.663460381744503	0.415340950008963	0.994250416058721
"Predict-miR-325"	3.62796599395742	8.95409528647473	0.662070955587593	0.415829768800247	0.994250416058721
"Predict-miR-585"	3.61808633737377	9.8469826107126	0.65625087830642	0.41788665277425	0.994775652522344
"Predict-miR-203"	3.60632110659009	9.09478682521643	0.648013261361186	0.420823887230949	0.994775652522344
"rna11055"	3.70618044308367	8.31512831619092	0.644039901719525	0.422251665160042	0.994775652522344
"Predict-miR-198"	3.74756895819612	8.4596333049457	0.642280057469545	0.422886359370932	0.994775652522344
"Predict-miR-182"	1.55836063096402	9.770953324995	0.641149330667218	0.423294914108728	0.994775652522344
"Predict-miR-342"	-1.96442629142466	9.14619278783346	0.636038077515291	0.425149118638842	0.994775652522344
"Predict-miR-366"	-1.94282388052556	8.8738988218021	0.630129017306794	0.42730799345929	0.994775652522344
"rna29819"	-1.95955607998378	9.53040729337849	0.629424797862253	0.427566380317129	0.994775652522344
"rna35737"	-0.821316245421651	11.7454064077172	0.621431750485247	0.430515735682174	0.995950755869015
"Predict-miR-288"	-0.791283837608721	11.5818451357992	0.620250834089076	0.430954089732034	0.995950755869015
"rna11058"	3.75466813690749	8.36653747536515	0.614690431885125	0.433027225612289	0.997406042993638
"Predict-miR-483"	-1.44943166889238	9.25806404806385	0.607341709291724	0.435790462743509	0.99975337439387
"Predict-miR-311"	3.47213186524641	9.11838676291414	0.599839691886407	0.438639197424231	0.99975337439387
"Predict-miR-467"	-1.92941657783882	9.35295196671524	0.590132133714409	0.442368027980174	0.99975337439387
"rna34406"	-1.77364465069676	8.72336417449406	0.577858970697495	0.447152761833545	0.99975337439387
"rna44578"	3.21820316090951	9.08145550192164	0.5619974922372	0.453456540388722	0.99975337439387
"Predict-miR-356"	3.21724122928109	9.23844180653295	0.560419712533612	0.454091183441312	0.99975337439387
"Predict-miR-21"	3.2085337861194	8.45670288435213	0.548835401687633	0.458793939156227	0.99975337439387
"Predict-miR-538"	-1.57158436279941	9.2363806286478	0.532408393591972	0.465596077113665	0.99975337439387
"rna37546"	1.04519933989359	11.085053326615	0.526450389461115	0.468103024366636	0.99975337439387
"Predict-miR-611"	-1.16139390341163	10.2616902536658	0.522961829650381	0.469580977148899	0.99975337439387
"Predict-miR-416"	3.10395247382801	9.60737968577729	0.505201035300811	0.477223703466181	0.99975337439387
"Predict-miR-239"	-1.39949526759921	9.63838728847048	0.495835050877851	0.481335903676515	0.99975337439387
"Predict-miR-245"	1.60687064658854	9.6300089799721	0.48753975871549	0.485026819052551	0.99975337439387
"Predict-miR-379"	-1.94072312239665	9.83491003105417	0.478959052947735	0.488894201548951	0.99975337439387
"Predict-miR-425"	-1.04652822015964	10.3684733640161	0.454996193343881	0.49997184142618	0.99975337439387
"rna17900"	1.19920968008917	9.08072432257166	0.41557710402915	0.519152274775713	0.99975337439387
"Predict-miR-63"	3.11994419802147	7.94529799737071	0.412718892490711	0.520592718903094	0.99975337439387
"Predict-miR-351"	0.910678893409794	9.07358579562581	0.412430782844014	0.520738307385189	0.99975337439387
"Predict-miR-135"	-1.25910534690032	9.05910585297082	0.411291266543589	0.521314836060586	0.99975337439387
"Predict-miR-540"	2.60778268726364	9.02187584702235	0.381051030558126	0.537041278700319	0.99975337439387
"rna19201"	-1.36994671182318	9.91703009894555	0.380503368819149	0.53733396494827	0.99975337439387
"Predict-miR-480"	-1.51752126872143	8.64118730871282	0.37080509622702	0.54256574848135	0.99975337439387
"rna10531"	1.36877123978888	9.20479482306239	0.370480883877175	0.542742261862939	0.99975337439387
"rna51239"	2.69531574835401	9.37415454600787	0.369978650322416	0.543015905770727	0.99975337439387
"rna7683"	-0.660406429206847	11.8141607382242	0.361548492774924	0.547647497514813	0.99975337439387
"rna58409"	0.507178683168678	13.1279379670187	0.327814461485271	0.566948855113198	0.99975337439387
"rna848"	0.574689428987893	11.7377319978968	0.310437543827664	0.577411815027403	0.99975337439387
"Predict-miR-597"	-1.22709144048049	8.91529615940744	0.249799256688181	0.617216462453564	0.99975337439387
"Predict-miR-486"	0.979046835477581	10.8419276572925	0.246788001400052	0.619345880569958	0.99975337439387
"Predict-miR-225"	-0.766275104067124	10.5203200424509	0.238677780255513	0.625162726659885	0.99975337439387
"rna66916"	0.894486985051098	11.7497090514342	0.22475791858324	0.63543829343742	0.99975337439387
"Predict-miR-246"	1.7226809152427	9.07568171094338	0.210072658005416	0.646710461375677	0.99975337439387
"Predict-miR-159"	1.82852821781736	9.48025569034	0.209971893047015	0.646789434834961	0.99975337439387
"Predict-miR-369"	-0.515833553816756	12.547926138088	0.197829263139997	0.656478737130437	0.99975337439387
"Predict-miR-378"	1.37870068142366	9.97189869107035	0.179629408311913	0.671691914764996	0.99975337439387
"Predict-miR-344"	-0.598280546920359	10.2549446633077	0.172861503954685	0.677581119788396	0.99975337439387
"rna40590"	-0.489430990566102	10.5120068945259	0.155062407041289	0.693743735353972	0.99975337439387
"Predict-miR-215"	1.00927955637446	9.86732008207768	0.151651255676711	0.696962327409008	0.99975337439387
"Predict-miR-541"	1.00929291037529	10.2358951540259	0.150776875806125	0.697794050784335	0.99975337439387
"rna57201"	0.739750007890527	8.58773617222539	0.130288541408834	0.718133056739894	0.99975337439387
"rna33835"	0.722024585249367	9.47656991282232	0.123603360509813	0.725158744995566	0.99975337439387
"rna9752"	0.394349725914908	13.2189554497289	0.122121280643045	0.72674508124795	0.99975337439387
"Predict-miR-207"	0.862944745703213	8.88874379643202	0.114519609222429	0.735056152885909	0.99975337439387
"Predict-miR-168"	-0.864699051608802	9.28794537738811	0.103932429895625	0.747160645007853	0.99975337439387
"Predict-miR-37"	-0.689331150497835	9.87064914950797	0.101324368453666	0.75024609156829	0.99975337439387
"Predict-miR-357"	0.557548277090213	9.14900753825055	0.0555367676863554	0.81369464711663	0.99975337439387
"Predict-miR-440"	-0.487931500528455	10.0014613845614	0.0470797711997157	0.828224917614386	0.99975337439387
"Predict-miR-490"	0.312797865505511	12.0693855699734	0.0435337044661175	0.834723566837929	0.99975337439387
"Predict-miR-343"	-0.449102102266882	9.16218101501375	0.0433299959356255	0.83510514570769	0.99975337439387
"Predict-miR-348"	-0.423032119429123	8.8185591654878	0.0414631612683181	0.838646515642365	0.99975337439387
"Predict-miR-381"	-0.407179446671476	8.56324781714602	0.0283813317037236	0.86621543207667	0.99975337439387
"Predict-miR-150"	0.305010237481855	9.08604765716523	0.0198466805627646	0.887966126884381	0.99975337439387
"Predict-miR-303"	0.193073922587372	10.0700747702323	0.0180460741842907	0.893137142539465	0.99975337439387
"Predict-miR-610"	0.151026210635444	9.07940179293748	0.0084560264577842	0.926732477661459	0.99975337439387
"rna63728"	0.110203095642014	11.7005433356215	0.00365839198569162	0.951769646916053	0.99975337439387
"rna9092"	-0.0662036595440848	11.8700808205735	0.00335555982966085	0.953806621635958	0.99975337439387
"rna21373"	-0.0514037215331886	12.4273811584204	0.00300189710170073	0.956306108977214	0.99975337439387
"Predict-miR-634"	-0.0732262644862085	9.76960450359329	0.00299762991151908	0.956337144366221	0.99975337439387
"rna6960"	-0.0232589035663925	11.7561090704988	0.000523470592083797	0.981746408925492	0.99975337439387
"rna41499"	-0.00458233548518505	12.3857470109457	3.48722743588326e-05	0.995288299531261	0.99975337439387
"rna37802"	-0.744413601931017	8.23377221864856	5.35093567677336e-07	0.999416346777196	0.99975337439387
"Predict-miR-217"	4.84747295527259	8.24705677735465	5.2485197343799e-07	0.99942195927012	0.99975337439387
"Predict-miR-277"	5.83790774758648	9.16489854696745	5.17119257636978e-07	0.999426233246574	0.99975337439387
"Predict-miR-223"	-0.672081814242078	9.38364841422402	5.16446570841822e-07	0.999426606555871	0.99975337439387
"Predict-miR-456"	4.97976516227976	8.43688171310676	5.12045586376075e-07	0.999429054915949	0.99975337439387
"Predict-miR-181"	-0.203839052458875	8.42354643915719	5.04324439987158e-07	0.999433375912786	0.99975337439387
"Predict-miR-263"	-0.157420772333117	8.29198986216098	4.99563142852821e-07	0.999436056987518	0.99975337439387
"rna68981"	5.97175657620035	9.4707251316082	4.9488219033833e-07	0.999438705304327	0.99975337439387
"rna37801"	5.16237198611691	7.96618345740545	4.9478349772869e-07	0.999438761275619	0.99975337439387
"Predict-miR-564"	3.51877279285573	9.74596886338653	4.91409737790605e-07	0.999440677995992	0.99975337439387
"Predict-miR-117"	3.54012827200042	8.03399555084624	4.84574810499794e-07	0.999444581368942	0.99975337439387
"Predict-miR-130"	6.0784045011114	10.5486592965734	4.83665999695404e-07	0.999445102451811	0.99975337439387
"Predict-miR-73"	-0.831499677375138	8.18638234464386	4.83417178287482e-07	0.999445245203347	0.99975337439387
"Predict-miR-273"	-4.71173705015054	8.59488216673147	4.73912088239103e-07	0.999450726153838	0.99975337439387
"Predict-miR-517"	-4.73353039404854	8.5631631614969	4.70767602678279e-07	0.999452551448056	0.99975337439387
"Predict-miR-114"	3.88369694689549	8.5436211331007	4.69608803399524e-07	0.999453225638198	0.99975337439387
"Predict-miR-142"	3.88029139336058	8.19426413268608	4.63879501033659e-07	0.999456571240464	0.99975337439387
"Predict-miR-500"	4.68336050695016	8.30350206797548	4.62789298438793e-07	0.999457210195032	0.99975337439387
"Predict-miR-123"	-4.67149743614906	8.11153597603091	4.55297836765567e-07	0.999461621358883	0.99975337439387
"Predict-miR-579"	3.49354338947152	8.70842508470495	4.54091848567373e-07	0.999462334857451	0.99975337439387
"rna46984"	-1.7371281325791	7.92066350630791	4.49801619950563e-07	0.999464880796486	0.99975337439387
"Predict-miR-250"	0	7.81298636314671	4.45784374747404e-07	0.999467275770209	0.99975337439387
"rna15912"	0.644408747894558	8.36765599346247	4.41281699181673e-07	0.999469973006763	0.99975337439387
"Predict-miR-102"	5.05307815288262	9.53580799578378	4.35739540449731e-07	0.999473311888532	0.99975337439387
"Predict-miR-586"	0	7.98678758202419	4.35382632169024e-07	0.999473527634193	0.99975337439387
"Predict-miR-501"	4.51721939301432	8.36907824054757	4.32670380412503e-07	0.999475170047194	0.99975337439387
"Predict-miR-393"	0	7.81894516893771	4.31305875459032e-07	0.999475998274068	0.99975337439387
"Predict-miR-530"	0	8.38189715419771	4.29702367021889e-07	0.999476973247437	0.99975337439387
"rna50694"	3.8749478887092	7.84829187730379	4.29136127522156e-07	0.999477317969758	0.99975337439387
"Predict-miR-606"	-1.69765743496517	8.72850840680299	4.2638658825922e-07	0.999478995111177	0.99975337439387
"Predict-miR-78"	-4.70158758892025	8.1409953857343	4.24674077237341e-07	0.999480042428548	0.99975337439387
"Predict-miR-476"	4.38109836287678	8.53917755388688	4.2450876769351e-07	0.999480143638285	0.99975337439387
"rna53549"	2.71543579833106	9.08344749105145	4.18903146837124e-07	0.99948358738518	0.99975337439387
"rna12554"	-1.12194589889479	8.36518894003644	4.18485614162023e-07	0.999483844810873	0.99975337439387
"Predict-miR-170"	0	8.43439637972942	4.18364033194507e-07	0.99948391979457	0.99975337439387
"Predict-miR-119"	-4.63604062005786	8.48813419938108	4.15099284722942e-07	0.999485937381649	0.99975337439387
"Predict-miR-408"	0	7.89796799874375	4.13296991297329e-07	0.999487054583535	0.99975337439387
"Predict-miR-20"	-2.1547986100914	10.3848370841291	4.12018543727299e-07	0.999487848542426	0.99975337439387
"Predict-miR-236"	-1.34621236057978	8.17776070086664	4.1145475826454e-07	0.999488199063482	0.99975337439387
"Predict-miR-375"	3.41664843363167	7.87769564624724	4.11183442849961e-07	0.99948836783339	0.99975337439387
"Predict-miR-598"	0	7.9811309993434	4.10289657359897e-07	0.999488924200778	0.99975337439387
"Predict-miR-428"	4.52920815721442	7.79949451854899	4.07508792044098e-07	0.999490659132614	0.99975337439387
"Predict-miR-85"	3.49730550857897	8.2617766648036	4.03633700685191e-07	0.999493086634545	0.99975337439387
"Predict-miR-309"	6.65343488758217	10.2510895405668	4.02977770264101e-07	0.99949349868518	0.99975337439387
"Predict-miR-398"	0.423890232052188	10.5526192323479	4.00123773225403e-07	0.99949529546123	0.99975337439387
"rna6961"	3.84941363104102	8.36202812572678	3.98415904712124e-07	0.999496373740875	0.99975337439387
"Predict-miR-31"	4.35527051759934	8.57226987662962	3.97212541969338e-07	0.999497134884319	0.99975337439387
"Predict-miR-11"	3.55153265697895	8.19975821441776	3.96750228226495e-07	0.99949742761061	0.99975337439387
"rna34998"	0	7.78913933372262	3.9624497016888e-07	0.999497747723358	0.99975337439387
"Predict-miR-487"	4.39502445945568	8.53052590601621	3.89998557892568e-07	0.999501722205118	0.99975337439387
"Predict-miR-195"	4.4881115632454	8.45591962502155	3.8810207136919e-07	0.999502935195002	0.99975337439387
"Predict-miR-94"	0	7.97912037611263	3.85992359852594e-07	0.999504288050731	0.99975337439387
"Predict-miR-581"	3.52719353209962	7.84895581777585	3.84867417935197e-07	0.999505010932883	0.99975337439387
"rna39357"	-0.749973997477463	8.79238484301414	3.80147929135433e-07	0.999508055229273	0.99975337439387
"Predict-miR-109"	0	7.78612395573406	3.79343318090974e-07	0.999508576123621	0.99975337439387
"rna39993"	4.98399293510379	9.43751705232614	3.74350953791236e-07	0.999511820535817	0.99975337439387
"Predict-miR-614"	-1.11196413671372	8.23255810342049	3.72313952112791e-07	0.999513150542747	0.99975337439387
"rna18860"	3.52292026090499	8.54074603229351	3.72212896948554e-07	0.999513216618681	0.99975337439387
"Predict-miR-124"	3.53430637287748	7.84621925674338	3.67930915068371e-07	0.999516024725145	0.99975337439387
"Predict-miR-615"	0	8.00436246573449	3.66772952453687e-07	0.99951678691558	0.99975337439387
"rna61260"	0	8.21412192663205	3.66439694587939e-07	0.999517006494391	0.99975337439387
"Predict-miR-485"	-4.7192552581803	8.42539409225206	3.66424718123426e-07	0.999517016364512	0.99975337439387
"Predict-miR-601"	3.55150396674588	7.96386648228463	3.65628824106068e-07	0.999517541182685	0.99975337439387
"Predict-miR-600"	-4.58286081816262	8.33085337010225	3.65148906666946e-07	0.999517857919749	0.99975337439387
"Predict-miR-185"	0	8.80815921165808	3.62736560788335e-07	0.999519453187674	0.99975337439387
"Predict-miR-35"	-4.6229390131061	8.36598616257092	3.61397890280557e-07	0.999520340730384	0.99975337439387
"Predict-miR-84"	0	8.17997129106796	3.60864257586968e-07	0.99952069498867	0.99975337439387
"rna63088"	0	8.19862737167404	3.59781690661976e-07	0.999521414468937	0.99975337439387
"Predict-miR-307"	3.88078558954785	8.16756120365871	3.57019197316788e-07	0.999523255358627	0.99975337439387
"Predict-miR-26"	0	7.81572160887228	3.56600577511301e-07	0.999523534941998	0.99975337439387
"Predict-miR-332"	3.44414532283861	8.60202604329664	3.54042656525166e-07	0.999525246875938	0.99975337439387
"Predict-miR-62"	-0.697259451086461	7.88560697984477	3.53619222792645e-07	0.999525530862349	0.99975337439387
"rna847"	-4.8224895602233	8.1560561558784	3.53250458218213e-07	0.99952577832207	0.99975337439387
"Predict-miR-153"	0	8.5068171064924	3.5176096346845e-07	0.99952677916547	0.99975337439387
"Predict-miR-192"	0	8.2169603059316	3.50873973431476e-07	0.999527376171813	0.99975337439387
"Predict-miR-434"	0	7.75472430152151	3.5067083059559e-07	0.999527513007317	0.99975337439387
"Predict-miR-171"	4.84244536254896	9.08089080163828	3.49719410763782e-07	0.99952815440479	0.99975337439387
"Predict-miR-604"	0	7.79006261915374	3.44377308891808e-07	0.999531772086662	0.99975337439387
"Predict-miR-491"	0	7.95261509982316	3.43307623218436e-07	0.99953249984392	0.99975337439387
"Predict-miR-549"	4.42913300128865	8.38674168978745	3.40762316142218e-07	0.999534236107569	0.99975337439387
"Predict-miR-264"	-0.274088202843092	7.91367463937715	3.39345703537219e-07	0.999535205249488	0.99975337439387
"Predict-miR-46"	0	8.19209768949801	3.38315516490439e-07	0.999535911298556	0.99975337439387
"Predict-miR-92"	-2.09135679263142	8.81881994884398	3.37843227171675e-07	0.999536235346154	0.99975337439387
"rna20046"	-0.710598838291001	8.88936493406554	3.37583237808303e-07	0.999536413826969	0.99975337439387
"Predict-miR-213"	0	8.17122573937028	3.35191230327325e-07	0.999538059158649	0.99975337439387
"rna34405"	1.19924991589761	8.33814228444226	3.34517837430326e-07	0.999538523407125	0.99975337439387
"Predict-miR-339"	-1.18631792536502	9.20156910547839	3.28352069978166e-07	0.999542796109852	0.99975337439387
"Predict-miR-468"	-2.39176812670739	8.18882088468909	3.27083796491934e-07	0.999543679948539	0.99975337439387
"Predict-miR-29"	-5.70813213971773	8.40697061768428	3.25007224688534e-07	0.999545130784748	0.99975337439387
"Predict-miR-360"	0	7.84159848406661	3.24556538977561e-07	0.99954544627643	0.99975337439387
"Predict-miR-382"	0	7.84882674205982	3.24043000432539e-07	0.999545806033847	0.99975337439387
"Predict-miR-337"	3.48839195656816	8.15558268261738	3.23699389070953e-07	0.999546046908645	0.99975337439387
"rna7820"	4.42663910416442	7.85809979643892	3.22963400023468e-07	0.999546563274456	0.99975337439387
"Predict-miR-137"	-0.201718794118229	8.18958929991853	3.15990277499623e-07	0.999551485075674	0.99975337439387
"Predict-miR-160"	-1.22565336048198	7.85663465256246	3.15702261666218e-07	0.999551689526324	0.99975337439387
"Predict-miR-8"	-0.747236103370815	8.97547443093246	3.13494677328663e-07	0.999553259707141	0.99975337439387
"Predict-miR-230"	-1.20772843203016	8.82600566427128	3.12719084405444e-07	0.999553812672102	0.99975337439387
"Predict-miR-115"	5.21405543693203	8.50713443471732	3.1198992367365e-07	0.999554333158588	0.99975337439387
"Predict-miR-496"	3.9097462029873	8.17711667159242	3.11520967244405e-07	0.999554668228552	0.99975337439387
"Predict-miR-578"	4.50899133527312	8.06244789375644	3.09655684205268e-07	0.999556003478794	0.99975337439387
"Predict-miR-17"	0	7.75852390214921	3.09387826469276e-07	0.999556195552808	0.99975337439387
"Predict-miR-607"	-0.147352252598988	8.89448552421086	3.06551360296226e-07	0.999558234635503	0.99975337439387
"Predict-miR-266"	3.96784222961929	8.13960898545537	3.06347805789642e-07	0.999558381329118	0.99975337439387
"Predict-miR-436"	4.94172181354141	8.20430173044795	3.04513791959948e-07	0.999559705233687	0.99975337439387
"Predict-miR-52"	5.42269094446182	8.45193787189683	3.04155718389154e-07	0.999559964178079	0.99975337439387
"Predict-miR-216"	3.44138459589559	8.13157159331142	3.03266061152385e-07	0.999560608202966	0.99975337439387
"Predict-miR-460"	0	8.0081306695197	3.0307328735546e-07	0.999560747876823	0.99975337439387
"Predict-miR-187"	0	7.89950862956653	3.01691274628979e-07	0.999561750514815	0.99975337439387
"Predict-miR-632"	0	8.17198929522944	3.01412851122507e-07	0.999561952786345	0.99975337439387
"Predict-miR-392"	0	8.1726538280074	2.99749919108194e-07	0.999563162837887	0.99975337439387
"rna15526"	3.90061608157652	8.11462466574028	2.97872595922399e-07	0.999564532934217	0.99975337439387
"Predict-miR-210"	-1.13041430559776	8.11015233983805	2.97320154274416e-07	0.999564936935404	0.99975337439387
"Predict-miR-313"	4.44943111829636	9.02553142826858	2.96872477711929e-07	0.999565264597162	0.99975337439387
"Predict-miR-345"	-4.85229502400591	7.93460269760794	2.95540339756428e-07	0.99956624107469	0.99975337439387
"Predict-miR-155"	-1.18563911950111	8.07310372201381	2.95393633109597e-07	0.999566348747318	0.99975337439387
"Predict-miR-459"	-1.69447193481624	8.3683043177155	2.94143724488549e-07	0.999567267181084	0.99975337439387
"Predict-miR-190"	3.53054138540909	8.49926054458513	2.93853410937572e-07	0.999567480782789	0.99975337439387
"Predict-miR-13"	0	8.75760431973649	2.93140882234866e-07	0.999568005482113	0.99975337439387
"Predict-miR-605"	-1.8412672034285	9.67565605967671	2.9286778335802e-07	0.999568206758536	0.99975337439387
"Predict-miR-23"	0	7.92666770659124	2.9246848232134e-07	0.999568501216122	0.99975337439387
"Predict-miR-387"	4.32714793641117	8.18101444914108	2.91219322434699e-07	0.999569423687646	0.99975337439387
"Predict-miR-145"	0	7.75828128901194	2.9034623416635e-07	0.999570069615387	0.99975337439387
"Predict-miR-384"	-1.19108302986526	8.09372508779263	2.89399494590725e-07	0.999570771130285	0.99975337439387
"rna44577"	0.117313151761517	7.86241164994298	2.89298188071996e-07	0.999570846264287	0.99975337439387
"Predict-miR-550"	3.89265289972856	8.13826341283053	2.85028315616387e-07	0.99957402506627	0.99975337439387
"Predict-miR-157"	-1.09176835167312	7.99419308808984	2.82981245547376e-07	0.999575557496083	0.99975337439387
"rna34589"	0	8.94291903570432	2.81910923050077e-07	0.999576360942788	0.99975337439387
"Predict-miR-18"	0.616235571161614	8.96626216967296	2.81682188685295e-07	0.999576532841883	0.99975337439387
"Predict-miR-196"	0	7.78808431441778	2.79343316034186e-07	0.999578294579467	0.99975337439387
"Predict-miR-355"	-2.15683180284023	8.62352242635779	2.73173982989761e-07	0.999582977287151	0.99975337439387
"Predict-miR-623"	5.33801127024423	9.09225778229754	2.70698103932432e-07	0.99958487140576	0.99975337439387
"Predict-miR-423"	3.95781642679164	8.0400132059534	2.7029297022807e-07	0.999585182168084	0.99975337439387
"Predict-miR-106"	-0.776324202230249	10.0620558254681	2.7007197367368e-07	0.999585351784129	0.99975337439387
"Predict-miR-508"	-4.55923904845015	7.9906370492997	2.69773295258346e-07	0.999585581131735	0.99975337439387
"Predict-miR-133"	4.79810548125098	7.98863067888942	2.69761427418302e-07	0.999585590247371	0.99975337439387
"rna44328"	-2.15574833290562	8.64055710362936	2.67496186090455e-07	0.999587333856594	0.99975337439387
"Predict-miR-201"	4.47145493138891	8.44521774216914	2.66454357245038e-07	0.999588138254763	0.99975337439387
"Predict-miR-285"	0	8.68509886773635	2.66232909496011e-07	0.999588309437564	0.99975337439387
"Predict-miR-326"	3.90568764672549	8.93918098402327	2.6557813814776e-07	0.999588816003611	0.99975337439387
"Predict-miR-50"	0	7.90120876225306	2.65529478404858e-07	0.999588853674299	0.99975337439387
"Predict-miR-318"	3.53680749464492	8.38931844763548	2.62326741662378e-07	0.999591340758137	0.99975337439387
"Predict-miR-625"	3.88089482627071	9.02992003969963	2.62201345080371e-07	0.999591438442789	0.99975337439387
"Predict-miR-191"	0	8.12519570262024	2.6158530808118e-07	0.999591918678736	0.99975337439387
"Predict-miR-254"	5.12795729092817	8.25616737546081	2.6015332466045e-07	0.999593037181104	0.99975337439387
"Predict-miR-271"	-4.74139841462898	7.96266461445973	2.58720781687316e-07	0.999594159204934	0.99975337439387
"Predict-miR-267"	0	8.65065054542607	2.58697055777191e-07	0.999594177814112	0.99975337439387
"Predict-miR-478"	5.47703533933688	8.82362795697825	2.5660004876471e-07	0.999595825964884	0.99975337439387
"rna48653"	6.79595867785523	9.34315043568135	2.56415248589548e-07	0.999595971531651	0.99975337439387
"Predict-miR-69"	-3.30555562311889	8.88341491404841	2.54093823315316e-07	0.999597804601893	0.99975337439387
"Predict-miR-136"	0	7.79032755701742	2.53081704926217e-07	0.999598606422836	0.99975337439387
"Predict-miR-458"	5.41566568461702	8.88667087147664	2.50203736840149e-07	0.999600895210868	0.99975337439387
"Predict-miR-427"	3.77104264778378	8.60324184543566	2.49651323613875e-07	0.999601336036762	0.99975337439387
"Predict-miR-397"	3.88569577249153	9.47607951943754	2.49523600892587e-07	0.999601438028924	0.99975337439387
"rna11059"	5.9703969272517	8.10243069958928	2.46484912480582e-07	0.99960387229839	0.99975337439387
"rna69972"	3.73748872019821	7.82825652688166	2.46036234941016e-07	0.999604232999056	0.99975337439387
"rna23853"	3.55154613460158	8.28629807167707	2.44902588875107e-07	0.999605145827356	0.99975337439387
"Predict-miR-531"	-4.63798034223463	7.84853896791336	2.4333647452579e-07	0.999606410367952	0.99975337439387
"Predict-miR-308"	0	8.20162375587807	2.4299065692901e-07	0.99960669014229	0.99975337439387
"Predict-miR-241"	5.41308742643145	8.38787718981506	2.42261256389043e-07	0.999607280897534	0.99975337439387
"Predict-miR-310"	0	8.60079640502422	2.40248843041968e-07	0.999608915416412	0.99975337439387
"Predict-miR-316"	0	7.81741565715183	2.40150230368386e-07	0.999608995687041	0.99975337439387
"Predict-miR-72"	-0.3744968567087	9.84111443801896	2.39604503349256e-07	0.999609440206629	0.99975337439387
"Predict-miR-450"	3.53708446843176	8.36096832390371	2.385173294428e-07	0.999610327270773	0.99975337439387
"Predict-miR-118"	4.47802950366656	9.0574605571816	2.35324314701302e-07	0.999612944319372	0.99975337439387
"rna44409"	3.87743787163569	8.06635018844755	2.35083261301838e-07	0.999613142609519	0.99975337439387
"Predict-miR-306"	0.675490623181504	8.38094333908445	2.32887753526256e-07	0.999614953331234	0.99975337439387
"Predict-miR-272"	0	8.65897170990676	2.32029336189044e-07	0.999615663621599	0.99975337439387
"Predict-miR-497"	-3.32167990144608	8.90874126640152	2.31419244656195e-07	0.999616169235874	0.99975337439387
"Predict-miR-93"	0	7.89782772870843	2.30940597312213e-07	0.999616566382312	0.99975337439387
"Predict-miR-12"	0	8.56641582784659	2.30926062272374e-07	0.999616578448857	0.99975337439387
"Predict-miR-71"	-4.71242802681259	7.79155753875847	2.30180295268667e-07	0.999617198072191	0.99975337439387
"Predict-miR-569"	0.114731867816502	9.79995630201463	2.28071391106255e-07	0.999618955716417	0.99975337439387
"Predict-miR-125"	3.55154268908182	8.26535259265327	2.27862848589666e-07	0.99961912996471	0.99975337439387
"Predict-miR-328"	5.39394824361988	7.9973702818076	2.24771842027849e-07	0.999621722075472	0.99975337439387
"Predict-miR-156"	3.45198834750162	8.29047675131669	2.24195250808634e-07	0.999622207571715	0.99975337439387
"Predict-miR-482"	0	7.87632652991522	2.22799495297465e-07	0.99962338540463	0.99975337439387
"rna38812"	0	7.75731242034323	2.22333695454324e-07	0.999623779298682	0.99975337439387
"rna11272"	0	8.06113085223675	2.20194687372555e-07	0.999625593427591	0.99975337439387
"Predict-miR-401"	4.48798259876904	8.05878693136764	2.20069321876792e-07	0.999625700024952	0.99975337439387
"Predict-miR-7"	-4.62915616872622	8.98363983060416	2.20039654053039e-07	0.999625725255727	0.99975337439387
"Predict-miR-148"	5.37487707306156	8.78843465818496	2.19955671454386e-07	0.999625796687313	0.99975337439387
"Predict-miR-409"	0	8.05978441657104	2.17665206747597e-07	0.999627750131876	0.99975337439387
"Predict-miR-274"	6.07471653723629	10.0406619368336	2.17445283112738e-07	0.999627938235498	0.99975337439387
"Predict-miR-330"	0	8.01255479408016	2.17371336930228e-07	0.999628001504023	0.99975337439387
"Predict-miR-258"	3.55149532448716	7.87776618653078	2.17038742977849e-07	0.999628286205323	0.99975337439387
"Predict-miR-202"	0	7.75701835372071	2.1594324728369e-07	0.999629225498403	0.99975337439387
"Predict-miR-583"	3.55150327446923	7.9571884512259	2.15264530645243e-07	0.999629808635075	0.99975337439387
"Predict-miR-36"	0	7.78608387917059	2.15181347407167e-07	0.999629880167272	0.99975337439387
"Predict-miR-47"	0	7.8945984550988	2.14211435256573e-07	0.999630715251582	0.99975337439387
"Predict-miR-629"	0	7.78586509587188	2.12011199707263e-07	0.999632616668644	0.99975337439387
"Predict-miR-251"	-0.846166132343682	9.66930443429034	2.09951502405659e-07	0.999634405595891	0.99975337439387
"Predict-miR-595"	3.53862549128384	9.03523188013504	2.08971384196843e-07	0.999635259947673	0.99975337439387
"Predict-miR-472"	-0.514041839039636	9.64571662452403	2.08827030334646e-07	0.999635385947526	0.99975337439387
"Predict-miR-178"	3.93917548795139	7.98520989494429	2.08581589333789e-07	0.999635600281711	0.99975337439387
"Predict-miR-533"	-0.809199944464094	8.52584270401544	2.0793758537252e-07	0.999636163265886	0.99975337439387
"rna19535"	4.74153292043376	8.69964691734023	2.07421456011048e-07	0.999636615092526	0.99975337439387
"Predict-miR-552"	4.82323751924087	7.99026461894876	2.07143660446718e-07	0.999636858511245	0.99975337439387
"Predict-miR-152"	5.43497530940502	8.59503021618406	2.05609936188011e-07	0.999638205387269	0.99975337439387
"Predict-miR-322"	0	7.92137819536356	2.05454337987021e-07	0.999638342309741	0.99975337439387
"Predict-miR-234"	-3.09475501087655	8.88673962454618	2.05293414268226e-07	0.999638483973085	0.99975337439387
"Predict-miR-532"	0	7.82057804500805	2.05101983397071e-07	0.99963865256462	0.99975337439387
"Predict-miR-546"	-1.19418715619802	8.67961928743108	2.04239781531612e-07	0.999639412875472	0.99975337439387
"Predict-miR-630"	0	8.57215146914719	2.03018927003029e-07	0.999640492205441	0.99975337439387
"Predict-miR-608"	-1.08510004982498	8.012944721316	2.02880579891485e-07	0.999640614719481	0.99975337439387
"rna15527"	-1.13395103973633	9.72986097162187	2.0242955756089e-07	0.99964101441511	0.99975337439387
"Predict-miR-110"	3.54047278333052	9.05418476358546	2.01220074380615e-07	0.99964208846155	0.99975337439387
"Predict-miR-420"	3.5515350907622	8.21634866937664	2.00708255349014e-07	0.999642543939366	0.99975337439387
"Predict-miR-519"	0	8.14960470954338	1.99976609494001e-07	0.999643196055054	0.99975337439387
"Predict-miR-521"	4.98852183854545	8.89321174652108	1.9972186926509e-07	0.999643423384833	0.99975337439387
"Predict-miR-55"	3.86499486737062	7.96228813184194	1.98745985002802e-07	0.999644295606789	0.99975337439387
"rna62714"	0	7.78456141992373	1.97647228361575e-07	0.99964528021589	0.99975337439387
"Predict-miR-131"	4.81892204632764	8.65231253741677	1.96663345164438e-07	0.999646164210651	0.99975337439387
"Predict-miR-333"	0	8.07428174374096	1.96044073419444e-07	0.999646721745308	0.99975337439387
"Predict-miR-27"	0.822061798234851	9.52083827354088	1.95913261613612e-07	0.999646839628685	0.99975337439387
"Predict-miR-617"	3.4815475557264	7.93190382184165	1.95701524319247e-07	0.999647030522939	0.99975337439387
"Predict-miR-204"	3.64592582017006	8.10722541830559	1.95359490362534e-07	0.999647339105959	0.99975337439387
"Predict-miR-584"	3.37036084227582	7.93545615669858	1.95269583613822e-07	0.999647420264651	0.99975337439387
"Predict-miR-3"	3.56059387850901	8.89960979254248	1.9450145050115e-07	0.999648114420422	0.99975337439387
"rna44329"	6.72954906440975	7.86255977581759	1.92995353920367e-07	0.999649479457982	0.99975337439387
"Predict-miR-551"	3.53002536270603	8.24256501532166	1.9274697926619e-07	0.999649705081137	0.99975337439387
"rna9093"	0	8.57918591446487	1.92620539962718e-07	0.999649819994244	0.99975337439387
"Predict-miR-108"	0	8.02841726071589	1.91968359430916e-07	0.999650413321961	0.99975337439387
"Predict-miR-34"	3.55151221486485	8.03990586423498	1.91582830488812e-07	0.99965076453481	0.99975337439387
"Predict-miR-488"	-5.70906431200815	8.38928631161834	1.91013165729004e-07	0.999651284140964	0.99975337439387
"Predict-miR-336"	3.5115614663132	8.33334522400614	1.89182228993445e-07	0.999652959454872	0.99975337439387
"Predict-miR-493"	-0.190794709047053	9.83377380753136	1.88769666564781e-07	0.999653338068723	0.99975337439387
"Predict-miR-122"	3.55152960480984	8.17828613666435	1.88095891751061e-07	0.999653957291246	0.99975337439387
"Predict-miR-388"	0	9.3274632917553	1.87601549406224e-07	0.99965441231473	0.99975337439387
"Predict-miR-141"	0	7.90412895194068	1.87201035117823e-07	0.999654781412831	0.99975337439387
"Predict-miR-489"	3.55171269228596	8.90118925680199	1.86959081993621e-07	0.999655004578576	0.99975337439387
"Predict-miR-528"	0	7.85745859542837	1.85640722349945e-07	0.999656223114373	0.99975337439387
"Predict-miR-331"	0	7.78887641616848	1.84874208386532e-07	0.999656933579016	0.99975337439387
"Predict-miR-6"	3.53216310354691	8.9221147156059	1.84124443691758e-07	0.999657629945474	0.99975337439387
"Predict-miR-255"	5.17063040356626	8.43715386445947	1.83228692662851e-07	0.999658463762552	0.99975337439387
"Predict-miR-151"	5.05107961039177	8.70361939456458	1.82127965153711e-07	0.999659491179734	0.99975337439387
"Predict-miR-556"	0	7.84622380878692	1.81448662317507e-07	0.999660126789649	0.99975337439387
"Predict-miR-383"	0	7.98720374187236	1.81187800984972e-07	0.999660371188424	0.99975337439387
"Predict-miR-335"	3.54744924123293	8.17877112763836	1.80813177763639e-07	0.99966072247771	0.99975337439387
"rna38012"	0.19508177954744	8.35991745508123	1.78731552225031e-07	0.999662681110352	0.99975337439387
"Predict-miR-212"	3.47388807893995	8.21869757277845	1.7781776229242e-07	0.99966354451016	0.99975337439387
"Predict-miR-475"	-0.262276974217038	8.78491103897303	1.77140080381832e-07	0.999664186255506	0.99975337439387
"Predict-miR-289"	4.48567652715306	8.91238309826627	1.77076214136207e-07	0.999664246798256	0.99975337439387
"rna799"	0	7.84545715006563	1.75817190140037e-07	0.999665442541548	0.99975337439387
"Predict-miR-219"	0	7.78830756321825	1.75683189773679e-07	0.999665570058558	0.99975337439387
"Predict-miR-290"	-2.31154572733934	8.87867037398784	1.75281575920394e-07	0.99966595253265	0.99975337439387
"Predict-miR-507"	0	7.84527138635924	1.7462697421422e-07	0.999666576878273	0.99975337439387
"Predict-miR-470"	-0.0406409438546097	8.5840308754385	1.73344322007551e-07	0.999667803647761	0.99975337439387
"rna69774"	3.5100246739127	7.76411619977462	1.72582810264998e-07	0.999668534129864	0.99975337439387
"Predict-miR-317"	3.91898772456386	7.76436023592968	1.69134739103072e-07	0.999671862051819	0.99975337439387
"Predict-miR-220"	0	8.45651002025239	1.6906923505644e-07	0.999671925600099	0.99975337439387
"Predict-miR-454"	3.44642677602784	8.17788535015074	1.68571167691312e-07	0.999672409199804	0.99975337439387
"Predict-miR-603"	5.97444285550905	8.95676079672592	1.68135270151026e-07	0.999672833022125	0.99975337439387
"Predict-miR-44"	0	8.1014955968084	1.66678473689785e-07	0.999674253463436	0.99975337439387
"Predict-miR-101"	3.54129557155946	8.48791799616583	1.66428129055873e-07	0.99967449818471	0.99975337439387
"Predict-miR-502"	3.54197225439198	8.48757844042982	1.65977588117983e-07	0.999674939069527	0.99975337439387
"Predict-miR-253"	4.39697375995848	8.36876293165003	1.65752016556553e-07	0.99967516003137	0.99975337439387
"Predict-miR-186"	-0.212577106464232	8.47799576453789	1.6331665086966e-07	0.99967755527072	0.99975337439387
"rna27274"	0	8.08210343939581	1.6324171525639e-07	0.999677629253882	0.99975337439387
"Predict-miR-300"	0	7.75948521824825	1.63074163062049e-07	0.999677794737901	0.99975337439387
"Predict-miR-42"	-1.09207762849014	8.40641152653531	1.62199522257822e-07	0.99967865996615	0.99975337439387
"Predict-miR-82"	-0.752794127023815	8.2909382940745	1.6065448171787e-07	0.999680194099329	0.99975337439387
"Predict-miR-120"	3.89897511687617	8.53725347007962	1.59628761764452e-07	0.999681216655751	0.99975337439387
"Predict-miR-39"	0.600508275819209	8.53140023471492	1.58742489375641e-07	0.999682102843511	0.99975337439387
"Predict-miR-442"	0	8.46857989577417	1.57487686003321e-07	0.999683361768652	0.99975337439387
"Predict-miR-391"	4.48048733022563	8.79967879751343	1.56728391154104e-07	0.999684125994283	0.99975337439387
"Predict-miR-414"	0	8.12891795781309	1.56631960734899e-07	0.999684223183273	0.99975337439387
"Predict-miR-91"	3.54412314177985	8.00963906059398	1.56143752150228e-07	0.99968471569215	0.99975337439387
"Predict-miR-2"	0	8.0721339273452	1.55935651502404e-07	0.999684925859831	0.99975337439387
"Predict-miR-498"	3.51526249209313	8.84118944727881	1.5457082724879e-07	0.999686307730749	0.99975337439387
"Predict-miR-256"	0	8.03761250415586	1.54535815255485e-07	0.999686343260135	0.99975337439387
"Predict-miR-371"	0	8.05411131806543	1.5433334077386e-07	0.999686548805685	0.99975337439387
"Predict-miR-404"	5.56166775569813	8.21629091030848	1.53148478787557e-07	0.999687754351949	0.99975337439387
"Predict-miR-506"	4.43944985857937	8.78804373669002	1.5305656830833e-07	0.999687848061508	0.99975337439387
"rna27273"	-4.668338128416	7.87702541812518	1.53056390672646e-07	0.999687848242647	0.99975337439387
"Predict-miR-602"	0	7.78905283859549	1.52660187602294e-07	0.99968825252377	0.99975337439387
"Predict-miR-112"	0	7.78677455391376	1.51425346928136e-07	0.99968951591824	0.99975337439387
"Predict-miR-209"	3.88403636501679	7.82488495424953	1.51062528708223e-07	0.999689888104393	0.99975337439387
"Predict-miR-15"	5.3966094678597	8.04437092693266	1.49604721499941e-07	0.999691388077034	0.99975337439387
"Predict-miR-86"	0	8.05121961084563	1.48230625995893e-07	0.999692808622001	0.99975337439387
"rna11484"	3.91899582502923	7.76178388046727	1.47658239413317e-07	0.999693402299198	0.99975337439387
"Predict-miR-377"	3.46940150791001	8.10966882151193	1.47337889444543e-07	0.999693735067249	0.99975337439387
"Predict-miR-415"	0.760014696557996	9.30991391469203	1.46975949633088e-07	0.999694111472894	0.99975337439387
"Predict-miR-197"	-4.57663866803732	8.17420033215292	1.46741184536836e-07	0.999694355868816	0.99975337439387
"Predict-miR-622"	0	7.78583138753326	1.4561043082395e-07	0.999695535757722	0.99975337439387
"rna438"	-1.22787052468808	8.24830671526805	1.44469479934628e-07	0.999696730939592	0.99975337439387
"Predict-miR-257"	0	8.37893115818652	1.43672744368217e-07	0.999697568345845	0.99975337439387
"Predict-miR-628"	0	7.81529220500055	1.42817288661945e-07	0.999698470058751	0.99975337439387
"Predict-miR-553"	-5.61468114584004	7.82887265729034	1.42492144306061e-07	0.999698813492726	0.99975337439387
"Predict-miR-206"	5.77049735239268	8.31765376067295	1.42425902183163e-07	0.999698883509049	0.99975337439387
"Predict-miR-457"	3.48455329033791	7.82174816495871	1.4220744226634e-07	0.999699114531369	0.99975337439387
"rna11800"	0	7.78935512496392	1.42113955270418e-07	0.999699213448491	0.99975337439387
"Predict-miR-626"	3.50205624864459	8.41626690384792	1.41572292555736e-07	0.999699787214784	0.99975337439387
"Predict-miR-67"	3.88004532934399	7.95784231109425	1.41096749395331e-07	0.999700291848197	0.99975337439387
"Predict-miR-232"	0.297490583799877	9.29758285952353	1.40194255315862e-07	0.999701251894172	0.99975337439387
"Predict-miR-324"	0	8.05483746652429	1.39384765951434e-07	0.999702115636784	0.99975337439387
"Predict-miR-557"	3.40926879742316	8.39987943434986	1.39362631657036e-07	0.999702139289733	0.99975337439387
"Predict-miR-314"	5.05490105415328	8.06929597280799	1.38911971703237e-07	0.999702621278989	0.99975337439387
"Predict-miR-624"	0	7.81676970776838	1.36476908885186e-07	0.999705239258524	0.99975337439387
"Predict-miR-238"	0	7.95152939290969	1.35189776706568e-07	0.999706632515443	0.99975337439387
"Predict-miR-484"	3.49896177484585	8.40989304691851	1.34266016971196e-07	0.999707636532146	0.99975337439387
"rna51238"	0	7.82000452722587	1.34004791263465e-07	0.99970792107933	0.99975337439387
"Predict-miR-95"	0	7.95587645426544	1.32701211796871e-07	0.999709345202155	0.99975337439387
"Predict-miR-463"	3.51000911286902	7.76108248004421	1.32280022491216e-07	0.999709806833137	0.99975337439387
"Predict-miR-228"	-0.844973853680266	7.86448897830629	1.31905656175491e-07	0.999710217762594	0.99975337439387
"Predict-miR-618"	0	7.92740616265619	1.28738812499307e-07	0.999713717499677	0.99975337439387
"Predict-miR-22"	3.55155164280213	8.31830211311109	1.28176871783126e-07	0.999714342989845	0.99975337439387
"rna38809"	0	7.78377407993715	1.2744193433889e-07	0.999715163113726	0.99975337439387
"Predict-miR-32"	0	8.04922214039336	1.26556411572665e-07	0.999716154424857	0.99975337439387
"Predict-miR-74"	3.478220006832	8.03406668685739	1.2430215079462e-07	0.999718693754664	0.99975337439387
"Predict-miR-193"	0	7.78537206825331	1.23990569811383e-07	0.999719046542882	0.99975337439387
"Predict-miR-79"	4.8888561042603	8.01888116553651	1.22163653415441e-07	0.999721124052558	0.99975337439387
"Predict-miR-376"	0	7.92892932281108	1.21191764179684e-07	0.999722235585058	0.99975337439387
"Predict-miR-164"	0	8.02864672350456	1.19932761499797e-07	0.999723682131824	0.99975337439387
"Predict-miR-19"	0	8.58784750849343	1.19828174049985e-07	0.999723802639694	0.99975337439387
"rna35738"	0	8.28950593087874	1.1969432911485e-07	0.999723956935399	0.99975337439387
"Predict-miR-537"	0	7.81521322073461	1.19237133944239e-07	0.999724484639172	0.99975337439387
"rna57202"	0	7.79107845191255	1.18959104788985e-07	0.999724806040748	0.99975337439387
"Predict-miR-429"	0	7.79085912305872	1.17758121476186e-07	0.99972619871157	0.99975337439387
"Predict-miR-599"	3.38350847393409	7.81991151237048	1.16527778537545e-07	0.999727632812245	0.99975337439387
"Predict-miR-523"	3.87708492040368	8.76466404709007	1.14856368416127e-07	0.999729593209559	0.99975337439387
"rna9028"	0	7.92849416487513	1.14790043248547e-07	0.999729671295629	0.99975337439387
"Predict-miR-100"	0	8.10438464727125	1.14466757850096e-07	0.999730052229967	0.99975337439387
"Predict-miR-218"	0	8.28802082847187	1.13284224667609e-07	0.999731450238136	0.99975337439387
"Predict-miR-33"	0	7.90463644198025	1.13241777732753e-07	0.999731500554858	0.99975337439387
"Predict-miR-512"	0	7.87164917792947	1.11707688432716e-07	0.999733325440783	0.99975337439387
"Predict-miR-144"	0	7.75746873328363	1.07039666019659e-07	0.999738956774874	0.99975337439387
"Predict-miR-199"	0	7.90217727336594	1.01506478777935e-07	0.99974579333363	0.99975337439387
"Predict-miR-4"	0	7.75723087868409	9.9581074497479e-08	0.999748215808927	0.99975337439387
"Predict-miR-184"	0	7.95458517039464	9.9432917899378e-08	0.999748403180742	0.99975337439387
"Predict-miR-321"	0	7.90380735784794	9.75417808746215e-08	0.999750807254685	0.99975337439387
"Predict-miR-619"	0	7.75966252141236	9.55424166448893e-08	0.99975337439387	0.99975337439387
