Length	Counts  	Percentage
10    	364275  	4.8%
11    	343892  	4.5%
12    	355264  	4.7%
13    	3523665 	46.3%
14    	402369  	5.3%
15    	400563  	5.3%
16    	834483  	11.0%
17    	507665  	6.7%
18    	352962  	4.6%
19    	327348  	4.3%
20    	322929  	4.2%
21    	492939  	6.5%
22    	541536  	7.1%
23    	547386  	7.2%
24    	1661863 	21.8%
25    	333376  	4.4%
26    	270273  	3.6%
27    	558753  	7.3%
28    	187230  	2.5%
29    	188451  	2.5%
30    	179738  	2.4%
31    	162706  	2.1%
32    	163852  	2.2%
33    	179223  	2.4%
34    	116081  	1.5%
35    	135605  	1.8%
36    	207697  	2.7%
37    	106769  	1.4%
38    	69792   	0.9%
39    	64622   	0.8%
40    	62048   	0.8%
41    	73586   	1.0%
42    	121206  	1.6%
43    	89827   	1.2%
44    	88931   	1.2%
