Length	Counts  	Percentage
10    	466932  	6.5%
11    	502735  	6.9%
12    	558218  	7.7%
13    	805322  	11.1%
14    	650151  	9.0%
15    	631750  	8.7%
16    	1193248 	16.5%
17    	440769  	6.1%
18    	586629  	8.1%
19    	486851  	6.7%
20    	541767  	7.5%
21    	416160  	5.8%
22    	371698  	5.1%
23    	326294  	4.5%
24    	332872  	4.6%
25    	294055  	4.1%
26    	255018  	3.5%
27    	321453  	4.4%
28    	211173  	2.9%
29    	274810  	3.8%
30    	235973  	3.3%
31    	223529  	3.1%
32    	300186  	4.1%
33    	299751  	4.1%
34    	233656  	3.2%
35    	243978  	3.4%
36    	297937  	4.1%
37    	187024  	2.6%
38    	136426  	1.9%
39    	114228  	1.6%
40    	105556  	1.5%
41    	118393  	1.6%
42    	124086  	1.7%
43    	92818   	1.3%
44    	101585  	1.4%
