"logFC"	"logCPM"	"LR"	"PValue"	"FDR"
"Afl-milR-24"	-6.69161406778792	13.3347328350753	11.2356018676807	0.00080243080289778	0.0521580021883557
"Afl-milR-107"	-5.95072370163862	13.0413193539921	8.22955934931375	0.00412135352265957	0.0881524194076117
"Afl-milR-36"	-7.11463178081475	12.8602149871881	8.04655795483306	0.00455901937113565	0.0881524194076117
"Afl-milR-9"	2.81417152126713	15.8429076591393	7.73209923073767	0.00542476427123764	0.0881524194076117
"Afl-milR-41"	-5.571959872944	12.4140995376824	7.16645037447753	0.00742796089348937	0.0933596003265556
"Afl-milR-11"	-2.58950199040966	16.0647183578723	6.86184880101497	0.00880553945371923	0.0933596003265556
"Afl-milR-7"	-5.37324884699415	12.6117935487958	6.62528404475384	0.0100541108043983	0.0933596003265556
"Afl-milR-49"	-5.73371839019647	12.5286870026733	5.13095193791237	0.0235028341768498	0.190960527686904
"Afl-milR-33"	2.15694069556726	15.7614538847118	4.84242308124587	0.0277678518343045	0.200545596581088
"Afl-milR-100"	-4.63959646361765	12.6769207175762	4.3821640255011	0.0363168612192874	0.236059597925368
"Afl-milR-133"	-4.30084574429433	12.3442772149639	4.1148416723629	0.042508503891067	0.247893313396887
"Afl-milR-128"	-4.13806310219628	12.4144487622879	3.9902262222884	0.0457649193963483	0.247893313396887
"Afl-milR-132"	-4.09566150383431	12.9252142184771	3.41060176608922	0.0647788197554442	0.323894098777221
"Afl-milR-14"	-2.52828789089337	12.5457979139751	3.01979872926257	0.0822536739348833	0.381892057554815
"Afl-milR-122"	-2.81604519016637	12.9724261196938	2.8368432870429	0.0921250359249972	0.391052501425469
"Afl-milR-58"	-1.88008856718314	15.7881677096301	2.76645585023879	0.0962590772739617	0.391052501425469
"Afl-milR-87"	-2.39036540561286	12.3402500926004	2.3011463341435	0.129278556696524	0.49430036383965
"Afl-milR-3"	0.801915637122707	18.9910421561875	1.51746607145039	0.218003355251557	0.787234338408399
"Afl-milR-62"	2.03390870048936	12.5326871905676	1.08694589668561	0.297148891412208	1
"Afl-milR-19"	1.55577455512643	16.416749236667	0.656536066840744	0.417785512070137	1
"Afl-milR-114"	1.77169722435839	12.3668463311819	0.608443445754717	0.435374482944538	1
"Afl-milR-81"	1.5312832397897	12.5080215535293	0.465508106582745	0.49506094032379	1
"Afl-milR-131"	1.26645919318482	12.3684920933831	0.374084624522766	0.540786172875825	1
"Afl-milR-27"	1.26729675406786	12.3396111845518	0.373933627553246	0.540867872893477	1
"Afl-milR-51"	0.981103901528824	12.5384951220356	0.330638234899559	0.565283513712126	1
"Afl-milR-40"	0.980723411488213	12.366201929524	0.301522229094153	0.582929689931731	1
"Afl-milR-6"	0.980697756053279	12.3625603488486	0.301473171737064	0.582960345037422	1
"Afl-milR-67"	0.980512616963396	12.3362880778817	0.301118511914875	0.583182062526281	1
"Afl-milR-43"	0.980512616963396	12.3362880778817	0.301118511914875	0.583182062526281	1
"Afl-milR-80"	-0.623306868265459	12.4251911277414	0.102571677438068	0.748765077591285	1
"Afl-milR-126"	0.392185309155862	12.8566768228607	0.050287770034215	0.822563287001874	1
"Afl-milR-83"	0	12.341627394403	0	1	1
"Afl-milR-110"	0	12.4086933032311	0	1	1
"Afl-milR-29"	0	12.3688672087211	0	1	1
"Afl-milR-102"	0	12.3389645415004	0	1	1
"Afl-milR-97"	0	12.3389645415004	0	1	1
"Afl-milR-37"	0	12.3389645415004	0	1	1
"Afl-milR-18"	0	12.3706425105829	0	1	1
"Afl-milR-82"	0	12.3927529640138	0	1	1
"Afl-milR-94"	0	12.5475514642453	0	1	1
"Afl-milR-16"	0	12.3442310393377	0	1	1
"Afl-milR-79"	0	12.3442310393377	0	1	1
"Afl-milR-20"	0	12.3444724937198	0	1	1
"Afl-milR-121"	0	12.3441849854973	0	1	1
"Afl-milR-127"	0	12.3391522738577	0	1	1
"Afl-milR-116"	0	12.4062387224109	0	1	1
"Afl-milR-95"	0	12.3379412634506	0	1	1
"Afl-milR-76"	0	12.3379412634506	0	1	1
"Afl-milR-71"	0	12.3379412634506	0	1	1
"Afl-milR-104"	0	12.3379412634506	0	1	1
"Afl-milR-69"	0	12.3788314800978	0	1	1
"Afl-milR-48"	0	12.4121779538585	0	1	1
"Afl-milR-99"	0	12.3436149395678	0	1	1
"Afl-milR-57"	0	12.3436149395678	0	1	1
"Afl-milR-45"	0	12.3415328430536	0	1	1
"Afl-milR-31"	0	12.3415328430536	0	1	1
"Afl-milR-117"	0	12.3415328430536	0	1	1
"Afl-milR-78"	0	12.3415328430536	0	1	1
"Afl-milR-53"	0	12.376831062959	0	1	1
"Afl-milR-123"	0	12.3353019879471	0	1	1
"Afl-milR-103"	0	12.3796948567904	0	1	1
"Afl-milR-50"	0	12.3443513505172	0	1	1
"Afl-milR-85"	0	12.3442587300675	0	1	1
"Afl-milR-42"	0	12.3442587300675	0	1	1
"Afl-milR-96"	0	12.3444351297399	0	1	1
