"logFC"	"logCPM"	"LR"	"PValue"	"FDR"
"all-m0236-5p"	-0.0015432134593339	19.9241469580013	637.703036267261	1.05559559019919e-140	7.28360957237441e-139
"Afl-milR-2"	2.70186059141222	4.41447689842194	4.51837186493173	0.0335327277950464	0.703417601062056
"Afl-milR-7"	-2.65173003242392	4.30044104251567	2.56699315291831	0.109114955878749	0.703417601062056
"all-m0063-3p"	-2.15085808689623	4.31540141898848	2.1724351363321	0.140503591611422	0.703417601062056
"all-m0079-3p"	-2.15085808689623	4.31540141898848	2.1724351363321	0.140503591611422	0.703417601062056
"all-m0118-5p"	-2.15085808689623	4.31540141898848	2.1724351363321	0.140503591611422	0.703417601062056
"all-m0162-3p"	-2.15085808689623	4.31540141898848	2.1724351363321	0.140503591611422	0.703417601062056
"all-m0193-3p"	-2.15085808689623	4.31540141898848	2.1724351363321	0.140503591611422	0.703417601062056
"all-m0048-5p"	2.0259060661915	5.72395529508272	2.0693252095544	0.150288003823519	0.703417601062056
"all-m0119-5p"	-1.74126446665577	4.28790849251451	1.70507272534631	0.191625909235115	0.703417601062056
"all-m0234-5p"	-1.74126446665577	4.28790849251451	1.70507272534631	0.191625909235115	0.703417601062056
"all-m0136-5p"	-1.80748346543632	4.34008150864033	1.56973099515368	0.210246084031656	0.703417601062056
"all-m0133-5p"	2.04457619610755	4.32387743243524	1.55847994643325	0.211887924187018	0.703417601062056
"all-m0233-5p"	-1.81286955349166	4.26607362254598	1.55563663467733	0.212305246232966	0.703417601062056
"all-m0121-3p"	2.02501311701951	4.32342634910677	1.5442893287643	0.21398047469321	0.703417601062056
"all-m0145-5p"	2.01516933696647	4.32320083399734	1.53718656629443	0.215037065398904	0.703417601062056
"all-m0027-3p"	1.74860453109982	4.35784984845904	1.30916348318428	0.252546167135179	0.703417601062056
"all-m0140-3p"	1.73686367202836	4.35839350753428	1.30117495136177	0.253998716728981	0.703417601062056
"all-m0013-3p"	1.60483144239723	4.33058015011355	1.20906027183179	0.271518312535439	0.703417601062056
"all-m0141-3p"	1.60472305308478	4.32287489573716	1.20694335474852	0.271938328651903	0.703417601062056
"Afl-milR-3"	2.60882044420712	7.91458410782815	1.15674362683949	0.282141908719319	0.703417601062056
"all-m0168-3p"	-1.14776266163824	4.29200857952658	1.08709409926435	0.297115960507176	0.703417601062056
"all-m0236-3p"	1.60214900439307	5.05726159287729	0.999063649608535	0.317537183369394	0.703417601062056
"all-m0156-5p"	1.04639940440238	5.07865728331819	0.947475823064076	0.330362638117598	0.703417601062056
"Afl-milR-33"	0.593256180664845	8.46246830107616	0.944437566243741	0.331139220088044	0.703417601062056
"all-m0187-3p"	1.83814380204034	4.51539840460507	0.888918455769225	0.345770564472893	0.703417601062056
"all-m0184-3p"	1.26379173492861	7.12309076025727	0.838711814086894	0.359765452683924	0.703417601062056
"all-m0164-5p"	1.51223394506784	5.66569509936743	0.815838419887697	0.366399730524352	0.703417601062056
"all-m0224-3p"	-1.53956675475965	4.50731912367337	0.800802372948406	0.370853581439138	0.703417601062056
"all-m0007-5p"	1.03913592722525	4.32714283629906	0.763653874249498	0.382187465452828	0.703417601062056
"all-m0110-5p"	1.02294480627412	4.3593183928111	0.759224413324629	0.383571349532053	0.703417601062056
"all-m0073-3p"	1.02260546457137	4.33129399176074	0.755743124363515	0.384663992937438	0.703417601062056
"Afl-milR-92"	1.03856810471724	4.26264381567658	0.755598430704703	0.384709502370668	0.703417601062056
"all-m0173-5p"	1.02257437311719	4.3287210598302	0.755422712920082	0.384764779881355	0.703417601062056
"all-m0233-3p"	1.02256115886603	4.3276272605346	0.75528646018503	0.384807650198432	0.703417601062056
"all-m0229-3p"	1.02249983374463	4.32254899235338	0.75465355602234	0.385006875058381	0.703417601062056
"Afl-milR-43"	1.02177696000549	4.26241567039914	0.747120588617544	0.387389403483451	0.703417601062056
"all-m0140-5p"	1.02177696000549	4.26241567039914	0.747120588617544	0.387389403483451	0.703417601062056
"all-m0217-3p"	1.42816576967681	4.43608701219237	0.577624869119756	0.447244805181203	0.791279270705205
"Afl-milR-9"	0.903787708903563	4.97883599504984	0.509519253901505	0.47534704146762	0.819973646531644
"all-m0212-3p"	0.912677973889364	7.65662989199862	0.453526921902046	0.500664816576118	0.842582252286637
"all-m0170-3p"	0.253654045379813	10.2515391975889	0.28393313358751	0.594134813458983	0.956339655074661
"all-m0036-5p"	1.08402843434336	4.35441035792269	0.281102076432404	0.595979785046528	0.956339655074661
"all-m0036-3p"	-1.04123917758354	4.38871417051524	0.217095121572339	0.641262260047867	0.983784845663934
"all-m0235-5p"	0.818046538983868	4.48939895366536	0.216657254297823	0.641598812389522	0.983784845663934
"all-m0195-5p"	-0.721533677067274	4.35145977022631	0.179496684625839	0.671806139038947	0.999204019272772
"all-m0144-3p"	0.400409222361975	6.11441394415366	0.169431854889708	0.680617230519135	0.999204019272772
"all-m0191-5p"	-0.357245010075353	4.56105989033472	0.131189297064213	0.717202108089797	1
"all-m0107-3p"	0.529410869899751	5.4972762646114	0.0839004015342084	0.772079680668058	1
"all-m0225-3p"	0.256037343942444	4.40415368997189	0.0174319544130492	0.894960462504012	1
"all-m0130-5p"	-0.111227943391467	4.35907445998803	0.00753165438340542	0.930842327741704	1
"all-m0029-3p"	5.12548240610387e-15	4.29869077291164	0	1	1
"all-m0123-3p"	5.12548240610387e-15	4.33351428406843	0	1	1
"all-m0185-5p"	5.12548240610387e-15	4.41979744622396	0	1	1
"all-m0221-3p"	5.12548240610387e-15	4.30127133310698	0	1	1
"all-m0091-5p"	5.12548240610387e-15	4.3581545562044	0	1	1
"all-m0002-3p"	5.12548240610387e-15	4.44553613280064	0	1	1
"all-m0067-3p"	5.12548240610387e-15	4.29249201146229	0	1	1
"all-m0178-3p"	5.12548240610387e-15	5.08773645088496	0	1	1
"all-m0188-5p"	5.12548240610387e-15	4.36671416904758	0	1	1
"all-m0214-3p"	5.12548240610387e-15	4.32222312385201	0	1	1
"all-m0029-5p"	5.12548240610387e-15	4.33354189456397	0	1	1
"all-m0171-5p"	5.12548240610387e-15	4.34543843109638	0	1	1
"all-m0049-5p"	5.12548240610387e-15	4.32762839511752	0	1	1
"all-m0071-5p"	5.12548240610387e-15	4.38869133617685	0	1	1
"all-m0099-5p"	5.12548240610387e-15	4.32762839511752	0	1	1
"all-m0201-5p"	5.12548240610387e-15	4.26390586121915	0	1	1
"all-m0202-3p"	5.12548240610387e-15	4.32762839511752	0	1	1
"all-m0059-3p"	5.12548240610387e-15	4.34835654639111	0	1	1
