{
    "$schema": "http://json-schema.org/draft-04/schema#",
    "$id": "https://w3id.org/ieee/ieee-1752-schema/survey-categorical-answer.json",
    "title": "Survey Answer: Categorical",
    "description": "This schema represents a categorical answer to a survey question.",
    "type": "object",
    "definitions": {
        "answer": {
            "$ref": "survey-answer-1.0.json"
        }
    },
    "allOf": [
        {
            "$ref": "#/definitions/answer"
        },
        {
            "properties": {
                "code": {
                    "description": "A code used to identify the answer.",
                    "type": [
                        "number",
                        "string"
                    ]
                }
            }
        }
    ]
}
