{
    "$schema": "http://json-schema.org/draft-07/schema#",
    "$id": "https://w3id.org/ieee/ieee-1752-schema/body-posture.json",
    "title": "Body Posture",
    "type": "string",
    "description": "The posture of the subject (for example, during a measurement). This value set is not exhaustive. Values can be added as needed, preferably from the Body position finding hierarchy of SNOMED CT (without the word position in the value).",
    "enum": [
        "sitting",
        "lying down",
        "standing",
        "semi-recumbent"
    ]
}
