{
    "total_sleep_time": {
        "value": 330,
        "unit": "min"
    },
    "effective_time_frame": {
        "time_interval": {
            "start_date_time": "2019-02-19T22:30:00Z",
            "end_date_time": "2019-02-20T04:50:00Z"
        }
    }
}
