{
    "sleep_stage_summary": {
        "total_sleep_time": {
            "value": 380,
            "unit": "min"
        },
        "sleep_efficiency_percentage": {
            "value": 86.8,
            "unit": "%"
        },
        "latency_to_sleep_onset": {
            "value": 17.5,
            "unit": "min"
        },
        "latency_to_arising": {
            "value": 5.2,
            "unit": "min"
        },
        "rem_sleep_duration": {
            "value": 70,
            "unit": "min"
        },
        "rem_sleep_episode_count": 4,
        "light_sleep_duration": {
            "value": 140,
            "unit": "min"
        },
        "light_sleep_episode_count": 6,
        "deep_sleep_duration": {
            "value": 120,
            "unit": "min"
        },
        "deep_sleep_episode_count": 2,
        "awake_sleep_duration": {
            "value": 50,
            "unit": "min"
        },
        "number_of_awakenings": 3
    },
    "sleep_stage_episodes": [
        {
            "sleep_stage_state": "REM_sleep",
            "sleep_stage_time_frame": {
                "time_interval": {
                    "start_date_time": "2019-02-19T22:30:00Z",
                    "end_date_time": "2019-02-19T22:50:00Z"
                }
            }
        },
        {
            "sleep_stage_state": "Light_sleep",
            "sleep_stage_time_frame": {
                "time_interval": {
                    "start_date_time": "2019-02-19T22:50:00Z",
                    "end_date_time": "2019-02-19T23:50:00Z"
                }
            }
        },
        {
            "sleep_stage_state": "Awake",
            "sleep_stage_time_frame": {
                "time_interval": {
                    "start_date_time": "2019-02-19T23:50:00Z",
                    "end_date_time": "2019-02-20T00:15:00Z"
                }
            }
        },
        {
            "sleep_stage_state": "Light_sleep",
            "sleep_stage_time_frame": {
                "time_interval": {
                    "start_date_time": "2019-02-20T00:15:00Z",
                    "end_date_time": "2019-02-20T00:30:00Z"
                }
            }
        },
        {
            "sleep_stage_state": "Deep_sleep",
            "sleep_stage_time_frame": {
                "time_interval": {
                    "start_date_time": "2019-02-20T00:30:00Z",
                    "end_date_time": "2019-02-20T02:00:00Z"
                }
            }
        },
        {
            "sleep_stage_state": "Light_sleep",
            "sleep_stage_time_frame": {
                "time_interval": {
                    "start_date_time": "2019-02-20T02:00:00Z",
                    "end_date_time": "2019-02-20T02:15:00Z"
                }
            }
        },
        {
            "sleep_stage_state": "Awake",
            "sleep_stage_time_frame": {
                "time_interval": {
                    "start_date_time": "2019-02-20T02:15:00Z",
                    "end_date_time": "2019-02-20T02:30:00Z"
                }
            }
        },
        {
            "sleep_stage_state": "REM_sleep",
            "sleep_stage_time_frame": {
                "time_interval": {
                    "start_date_time": "2019-02-20T02:30:00Z",
                    "end_date_time": "2019-02-20T02:45:00Z"
                }
            }
        },
        {
            "sleep_stage_state": "Light_sleep",
            "sleep_stage_time_frame": {
                "time_interval": {
                    "start_date_time": "2019-02-20T02:45:00Z",
                    "end_date_time": "2019-02-20T03:00:00Z"
                }
            }
        },
        {
            "sleep_stage_state": "Deep_sleep",
            "sleep_stage_time_frame": {
                "time_interval": {
                    "start_date_time": "2019-02-20T03:00:00Z",
                    "end_date_time": "2019-02-20T03:30:00Z"
                }
            }
        },
        {
            "sleep_stage_state": "Light_sleep",
            "sleep_stage_time_frame": {
                "time_interval": {
                    "start_date_time": "2019-02-20T03:30:00Z",
                    "end_date_time": "2019-02-20T03:45:00Z"
                }
            }
        },
        {
            "sleep_stage_state": "REM_sleep",
            "sleep_stage_time_frame": {
                "time_interval": {
                    "start_date_time": "2019-02-20T03:45:00Z",
                    "end_date_time": "2019-02-20T04:00:00Z"
                }
            }
        },
        {
            "sleep_stage_state": "Awake",
            "sleep_stage_time_frame": {
                "time_interval": {
                    "start_date_time": "2019-02-20T04:00:00Z",
                    "end_date_time": "2019-02-20T04:10:00Z"
                }
            }
        },
        {
            "sleep_stage_state": "Light_sleep",
            "sleep_stage_time_frame": {
                "time_interval": {
                    "start_date_time": "2019-02-20T04:10:00Z",
                    "end_date_time": "2019-02-20T04:30:00Z"
                }
            }
        },
        {
            "sleep_stage_state": "REM_sleep",
            "sleep_stage_time_frame": {
                "time_interval": {
                    "start_date_time": "2019-02-20T04:30:00Z",
                    "end_date_time": "2019-02-20T04:50:00Z"
                }
            }
        }
    ],
    "is_main_sleep": true,
    "effective_time_frame": {
        "time_interval": {
            "start_date_time": "2019-02-19T22:30:00Z",
            "end_date_time": "2019-02-20T04:50:00Z"
        }
    }
}
