<?xml version="1.0" encoding="UTF-8" standalone="no"?><svg xmlns="http://www.w3.org/2000/svg" xmlns:xlink="http://www.w3.org/1999/xlink" contentScriptType="application/ecmascript" contentStyleType="text/css" height="647px" preserveAspectRatio="none" style="width:535px;height:647px;" version="1.1" viewBox="0 0 535 647" width="535px" zoomAndPan="magnify"><defs><filter height="300%" id="fs5fjz0doydak" width="300%" x="-1" y="-1"><feGaussianBlur result="blurOut" stdDeviation="2.0"/><feColorMatrix in="blurOut" result="blurOut2" type="matrix" values="0 0 0 0 0 0 0 0 0 0 0 0 0 0 0 0 0 0 .4 0"/><feOffset dx="4.0" dy="4.0" in="blurOut2" result="blurOut3"/><feBlend in="SourceGraphic" in2="blurOut3" mode="normal"/></filter></defs><g><rect fill="#FFFFFF" filter="url(#fs5fjz0doydak)" height="520.2578" style="stroke: #A80036; stroke-width: 1.0;" width="10" x="267.5" y="69.2969"/><rect fill="#FFFFFF" filter="url(#fs5fjz0doydak)" height="321.4609" style="stroke: #A80036; stroke-width: 1.0;" width="10" x="272.5" y="202.8281"/><rect fill="#FFFFFF" filter="url(#fs5fjz0doydak)" height="418.8594" style="stroke: #000000; stroke-width: 2.0;" width="500.5" x="13" y="113.5625"/><rect fill="#FFFFFF" filter="url(#fs5fjz0doydak)" height="86.5313" style="stroke: #000000; stroke-width: 2.0;" width="480.5" x="23" y="222.9609"/><rect fill="#FFFFFF" filter="url(#fs5fjz0doydak)" height="129.6641" style="stroke: #000000; stroke-width: 2.0;" width="468.5" x="23" y="323.4922"/><line style="stroke: #A80036; stroke-width: 1.0; stroke-dasharray: 5.0,5.0;" x1="61" x2="61" y1="38.2969" y2="607.6875"/><line style="stroke: #A80036; stroke-width: 1.0; stroke-dasharray: 5.0,5.0;" x1="272" x2="272" y1="38.2969" y2="607.6875"/><rect fill="#FEFECE" filter="url(#fs5fjz0doydak)" height="30.2969" style="stroke: #A80036; stroke-width: 1.5;" width="53" x="33" y="3"/><text fill="#000000" font-family="sans-serif" font-size="14" lengthAdjust="spacingAndGlyphs" textLength="39" x="40" y="22.9951">Client</text><rect fill="#FEFECE" filter="url(#fs5fjz0doydak)" height="30.2969" style="stroke: #A80036; stroke-width: 1.5;" width="53" x="33" y="606.6875"/><text fill="#000000" font-family="sans-serif" font-size="14" lengthAdjust="spacingAndGlyphs" textLength="39" x="40" y="626.6826">Client</text><rect fill="#FEFECE" filter="url(#fs5fjz0doydak)" height="30.2969" style="stroke: #A80036; stroke-width: 1.5;" width="61" x="240" y="3"/><text fill="#000000" font-family="sans-serif" font-size="14" lengthAdjust="spacingAndGlyphs" textLength="47" x="247" y="22.9951">Device</text><rect fill="#FEFECE" filter="url(#fs5fjz0doydak)" height="30.2969" style="stroke: #A80036; stroke-width: 1.5;" width="61" x="240" y="606.6875"/><text fill="#000000" font-family="sans-serif" font-size="14" lengthAdjust="spacingAndGlyphs" textLength="47" x="247" y="626.6826">Device</text><rect fill="#FFFFFF" filter="url(#fs5fjz0doydak)" height="520.2578" style="stroke: #A80036; stroke-width: 1.0;" width="10" x="267.5" y="69.2969"/><rect fill="#FFFFFF" filter="url(#fs5fjz0doydak)" height="321.4609" style="stroke: #A80036; stroke-width: 1.0;" width="10" x="272.5" y="202.8281"/><polygon fill="#A80036" points="255.5,65.2969,265.5,69.2969,255.5,73.2969,259.5,69.2969" style="stroke: #A80036; stroke-width: 1.0;"/><line style="stroke: #A80036; stroke-width: 1.0;" x1="61.5" x2="261.5" y1="69.2969" y2="69.2969"/><text fill="#000000" font-family="sans-serif" font-size="13" lengthAdjust="spacingAndGlyphs" textLength="151" x="68.5" y="64.3638">iq[type=set](subscribe)</text><polygon fill="#A80036" points="72.5,94.4297,62.5,98.4297,72.5,102.4297,68.5,98.4297" style="stroke: #A80036; stroke-width: 1.0;"/><line style="stroke: #A80036; stroke-width: 1.0;" x1="66.5" x2="266.5" y1="98.4297" y2="98.4297"/><text fill="#000000" font-family="sans-serif" font-size="13" lengthAdjust="spacingAndGlyphs" textLength="165" x="78.5" y="93.4966">iq[type=result](accepted)</text><rect fill="none" height="418.8594" style="stroke: #000000; stroke-width: 2.0;" width="500.5" x="13" y="113.5625"/><polygon fill="#EEEEEE" points="13,113.5625,243,113.5625,243,120.5625,233,130.5625,13,130.5625,13,113.5625" style="stroke: #000000; stroke-width: 2.0;"/><text fill="#000000" font-family="sans-serif" font-size="13" font-weight="bold" lengthAdjust="spacingAndGlyphs" textLength="185" x="28" y="126.6294">While subscription active</text><rect fill="#EEEEEE" filter="url(#fs5fjz0doydak)" height="3" style="stroke: #EEEEEE; stroke-width: 1.0;" width="520.5" x="3" y="151.2617"/><line style="stroke: #000000; stroke-width: 1.0;" x1="3" x2="523.5" y1="151.2617" y2="151.2617"/><line style="stroke: #000000; stroke-width: 1.0;" x1="3" x2="523.5" y1="154.2617" y2="154.2617"/><rect fill="#EEEEEE" filter="url(#fs5fjz0doydak)" height="23.1328" style="stroke: #000000; stroke-width: 2.0;" width="200" x="163.25" y="140.6953"/><text fill="#000000" font-family="sans-serif" font-size="13" font-weight="bold" lengthAdjust="spacingAndGlyphs" textLength="181" x="169.25" y="156.7622">Wait for event to trigger</text><line style="stroke: #A80036; stroke-width: 1.0;" x1="277.5" x2="324.5" y1="189.9609" y2="189.9609"/><line style="stroke: #A80036; stroke-width: 1.0;" x1="324.5" x2="324.5" y1="189.9609" y2="202.9609"/><line style="stroke: #A80036; stroke-width: 1.0;" x1="283.5" x2="324.5" y1="202.9609" y2="202.9609"/><polygon fill="#A80036" points="293.5,198.9609,283.5,202.9609,293.5,206.9609,289.5,202.9609" style="stroke: #A80036; stroke-width: 1.0;"/><text fill="#000000" font-family="sans-serif" font-size="13" lengthAdjust="spacingAndGlyphs" textLength="84" x="289.5" y="184.895">start readout</text><rect fill="none" height="86.5313" style="stroke: #000000; stroke-width: 2.0;" width="480.5" x="23" y="222.9609"/><polygon fill="#EEEEEE" points="23,222.9609,93,222.9609,93,229.9609,83,239.9609,23,239.9609,23,222.9609" style="stroke: #000000; stroke-width: 2.0;"/><text fill="#000000" font-family="sans-serif" font-size="13" font-weight="bold" lengthAdjust="spacingAndGlyphs" textLength="25" x="38" y="236.0278">opt</text><polygon fill="#A80036" points="72.5,277.2266,62.5,281.2266,72.5,285.2266,68.5,281.2266" style="stroke: #A80036; stroke-width: 1.0;"/><line style="stroke: #A80036; stroke-width: 1.0;" x1="66.5" x2="271.5" y1="281.2266" y2="281.2266"/><text fill="#000000" font-family="sans-serif" font-size="13" lengthAdjust="spacingAndGlyphs" textLength="115" x="78.5" y="276.2935">message(started)</text><polygon fill="#FBFB77" filter="url(#fs5fjz0doydak)" points="287,245.0938,287,300.0938,484,300.0938,484,255.0938,474,245.0938,287,245.0938" style="stroke: #A80036; stroke-width: 1.0;"/><line style="stroke: #A80036; stroke-width: 1.0;" x1="474" x2="474" y1="245.0938" y2="255.0938"/><line style="stroke: #A80036; stroke-width: 1.0;" x1="484" x2="474" y1="255.0938" y2="255.0938"/><text fill="#000000" font-family="sans-serif" font-size="13" lengthAdjust="spacingAndGlyphs" textLength="161" x="293" y="262.1606">If readout slow, client can</text><text fill="#000000" font-family="sans-serif" font-size="13" lengthAdjust="spacingAndGlyphs" textLength="176" x="293" y="277.2935">be alerted that readout has</text><text fill="#000000" font-family="sans-serif" font-size="13" lengthAdjust="spacingAndGlyphs" textLength="44" x="293" y="292.4263">begun.</text><rect fill="none" height="129.6641" style="stroke: #000000; stroke-width: 2.0;" width="468.5" x="23" y="323.4922"/><polygon fill="#EEEEEE" points="23,323.4922,293,323.4922,293,330.4922,283,340.4922,23,340.4922,23,323.4922" style="stroke: #000000; stroke-width: 2.0;"/><text fill="#000000" font-family="sans-serif" font-size="13" font-weight="bold" lengthAdjust="spacingAndGlyphs" textLength="225" x="38" y="336.5591">Variable number of fragments</text><rect fill="#EEEEEE" filter="url(#fs5fjz0doydak)" height="3" style="stroke: #EEEEEE; stroke-width: 1.0;" width="520.5" x="3" y="361.1914"/><line style="stroke: #000000; stroke-width: 1.0;" x1="3" x2="523.5" y1="361.1914" y2="361.1914"/><line style="stroke: #000000; stroke-width: 1.0;" x1="3" x2="523.5" y1="364.1914" y2="364.1914"/><rect fill="#EEEEEE" filter="url(#fs5fjz0doydak)" height="23.1328" style="stroke: #000000; stroke-width: 2.0;" width="60" x="233.25" y="350.625"/><text fill="#000000" font-family="sans-serif" font-size="13" font-weight="bold" lengthAdjust="spacingAndGlyphs" textLength="41" x="239.25" y="366.6919">Delay</text><polygon fill="#A80036" points="72.5,420.8906,62.5,424.8906,72.5,428.8906,68.5,424.8906" style="stroke: #A80036; stroke-width: 1.0;"/><line style="stroke: #A80036; stroke-width: 1.0;" x1="66.5" x2="271.5" y1="424.8906" y2="424.8906"/><text fill="#000000" font-family="sans-serif" font-size="13" lengthAdjust="spacingAndGlyphs" textLength="178" x="78.5" y="419.9575">message(resp[more=true])</text><polygon fill="#FBFB77" filter="url(#fs5fjz0doydak)" points="287,388.7578,287,443.7578,472,443.7578,472,398.7578,462,388.7578,287,388.7578" style="stroke: #A80036; stroke-width: 1.0;"/><line style="stroke: #A80036; stroke-width: 1.0;" x1="462" x2="462" y1="388.7578" y2="398.7578"/><line style="stroke: #A80036; stroke-width: 1.0;" x1="472" x2="462" y1="398.7578" y2="398.7578"/><text fill="#000000" font-family="sans-serif" font-size="13" lengthAdjust="spacingAndGlyphs" textLength="164" x="293" y="405.8247">Sensor data transmission</text><text fill="#000000" font-family="sans-serif" font-size="13" lengthAdjust="spacingAndGlyphs" textLength="150" x="293" y="420.9575">can be fragmented into</text><text fill="#000000" font-family="sans-serif" font-size="13" lengthAdjust="spacingAndGlyphs" textLength="125" x="293" y="436.0903">multiple messages.</text><rect fill="#EEEEEE" filter="url(#fs5fjz0doydak)" height="3" style="stroke: #EEEEEE; stroke-width: 1.0;" width="520.5" x="3" y="480.7227"/><line style="stroke: #000000; stroke-width: 1.0;" x1="3" x2="523.5" y1="480.7227" y2="480.7227"/><line style="stroke: #000000; stroke-width: 1.0;" x1="3" x2="523.5" y1="483.7227" y2="483.7227"/><rect fill="#EEEEEE" filter="url(#fs5fjz0doydak)" height="23.1328" style="stroke: #000000; stroke-width: 2.0;" width="60" x="233.25" y="470.1563"/><text fill="#000000" font-family="sans-serif" font-size="13" font-weight="bold" lengthAdjust="spacingAndGlyphs" textLength="41" x="239.25" y="486.2231">Delay</text><polygon fill="#A80036" points="72.5,520.2891,62.5,524.2891,72.5,528.2891,68.5,524.2891" style="stroke: #A80036; stroke-width: 1.0;"/><line style="stroke: #A80036; stroke-width: 1.0;" x1="66.5" x2="266.5" y1="524.2891" y2="524.2891"/><text fill="#000000" font-family="sans-serif" font-size="13" lengthAdjust="spacingAndGlyphs" textLength="182" x="78.5" y="519.356">message(resp[more=false])</text><polygon fill="#A80036" points="255.5,556.4219,265.5,560.4219,255.5,564.4219,259.5,560.4219" style="stroke: #A80036; stroke-width: 1.0;"/><line style="stroke: #A80036; stroke-width: 1.0;" x1="61.5" x2="261.5" y1="560.4219" y2="560.4219"/><text fill="#000000" font-family="sans-serif" font-size="13" lengthAdjust="spacingAndGlyphs" textLength="167" x="68.5" y="555.4888">iq[type=set](unsubscribe)</text><polygon fill="#A80036" points="72.5,585.5547,62.5,589.5547,72.5,593.5547,68.5,589.5547" style="stroke: #A80036; stroke-width: 1.0;"/><line style="stroke: #A80036; stroke-width: 1.0;" x1="66.5" x2="271.5" y1="589.5547" y2="589.5547"/><text fill="#000000" font-family="sans-serif" font-size="13" lengthAdjust="spacingAndGlyphs" textLength="106" x="78.5" y="584.6216">iq[type=result]()</text><!--
@startuml
Client -> Device : iq[type=set](subscribe)
Activate Device

Client <- Device : iq[type=result](accepted)

group While subscription active

    == Wait for event to trigger ==

    Device -> Device : start readout
    Activate Device

    opt
        Client <- Device : message(started)
        note right
            If readout slow, client can
            be alerted that readout has
            begun.
        end note
    end

    group Variable number of fragments

        == Delay ==

        Client <- Device : message(resp[more=true])
        note right
            Sensor data transmission
            can be fragmented into
            multiple messages.
        end note
    end

    == Delay ==

    Client <- Device : message(resp[more=false])
    Deactivate Device

end

Client -> Device : iq[type=set](unsubscribe)
Client <- Device : iq[type=result]()

Deactivate Device
@enduml

PlantUML version 1.2017.18beta8(Unknown compile time)
(GPL source distribution)
Java Runtime: Java(TM) SE Runtime Environment
JVM: Java HotSpot(TM) 64-Bit Server VM
Java Version: 1.7.0_25-b15
Operating System: Linux
Default Encoding: UTF-8
Language: en
Country: US
--></g></svg>