<?xml version="1.0" encoding="UTF-8" standalone="no"?><svg xmlns="http://www.w3.org/2000/svg" xmlns:xlink="http://www.w3.org/1999/xlink" contentScriptType="application/ecmascript" contentStyleType="text/css" height="198px" preserveAspectRatio="none" style="width:312px;height:198px;" version="1.1" viewBox="0 0 312 198" width="312px" zoomAndPan="magnify"><defs><filter height="300%" id="f1fl726g6gzmfn" width="300%" x="-1" y="-1"><feGaussianBlur result="blurOut" stdDeviation="2.0"/><feColorMatrix in="blurOut" result="blurOut2" type="matrix" values="0 0 0 0 0 0 0 0 0 0 0 0 0 0 0 0 0 0 .4 0"/><feOffset dx="4.0" dy="4.0" in="blurOut2" result="blurOut3"/><feBlend in="SourceGraphic" in2="blurOut3" mode="normal"/></filter></defs><g><rect fill="#FFFFFF" filter="url(#f1fl726g6gzmfn)" height="71.2656" style="stroke: #A80036; stroke-width: 1.0;" width="10" x="194.5" y="69.2969"/><rect fill="#FFFFFF" filter="url(#f1fl726g6gzmfn)" height="34.1328" style="stroke: #A80036; stroke-width: 1.0;" width="10" x="199.5" y="106.4297"/><line style="stroke: #A80036; stroke-width: 1.0; stroke-dasharray: 5.0,5.0;" x1="36" x2="36" y1="38.2969" y2="158.6953"/><line style="stroke: #A80036; stroke-width: 1.0; stroke-dasharray: 5.0,5.0;" x1="199" x2="199" y1="38.2969" y2="158.6953"/><rect fill="#FEFECE" filter="url(#f1fl726g6gzmfn)" height="30.2969" style="stroke: #A80036; stroke-width: 1.5;" width="53" x="8" y="3"/><text fill="#000000" font-family="sans-serif" font-size="14" lengthAdjust="spacingAndGlyphs" textLength="39" x="15" y="22.9951">Client</text><rect fill="#FEFECE" filter="url(#f1fl726g6gzmfn)" height="30.2969" style="stroke: #A80036; stroke-width: 1.5;" width="53" x="8" y="157.6953"/><text fill="#000000" font-family="sans-serif" font-size="14" lengthAdjust="spacingAndGlyphs" textLength="39" x="15" y="177.6904">Client</text><rect fill="#FEFECE" filter="url(#f1fl726g6gzmfn)" height="30.2969" style="stroke: #A80036; stroke-width: 1.5;" width="61" x="167" y="3"/><text fill="#000000" font-family="sans-serif" font-size="14" lengthAdjust="spacingAndGlyphs" textLength="47" x="174" y="22.9951">Device</text><rect fill="#FEFECE" filter="url(#f1fl726g6gzmfn)" height="30.2969" style="stroke: #A80036; stroke-width: 1.5;" width="61" x="167" y="157.6953"/><text fill="#000000" font-family="sans-serif" font-size="14" lengthAdjust="spacingAndGlyphs" textLength="47" x="174" y="177.6904">Device</text><rect fill="#FFFFFF" filter="url(#f1fl726g6gzmfn)" height="71.2656" style="stroke: #A80036; stroke-width: 1.0;" width="10" x="194.5" y="69.2969"/><rect fill="#FFFFFF" filter="url(#f1fl726g6gzmfn)" height="34.1328" style="stroke: #A80036; stroke-width: 1.0;" width="10" x="199.5" y="106.4297"/><polygon fill="#A80036" points="182.5,65.2969,192.5,69.2969,182.5,73.2969,186.5,69.2969" style="stroke: #A80036; stroke-width: 1.0;"/><line style="stroke: #A80036; stroke-width: 1.0;" x1="36.5" x2="188.5" y1="69.2969" y2="69.2969"/><text fill="#000000" font-family="sans-serif" font-size="13" lengthAdjust="spacingAndGlyphs" textLength="112" x="43.5" y="64.3638">iq[type=get](req)</text><line style="stroke: #A80036; stroke-width: 1.0;" x1="204.5" x2="251.5" y1="93.5625" y2="93.5625"/><line style="stroke: #A80036; stroke-width: 1.0;" x1="251.5" x2="251.5" y1="93.5625" y2="106.5625"/><line style="stroke: #A80036; stroke-width: 1.0;" x1="210.5" x2="251.5" y1="106.5625" y2="106.5625"/><polygon fill="#A80036" points="220.5,102.5625,210.5,106.5625,220.5,110.5625,216.5,106.5625" style="stroke: #A80036; stroke-width: 1.0;"/><text fill="#000000" font-family="sans-serif" font-size="13" lengthAdjust="spacingAndGlyphs" textLength="84" x="216.5" y="88.4966">start readout</text><polygon fill="#A80036" points="47.5,136.5625,37.5,140.5625,47.5,144.5625,43.5,140.5625" style="stroke: #A80036; stroke-width: 1.0;"/><line style="stroke: #A80036; stroke-width: 1.0;" x1="41.5" x2="198.5" y1="140.5625" y2="140.5625"/><text fill="#000000" font-family="sans-serif" font-size="13" lengthAdjust="spacingAndGlyphs" textLength="134" x="53.5" y="135.6294">iq[type=result](resp)</text><!--
@startuml
Client -> Device : iq[type=get](req)
Activate Device

Device -> Device : start readout
Activate Device

Client <- Device : iq[type=result](resp)
Deactivate Device
Deactivate Device
@enduml

PlantUML version 1.2017.18beta8(Unknown compile time)
(GPL source distribution)
Java Runtime: Java(TM) SE Runtime Environment
JVM: Java HotSpot(TM) 64-Bit Server VM
Java Version: 1.7.0_25-b15
Operating System: Linux
Default Encoding: UTF-8
Language: en
Country: US
--></g></svg>