{
  "project_info": {
    "project_number": "374418917010",
    "firebase_url": "https://fir-demo-cf906.firebaseio.com",
    "project_id": "fir-demo-cf906",
    "storage_bucket": "fir-demo-cf906.appspot.com"
  },
  "client": [
    {
      "client_info": {
        "mobilesdk_app_id": "1:374418917010:android:60e064d4c7b316ab",
        "android_client_info": {
          "package_name": "com.hub"
        }
      },
      "oauth_client": [
        {
          "client_id": "374418917010-e6iitrh6iq2ptlollgmgs2j4aun8gtie.apps.googleusercontent.com",
          "client_type": 3
        }
      ],
      "api_key": [
        {
          "current_key": "AIzaSyAPduPArdu3tkgbLPmj07eqvBOFMRJTGTU"
        }
      ],
      "services": {
        "appinvite_service": {
          "other_platform_oauth_client": [
            {
              "client_id": "374418917010-e6iitrh6iq2ptlollgmgs2j4aun8gtie.apps.googleusercontent.com",
              "client_type": 3
            }
          ]
        }
      }
    },
    {
      "client_info": {
        "mobilesdk_app_id": "1:374418917010:android:6a836b538aa57bab",
        "android_client_info": {
          "package_name": "com.maintenancehub"
        }
      },
      "oauth_client": [
        {
          "client_id": "374418917010-e6iitrh6iq2ptlollgmgs2j4aun8gtie.apps.googleusercontent.com",
          "client_type": 3
        }
      ],
      "api_key": [
        {
          "current_key": "AIzaSyAPduPArdu3tkgbLPmj07eqvBOFMRJTGTU"
        }
      ],
      "services": {
        "appinvite_service": {
          "other_platform_oauth_client": [
            {
              "client_id": "374418917010-e6iitrh6iq2ptlollgmgs2j4aun8gtie.apps.googleusercontent.com",
              "client_type": 3
            }
          ]
        }
      }
    }
  ],
  "configuration_version": "1"
}