<?xml version="1.0" encoding="UTF-8" standalone="no"?>
<!DOCTYPE svg PUBLIC "-//W3C//DTD SVG 1.1//EN" "http://www.w3.org/Graphics/SVG/1.1/DTD/svg11.dtd">
<svg width="100%" height="100%" viewBox="0 0 1640 725" version="1.1" xmlns="http://www.w3.org/2000/svg" xmlns:xlink="http://www.w3.org/1999/xlink" xml:space="preserve" xmlns:serif="http://www.serif.com/" style="fill-rule:evenodd;clip-rule:evenodd;stroke-linecap:round;stroke-linejoin:round;stroke-miterlimit:1.5;">
    <g transform="matrix(0.934608,-0.31531,0.150513,0.990206,-1149.09,-1940.97)">
        <g id="_--Arizona-Regular" serif:id="&amp; Arizona Regular" transform="matrix(916.667,0,0,916.667,1322.59,3125.94)">
            <path d="M0.291,-0.009C0.23,0.006 0.18,0.01 0.142,0.003C0.073,-0.009 0.03,-0.033 0.011,-0.069C0.004,-0.082 0.001,-0.093 0.001,-0.103C0.001,-0.112 0.002,-0.12 0.003,-0.126C0.007,-0.147 0.02,-0.169 0.042,-0.192C0.063,-0.215 0.093,-0.238 0.132,-0.259L0.184,-0.288C0.196,-0.399 0.266,-0.493 0.393,-0.572C0.443,-0.603 0.485,-0.619 0.519,-0.619C0.53,-0.619 0.541,-0.617 0.55,-0.614C0.572,-0.606 0.583,-0.592 0.583,-0.571C0.583,-0.535 0.559,-0.498 0.51,-0.459C0.483,-0.437 0.454,-0.417 0.423,-0.398L0.249,-0.294L0.249,-0.265C0.249,-0.249 0.252,-0.23 0.258,-0.205C0.309,-0.234 0.364,-0.253 0.424,-0.263C0.453,-0.268 0.479,-0.271 0.501,-0.271C0.556,-0.271 0.587,-0.254 0.594,-0.219C0.595,-0.214 0.595,-0.21 0.595,-0.206C0.595,-0.183 0.583,-0.16 0.558,-0.135C0.515,-0.092 0.442,-0.054 0.34,-0.023C0.381,0.032 0.425,0.07 0.474,0.09C0.507,0.104 0.532,0.111 0.55,0.111C0.568,0.111 0.58,0.107 0.588,0.1C0.595,0.092 0.598,0.084 0.598,0.076C0.598,0.067 0.593,0.057 0.584,0.046C0.564,0.02 0.535,0.007 0.496,0.007C0.492,0.007 0.486,0.008 0.478,0.009C0.469,0.01 0.465,0.009 0.465,0.007C0.463,0.002 0.468,-0.002 0.479,-0.004C0.497,-0.007 0.514,-0.008 0.529,-0.008C0.572,-0.008 0.602,0.004 0.62,0.027C0.629,0.038 0.634,0.049 0.634,0.06C0.634,0.07 0.63,0.082 0.622,0.093C0.607,0.116 0.582,0.127 0.548,0.127C0.521,0.127 0.493,0.121 0.464,0.108C0.395,0.079 0.338,0.04 0.291,-0.009ZM0.571,-0.2C0.571,-0.219 0.552,-0.228 0.513,-0.228C0.448,-0.228 0.366,-0.208 0.267,-0.168C0.281,-0.121 0.302,-0.077 0.33,-0.036C0.411,-0.061 0.478,-0.096 0.529,-0.141C0.557,-0.165 0.571,-0.185 0.571,-0.2ZM0.093,-0.024C0.114,-0.015 0.138,-0.011 0.163,-0.011C0.204,-0.011 0.243,-0.015 0.278,-0.022C0.244,-0.061 0.22,-0.1 0.205,-0.139C0.182,-0.126 0.169,-0.117 0.164,-0.112C0.159,-0.107 0.157,-0.104 0.156,-0.105C0.155,-0.105 0.155,-0.107 0.156,-0.111C0.158,-0.126 0.171,-0.143 0.194,-0.162L0.196,-0.163C0.187,-0.194 0.182,-0.224 0.182,-0.253L0.153,-0.235C0.116,-0.21 0.089,-0.183 0.07,-0.156C0.051,-0.129 0.041,-0.103 0.041,-0.079C0.041,-0.055 0.058,-0.037 0.093,-0.024ZM0.449,-0.453C0.48,-0.48 0.495,-0.504 0.495,-0.526C0.495,-0.547 0.484,-0.558 0.461,-0.558C0.435,-0.558 0.404,-0.546 0.368,-0.521C0.299,-0.474 0.261,-0.409 0.253,-0.325C0.265,-0.332 0.285,-0.344 0.314,-0.36C0.374,-0.395 0.419,-0.426 0.449,-0.453Z" style="fill-rule:nonzero;"/>
        </g>
    </g>
    <g transform="matrix(1,0.000267104,-0.000267104,1,-503.281,-834.119)">
        <g transform="matrix(1,-6.31713e-05,6.31713e-05,1,-53.7967,16.2826)">
            <path d="M881.588,915.865C881.588,913.603 952.781,897.782 1018.38,1087.5C1067.81,1230.42 1049.91,1372.14 1026.51,1410.86C1012.79,1433.54 988.06,1476.86 933.034,1469.66C870.361,1461.48 835.581,1389.2 850.212,1296.04C857.262,1251.15 872.893,1179.31 881.221,1134.2C905.192,1004.37 885.987,915.865 881.588,915.865Z" style="fill:rgb(100,100,100);"/>
            <path d="M875.871,921.458C881.859,936.79 894.464,1018.41 873.354,1132.75C865.015,1177.91 849.368,1249.85 842.309,1294.8C826.823,1393.4 865.66,1468.93 931.997,1477.6C991.357,1485.36 1018.56,1439.47 1033.35,1415C1040.72,1402.82 1047.74,1380.96 1052.32,1352.21C1062.64,1287.32 1061.05,1186.39 1025.95,1084.89C999.152,1007.4 971.272,963.587 947.669,938.941C922.274,912.424 901.021,907.115 889.856,906.641C884.52,906.414 880.897,907.318 879.273,907.968C877.688,908.602 876.698,909.399 876.12,909.956C874.02,911.98 873.588,914.179 873.588,915.865C873.588,918.042 874.458,920.016 875.871,921.458ZM892.997,922.959C900.883,924.232 913.167,928.944 928.098,942.252C952.312,963.835 981.987,1006.72 1010.83,1090.11C1044.91,1188.69 1046.54,1286.68 1036.51,1349.69C1032.37,1375.76 1026.34,1395.68 1019.66,1406.72C1007.03,1427.62 984.768,1468.36 934.071,1461.73C905.411,1457.99 883.296,1439.38 869.852,1411.26C855.735,1381.75 851.091,1342.01 858.116,1297.28C865.156,1252.45 880.77,1180.7 889.088,1135.65C896.361,1096.26 899.702,1060.62 900.699,1030.04C902.41,977.503 897.16,939.692 892.997,922.959Z" style="fill:rgb(100,100,100);"/>
        </g>
        <g transform="matrix(-1.07076,-0.00028162,-0.000263009,1,1658.01,15.1362)">
            <path d="M881.588,915.865C881.588,913.603 952.781,897.782 1018.38,1087.5C1067.81,1230.42 1049.91,1372.14 1026.51,1410.86C1012.79,1433.54 988.06,1476.86 933.034,1469.66C870.361,1461.48 835.581,1389.2 850.212,1296.04C857.262,1251.15 872.893,1179.31 881.221,1134.2C905.192,1004.37 885.987,915.865 881.588,915.865Z" style="fill:rgb(100,100,100);"/>
            <path d="M876.438,921.658C875.008,920.202 874.117,918.145 874.117,915.865C874.117,914.143 874.529,911.838 876.673,909.77C877.214,909.249 878.147,908.495 879.63,907.902C881.192,907.277 884.681,906.422 889.813,906.64C910.925,907.536 970.875,927.066 1025.39,1084.72C1060.53,1186.33 1062.11,1287.35 1051.78,1352.3C1047.19,1381.11 1040.16,1403 1032.78,1415.21C1018.07,1439.54 991.16,1485.32 932.129,1477.61C865.788,1468.94 827.357,1393.32 842.845,1294.71C849.904,1249.76 865.552,1177.82 873.891,1132.65C894.964,1018.51 882.423,937.028 876.438,921.658ZM892.472,922.883L892.779,924.126C899.289,951.392 908.052,1030.12 888.55,1135.75C880.234,1180.8 864.62,1252.54 857.58,1297.36C843.804,1385.08 874.928,1454.01 933.939,1461.72C984.963,1468.39 1007.52,1427.55 1020.23,1406.52C1029.21,1391.67 1037.06,1360.94 1040.55,1320.73C1045.93,1258.78 1040.59,1174.74 1011.38,1090.28C982.546,1006.9 952.852,964.008 928.641,942.429C913.195,928.66 900.485,924.025 892.472,922.883ZM881.217,923.855L881.588,923.865C881.465,923.865 881.341,923.862 881.217,923.855Z" style="fill:rgb(100,100,100);"/>
        </g>
    </g>
    <g transform="matrix(1.10557,0.000903217,-0.000991669,1.21383,-190.166,-1073.3)">
        <g transform="matrix(0.994925,0.0941474,-0.102767,0.995376,-249.275,-210.448)">
            <path d="M1924.97,1446.02C1867.83,1485.17 1862.83,1419.22 1771.71,1462.64C1676.29,1508.11 1658.33,1404.91 1675.65,1388.96C1707.48,1359.65 1725.43,1332.3 1764.91,1282.03C1813.61,1220 1848.55,1268.29 1860.16,1298.12C1876.14,1339.21 1904.14,1347.61 1920.31,1361.48C1961.84,1397.08 1937.25,1423.76 1924.97,1446.02Z" style="fill:rgb(100,100,100);stroke:rgb(100,100,100);stroke-width:13.57px;"/>
        </g>
        <g transform="matrix(0.914553,-0.404467,0.404467,0.914553,-708.319,905.575)">
            <path d="M1956.25,1286C1924.54,1286.63 1903.1,1243.86 1918.63,1224.11C1942.56,1193.66 1964.56,1205.84 1993.25,1152.08C1999.91,1139.59 2026.34,1172.41 2011.56,1229.85C2005.3,1254.21 1991.87,1285.29 1956.25,1286Z" style="fill:rgb(100,100,100);stroke:rgb(100,100,100);stroke-width:14.13px;"/>
        </g>
        <g transform="matrix(0.902264,-0.307393,0.325395,0.955101,-579.095,636.785)">
            <path d="M1889.33,1013.77C1889.27,1031.94 1892.6,1048.48 1835.87,1110.24C1806.69,1142 1857.91,1176.87 1883.35,1176.3C1934.61,1175.16 1935.61,1120.47 1936.71,1110.12C1941.38,1066.18 1919.09,1001.25 1889.33,1013.77Z" style="fill:rgb(100,100,100);stroke:rgb(100,100,100);stroke-width:14.28px;"/>
        </g>
        <g transform="matrix(0.993337,0.115243,-0.115243,0.993337,-259.485,-168.093)">
            <path d="M1763.78,995.66C1766.65,979.929 1700.92,1029.48 1696.35,1091.59C1692.24,1147.47 1717.74,1157.5 1741.06,1159.55C1782.42,1163.19 1798.58,1128.93 1798.67,1118.73C1799.12,1063.06 1750.76,1067.03 1763.78,995.66Z" style="fill:rgb(100,100,100);stroke:rgb(100,100,100);stroke-width:13.49px;"/>
        </g>
        <g transform="matrix(1,0.00070829,-0.00070829,1,-398.958,-27.546)">
            <path d="M1654.82,1169.91C1630.07,1148.25 1607.13,1226.11 1614.55,1255.97C1618.43,1271.59 1631.15,1304.86 1670.99,1293.77C1691.92,1287.93 1700.79,1264.32 1698.85,1259.3C1677.55,1204.19 1664.16,1228.4 1654.82,1169.91Z" style="fill:rgb(100,100,100);stroke:rgb(100,100,100);stroke-width:13.64px;"/>
        </g>
        <g transform="matrix(-214.697,50.009,-50.7384,-217.828,472153,139061)">
            <path d="M1937.03,1078.1C1937.05,1077.82 1937.06,1078.35 1937.03,1078.1Z" style="fill:rgb(100,100,100);stroke:rgb(100,100,100);stroke-width:0.06px;"/>
        </g>
        <g transform="matrix(0.972215,0.234089,-0.234089,0.972215,122.015,-600.427)">
            <path d="M1587.58,1229.6C1583.58,1247.23 1585.25,1257.04 1591.57,1258.05" style="fill:rgb(100,100,100);stroke:rgb(100,100,100);stroke-width:13.36px;"/>
        </g>
        <g transform="matrix(-0.971794,0.235536,0.235833,0.971865,2711.72,-600.422)">
            <path d="M1587.58,1229.6C1583.58,1247.23 1585.25,1257.04 1591.57,1258.05" style="fill:rgb(100,100,100);stroke:rgb(100,100,100);stroke-width:13.36px;"/>
        </g>
        <g transform="matrix(0.972215,0.234089,-0.234089,0.972215,-0.912498,-496.273)">
            <path d="M1587.58,1229.6C1583.58,1247.23 1585.25,1257.04 1591.57,1258.05" style="fill:rgb(100,100,100);stroke:rgb(100,100,100);stroke-width:13.36px;"/>
        </g>
    </g>
</svg>
