id,name,model_id:id,group_id:id,perm_read,perm_write,perm_create,perm_unlink
access_contract_licence_manager,access_contract_licence_manager,model_contract_licence_manager,base.group_user,1,1,1,1
access_contract_licence_manager_partner,access_contract_licence_manager_partner,model_contract_licence_manager_partner,base.group_user,1,1,1,1
