{
  "id": "01-System",
  "title": "System Monitor",
  "group": "Personal",
  "widgets": [
    {
      "id": "w2",
      "title": "CPU Load",
      "row": 3,
      "col": 9,
      "path": "jmx/charts",
      "include": "app/jmx/html/charts.html",
      "search": {
        "nid": "root-java.lang-OperatingSystem",
        "att": "ProcessCpuLoad%2CSystemCpuLoad%2CSystemLoadAverage"
      },
      "hash": "",
      "size_x": 3,
      "size_y": 1
    },
    {
      "id": "w3",
      "title": "Size",
      "row": 4,
      "col": 9,
      "path": "jmx/charts",
      "include": "app/jmx/html/charts.html",
      "search": {
        "nid": "root-java.lang-OperatingSystem",
        "att": "FreePhysicalMemorySize%2CFreeSwapSpaceSize%2CTotalPhysicalMemorySize%2CTotalSwapSpaceSize"
      },
      "hash": "",
      "size_x": 3,
      "size_y": 1
    },
    {
      "id": "w1",
      "title": "Operating System Attributes",
      "row": 1,
      "col": 1,
      "path": "jmx/attributes",
      "include": "app/jmx/html/attributes.html",
      "search": {
        "nid": "root-java.lang-OperatingSystem"
      },
      "hash": "",
      "size_x": 6,
      "size_y": 4
    },
    {
      "id": "w4",
      "title": "Process CPU Load",
      "row": 1,
      "col": 7,
      "size_x": 2,
      "size_y": 2,
      "path": "jmx/widget/area",
      "include": "app/jmx/html/areaChart.html",
      "search": {},
      "hash": "",
      "routeParams": "{\"type\":\"area\",\"title\":\"Process CPU Load\",\"mbean\":\"java.lang:type=OperatingSystem\",\"attribute\":\"ProcessCpuLoad\"}"
    },
    {
      "id": "w5",
      "title": "Swap Size",
      "row": 3,
      "col": 7,
      "size_x": 2,
      "size_y": 2,
      "path": "jmx/widget/donut",
      "include": "app/jmx/html/donutChart.html",
      "search": {},
      "hash": "",
      "routeParams": "{\"type\":\"donut\",\"title\":\"Swap Size\",\"mbean\":\"java.lang:type=OperatingSystem\",\"total\":\"TotalSwapSpaceSize\",\"terms\":\"FreeSwapSpaceSize\",\"remaining\":\"Used Swap\"}"
    },
    {
      "id": "w6",
      "title": "Process CPU Time",
      "row": 1,
      "col": 9,
      "size_x": 2,
      "size_y": 2,
      "path": "jmx/widget/area",
      "include": "app/jmx/html/areaChart.html",
      "search": {},
      "hash": "",
      "routeParams": "{\"type\":\"area\",\"title\":\"Process CPU Time\",\"mbean\":\"java.lang:type=OperatingSystem\",\"attribute\":\"ProcessCpuTime\"}"
    }
  ],
  "uri": "/dashboards/team/all/JVM.json",
  "$$hashKey": "1HL"
}
