{
  "pitchs" :[
    {
        "id": 1,
        "banner":"https://qdas.s3.amazonaws.com/sport-centers/36e4f7c2-807b-42a0-b394-24d73eb8c199.png",
        "name": "Sân KTX",
        "address": "KTX khu A, ĐHQG TPHCM" ,
        "phoneNumber": "0399699977" ,
        "type": "Sân 5x5"
    },

    {
        "id": 2,
        "banner":"https://qdas.s3.amazonaws.com/sport-centers/36e4f7c2-807b-42a0-b394-24d73eb8c199.png",
        "name": "Sân KTX",
        "address": "KTX khu A, ĐHQG TPHCM" ,
        "phoneNumber": "0399699977" ,
        "type": "Sân 5x5"
    },
    {
        "id": 3,
        "banner":"https://qdas.s3.amazonaws.com/sport-centers/36e4f7c2-807b-42a0-b394-24d73eb8c199.png",
        "name": "Sân KTX",
        "address": "KTX khu A, ĐHQG TPHCM" ,
        "phoneNumber": "0399699977" ,
        "type": "Sân 5x5"
    },
    {
        "id": 4,
        "banner":"https://qdas.s3.amazonaws.com/sport-centers/36e4f7c2-807b-42a0-b394-24d73eb8c199.png",
        "name": "Sân KTX",
        "address": "KTX khu A, ĐHQG TPHCM" ,
        "phoneNumber": "0399699977" ,
        "type": "Sân 5x5"
    },

    {
        "id": 5,
        "banner":"https://qdas.s3.amazonaws.com/sport-centers/36e4f7c2-807b-42a0-b394-24d73eb8c199.png",
        "name": "Sân KTX",
        "address": "KTX khu A, ĐHQG TPHCM" ,
        "phoneNumber": "0399699977" ,
        "type": "Sân 5x5"
    },

    {
        "id": 6,
        "banner":"https://qdas.s3.amazonaws.com/sport-centers/36e4f7c2-807b-42a0-b394-24d73eb8c199.png",
        "name": "Sân KTX",
        "address": "KTX khu A, ĐHQG TPHCM" ,
        "phoneNumber": "0399699977" ,
        "type": "Sân 5x5"
    },
    {
        "id": 7,
        "banner":"https://qdas.s3.amazonaws.com/sport-centers/36e4f7c2-807b-42a0-b394-24d73eb8c199.png",
        "name": "Sân KTX",
        "address": "KTX khu A, ĐHQG TPHCM" ,
        "phoneNumber": "0399699977" ,
        "type": "Sân 5x5"
    },
    {
        "id": 8,
        "banner":"https://qdas.s3.amazonaws.com/sport-centers/36e4f7c2-807b-42a0-b394-24d73eb8c199.png",
        "name": "Sân KTX",
        "address": "KTX khu A, ĐHQG TPHCM" ,
        "phoneNumber": "0399699977" ,
        "type": "Sân 5x5"
    },
    {
        "id": 9,
        "banner":"https://qdas.s3.amazonaws.com/sport-centers/36e4f7c2-807b-42a0-b394-24d73eb8c199.png",
        "name": "Sân KTX",
        "address": "KTX khu A, ĐHQG TPHCM" ,
        "phoneNumber": "0399699977" ,
        "type": "Sân 5x5"
    }
]
}