{
  "applications": "*",
  "changelogDate": "20220210075542",
  "dto": "no",
  "embedded": false,
  "entityTableName": "product",
  "fields": [
    {
      "fieldName": "id",
      "fieldType": "Long"
    },
    {
      "fieldName": "name",
      "fieldType": "String"
    }
  ],
  "fluentMethods": true,
  "jpaMetamodelFiltering": false,
  "name": "Product",
  "pagination": "no",
  "readOnly": false,
  "relationships": [],
  "service": "no"
}
