{
    "version": 1,
    "disable_existing_loggers": false,
    "formatters": {
        "simple": { "format": "{asctime:15} \t [ {name:45} -> {funcName:25} ] [ {levelname:^9} ] \t | {message}", "style": "{" }
    },

    "handlers": {
        "console": {
            "class": "logging.StreamHandler",
            "level": "DEBUG",
            "formatter": "simple",
            "stream": "ext://sys.stdout"
        },
        
        "error_file_handler": {
            "class": "logging.handlers.RotatingFileHandler",
            "level": "ERROR",
            "formatter": "simple",
            "filename": "logs/errors.log",
            "maxBytes": 10485760,
            "backupCount": 20,
            "encoding": "utf8"
        },

        "main_log_handler": {
            "class": "logging.handlers.RotatingFileHandler",
            "level": "DEBUG",
            "formatter": "simple",
            "filename": "logs/server.log",
            "maxBytes": 10485760,
            "backupCount": 20,
            "encoding": "utf8"
        }
    },

    "loggers": {
        "explorer-server": {
            "level": "DEBUG",
            "handlers": [ "error_file_handler", "main_log_handler" ],
            "propagate": "no"
        },
        "http_server": {
            "level": "INFO",
            "handlers": [ "error_file_handler", "main_log_handler" ],
            "propagate": "no"
        },
        "tornado": {
            "level": "INFO",
            "handlers": [ "main_log_handler" ],
            "propagate": "no"
        }
    },

    "root": {
        "level": "DEBUG",
        "handlers": [ "console", "error_file_handler" ]
    }
}
