﻿placename,nrofsickvisits,totalnrofvisits,percentageofsickvisits
Place nr 23,42,67,62.69
Place nr 54,39,67,58.21
Place nr 77,35,64,54.69
Place nr 49,34,64,53.13
Place nr 74,34,54,62.96
Place nr 30,33,58,56.9
Place nr 34,33,58,56.9
Place nr 80,33,58,56.9
Place nr 15,32,64,50.0
Place nr 36,31,51,60.78