module hpscs.com/go-pipeline

go 1.13

require (
	github.com/alecthomas/template v0.0.0-20190718012654-fb15b899a751
	github.com/cpuguy83/go-md2man/v2 v2.0.0 // indirect
	github.com/gin-gonic/gin v1.4.0
	github.com/go-openapi/jsonreference v0.19.3 // indirect
	github.com/go-openapi/spec v0.19.3 // indirect
	github.com/mailru/easyjson v0.7.0 // indirect
	github.com/satori/go.uuid v1.2.0 // indirect
	github.com/swaggo/files v0.0.0-20190704085106-630677cd5c14
	github.com/swaggo/gin-swagger v1.2.0
	github.com/swaggo/swag v1.6.2
	github.com/urfave/cli v1.22.1 // indirect
	golang.org/x/lint v0.0.0-20190909230951-414d861bb4ac // indirect
	golang.org/x/net v0.0.0-20190921015927-1a5e07d1ff72 // indirect
	golang.org/x/tools v0.0.0-20190920225731-5eefd052ad72 // indirect
)
