%!PS-Adobe-3.0 EPSF-2.0
%%BoundingBox: 0 0 840 133
%%Creator: mscgen 0.20
%%EndComments
0.700000 0.700000 scale
0 0 moveto
0 190 lineto
1200 190 lineto
1200 0 lineto
closepath
clip
%PageTrailer
%Page: 1 1
/Helvetica findfont
10 scalefont
setfont
/Helvetica findfont
12 scalefont
setfont
0 190 translate
/mtrx matrix def
/ellipse
  { /endangle exch def
    /startangle exch def
    /ydia exch def
    /xdia exch def
    /y exch def
    /x exch def
    /savematrix mtrx currentmatrix def
    x y translate
    xdia 2 div ydia 2 div scale
    1 -1 scale
    0 0 1 startangle endangle arc
    savematrix setmatrix
} def
(Mainboard) dup stringwidth
1.000000 1.000000 1.000000 setrgbcolor
pop dup dup newpath 150 -17 moveto 2 div neg 0 rmoveto 0 rlineto 0 9 rlineto neg 0 rlineto closepath fill
0.000000 0.000000 0.000000 setrgbcolor
150 -16 moveto dup stringwidth pop 2 div neg 0 rmoveto show
(Module1) dup stringwidth
1.000000 1.000000 1.000000 setrgbcolor
pop dup dup newpath 450 -17 moveto 2 div neg 0 rmoveto 0 rlineto 0 9 rlineto neg 0 rlineto closepath fill
0.000000 0.000000 0.000000 setrgbcolor
450 -16 moveto dup stringwidth pop 2 div neg 0 rmoveto show
(Module2) dup stringwidth
1.000000 1.000000 1.000000 setrgbcolor
pop dup dup newpath 750 -17 moveto 2 div neg 0 rmoveto 0 rlineto 0 9 rlineto neg 0 rlineto closepath fill
0.000000 0.000000 0.000000 setrgbcolor
750 -16 moveto dup stringwidth pop 2 div neg 0 rmoveto show
(Module3) dup stringwidth
1.000000 1.000000 1.000000 setrgbcolor
pop dup dup newpath 1050 -17 moveto 2 div neg 0 rmoveto 0 rlineto 0 9 rlineto neg 0 rlineto closepath fill
0.000000 0.000000 0.000000 setrgbcolor
1050 -16 moveto dup stringwidth pop 2 div neg 0 rmoveto show
newpath 150 -22 moveto 150 -50 lineto stroke
newpath 450 -22 moveto 450 -50 lineto stroke
newpath 750 -22 moveto 750 -50 lineto stroke
newpath 1050 -22 moveto 1050 -50 lineto stroke
newpath 150 -33 moveto 450 -33 lineto stroke
newpath 450 -33 moveto 440 -39 lineto 440 -27 lineto closepath fill
(Index 0) dup stringwidth
1.000000 1.000000 1.000000 setrgbcolor
pop dup newpath 281 -32 moveto 0 rlineto 0 9 rlineto neg 0 rlineto closepath fill
0.000000 0.000000 0.000000 setrgbcolor
281 -32 moveto show
newpath 150 -50 moveto 150 -78 lineto stroke
newpath 450 -50 moveto 450 -78 lineto stroke
newpath 750 -50 moveto 750 -78 lineto stroke
newpath 1050 -50 moveto 1050 -78 lineto stroke
newpath 450 -61 moveto 750 -61 lineto stroke
newpath 750 -61 moveto 740 -67 lineto 740 -55 lineto closepath fill
(Index 1) dup stringwidth
1.000000 1.000000 1.000000 setrgbcolor
pop dup newpath 581 -60 moveto 0 rlineto 0 9 rlineto neg 0 rlineto closepath fill
0.000000 0.000000 0.000000 setrgbcolor
581 -60 moveto show
newpath 150 -78 moveto 150 -106 lineto stroke
newpath 450 -78 moveto 450 -106 lineto stroke
newpath 750 -78 moveto 750 -106 lineto stroke
newpath 1050 -78 moveto 1050 -106 lineto stroke
newpath 750 -89 moveto 1050 -89 lineto stroke
newpath 1050 -89 moveto 1040 -95 lineto 1040 -83 lineto closepath fill
(Index 2) dup stringwidth
1.000000 1.000000 1.000000 setrgbcolor
pop dup newpath 881 -88 moveto 0 rlineto 0 9 rlineto neg 0 rlineto closepath fill
0.000000 0.000000 0.000000 setrgbcolor
881 -88 moveto show
newpath 150 -106 moveto 150 -134 lineto stroke
newpath 450 -106 moveto 450 -134 lineto stroke
newpath 750 -106 moveto 750 -134 lineto stroke
newpath 1050 -106 moveto 1050 -134 lineto stroke
newpath 1050 -117 moveto 750 -117 lineto stroke
newpath 750 -117 moveto 760 -123 lineto 760 -111 lineto closepath fill
(Index 3, Data 3) dup stringwidth
1.000000 1.000000 1.000000 setrgbcolor
pop dup newpath 860 -116 moveto 0 rlineto 0 9 rlineto neg 0 rlineto closepath fill
0.000000 0.000000 0.000000 setrgbcolor
860 -116 moveto show
newpath 150 -134 moveto 150 -162 lineto stroke
newpath 450 -134 moveto 450 -162 lineto stroke
newpath 750 -134 moveto 750 -162 lineto stroke
newpath 1050 -134 moveto 1050 -162 lineto stroke
newpath 750 -145 moveto 450 -145 lineto stroke
newpath 450 -145 moveto 460 -151 lineto 460 -139 lineto closepath fill
(Index 3, Data 3, Index 2, Data 2) dup stringwidth
1.000000 1.000000 1.000000 setrgbcolor
pop dup newpath 516 -144 moveto 0 rlineto 0 9 rlineto neg 0 rlineto closepath fill
0.000000 0.000000 0.000000 setrgbcolor
516 -144 moveto show
newpath 150 -162 moveto 150 -190 lineto stroke
newpath 450 -162 moveto 450 -190 lineto stroke
newpath 750 -162 moveto 750 -190 lineto stroke
newpath 1050 -162 moveto 1050 -190 lineto stroke
newpath 450 -173 moveto 150 -173 lineto stroke
newpath 150 -173 moveto 160 -179 lineto 160 -167 lineto closepath fill
(Index 3, Data 3, Index 2, Data 2, Index 1, Data 1) dup stringwidth
1.000000 1.000000 1.000000 setrgbcolor
pop dup newpath 172 -172 moveto 0 rlineto 0 9 rlineto neg 0 rlineto closepath fill
0.000000 0.000000 0.000000 setrgbcolor
172 -172 moveto show
newpath 150 -184 moveto 150 -190 lineto stroke
newpath 450 -184 moveto 450 -190 lineto stroke
newpath 750 -184 moveto 750 -190 lineto stroke
newpath 1050 -184 moveto 1050 -190 lineto stroke
