\relax 
\providecommand\hyper@newdestlabel[2]{}
\providecommand\HyperFirstAtBeginDocument{\AtBeginDocument}
\HyperFirstAtBeginDocument{\ifx\hyper@anchor\@undefined
\global\let\oldcontentsline\contentsline
\gdef\contentsline#1#2#3#4{\oldcontentsline{#1}{#2}{#3}}
\global\let\oldnewlabel\newlabel
\gdef\newlabel#1#2{\newlabelxx{#1}#2}
\gdef\newlabelxx#1#2#3#4#5#6{\oldnewlabel{#1}{{#2}{#3}}}
\AtEndDocument{\ifx\hyper@anchor\@undefined
\let\contentsline\oldcontentsline
\let\newlabel\oldnewlabel
\fi}
\fi}
\global\let\hyper@last\relax 
\gdef\HyperFirstAtBeginDocument#1{#1}
\providecommand\HyField@AuxAddToFields[1]{}
\providecommand\HyField@AuxAddToCoFields[2]{}
\@writefile{toc}{\contentsline {chapter}{\numberline {1}Fittrack Weight Detection Module}{1}{chapter.1}}
\@writefile{lof}{\addvspace {10\p@ }}
\@writefile{lot}{\addvspace {10\p@ }}
\newlabel{index}{{1}{1}{Fittrack Weight Detection Module}{chapter.1}{}}
\@writefile{toc}{\contentsline {chapter}{\numberline {2}Communication}{3}{chapter.2}}
\@writefile{lof}{\addvspace {10\p@ }}
\@writefile{lot}{\addvspace {10\p@ }}
\newlabel{Communication}{{2}{3}{Communication}{chapter.2}{}}
\@writefile{toc}{\contentsline {chapter}{\numberline {3}State-\/\discretionary {\unhbox \voidb@x \hbox {\relax \fontsize  {7}{8}\selectfont  $\leftarrow \joinrel  \rhook $}}{}{}Machines}{7}{chapter.3}}
\@writefile{lof}{\addvspace {10\p@ }}
\@writefile{lot}{\addvspace {10\p@ }}
\newlabel{State-Machines}{{3}{7}{State-\/\+Machines}{chapter.3}{}}
\@writefile{toc}{\contentsline {chapter}{\numberline {4}Module Index}{11}{chapter.4}}
\@writefile{lof}{\addvspace {10\p@ }}
\@writefile{lot}{\addvspace {10\p@ }}
\@writefile{toc}{\contentsline {section}{\numberline {4.1}Modules}{11}{section.4.1}}
\@writefile{toc}{\contentsline {chapter}{\numberline {5}Data Structure Index}{13}{chapter.5}}
\@writefile{lof}{\addvspace {10\p@ }}
\@writefile{lot}{\addvspace {10\p@ }}
\@writefile{toc}{\contentsline {section}{\numberline {5.1}Data Structures}{13}{section.5.1}}
\@writefile{toc}{\contentsline {chapter}{\numberline {6}File Index}{15}{chapter.6}}
\@writefile{lof}{\addvspace {10\p@ }}
\@writefile{lot}{\addvspace {10\p@ }}
\@writefile{toc}{\contentsline {section}{\numberline {6.1}File List}{15}{section.6.1}}
\@writefile{toc}{\contentsline {chapter}{\numberline {7}Module Documentation}{17}{chapter.7}}
\@writefile{lof}{\addvspace {10\p@ }}
\@writefile{lot}{\addvspace {10\p@ }}
\@writefile{toc}{\contentsline {section}{\numberline {7.1}C\discretionary {\unhbox \voidb@x \hbox {\relax \fontsize  {7}{8}\selectfont  $\leftarrow \joinrel  \rhook $}}{}{}M\discretionary {\unhbox \voidb@x \hbox {\relax \fontsize  {7}{8}\selectfont  $\leftarrow \joinrel  \rhook $}}{}{}S\discretionary {\unhbox \voidb@x \hbox {\relax \fontsize  {7}{8}\selectfont  $\leftarrow \joinrel  \rhook $}}{}{}I\discretionary {\unhbox \voidb@x \hbox {\relax \fontsize  {7}{8}\selectfont  $\leftarrow \joinrel  \rhook $}}{}{}S}{17}{section.7.1}}
\newlabel{group__CMSIS}{{7.1}{17}{C\+M\+S\+I\+S}{section.7.1}{}}
\@writefile{toc}{\contentsline {subsection}{\numberline {7.1.1}Detailed Description}{17}{subsection.7.1.1}}
\@input{group__stm32l0xx__system.aux}
\@input{group__STM32L0xx__System__Includes.aux}
\@input{group__STM32L0xx__System__Exported__types.aux}
\@input{group__STM32L0xx__System__Exported__Constants.aux}
\@input{group__STM32L0xx__System__Exported__Macros.aux}
\@input{group__STM32L0xx__System__Exported__Functions.aux}
\@input{group__STM32L0xx__System__Private__Includes.aux}
\@input{group__STM32L0xx__System__Private__TypesDefinitions.aux}
\@input{group__STM32L0xx__System__Private__Defines.aux}
\@input{group__STM32L0xx__System__Private__Macros.aux}
\@input{group__STM32L0xx__System__Private__Variables.aux}
\@input{group__STM32L0xx__System__Private__FunctionPrototypes.aux}
\@input{group__STM32L0xx__System__Private__Functions.aux}
\@writefile{toc}{\contentsline {chapter}{\numberline {8}Data Structure Documentation}{35}{chapter.8}}
\@writefile{lof}{\addvspace {10\p@ }}
\@writefile{lot}{\addvspace {10\p@ }}
\@writefile{toc}{\contentsline {section}{\numberline {8.1}G\discretionary {\unhbox \voidb@x \hbox {\relax \fontsize  {7}{8}\selectfont  $\leftarrow \joinrel  \rhook $}}{}{}P\discretionary {\unhbox \voidb@x \hbox {\relax \fontsize  {7}{8}\selectfont  $\leftarrow \joinrel  \rhook $}}{}{}I\discretionary {\unhbox \voidb@x \hbox {\relax \fontsize  {7}{8}\selectfont  $\leftarrow \joinrel  \rhook $}}{}{}O\discretionary {\unhbox \voidb@x \hbox {\relax \fontsize  {7}{8}\selectfont  $\leftarrow \joinrel  \rhook $}}{}{}Instance\discretionary {\unhbox \voidb@x \hbox {\relax \fontsize  {7}{8}\selectfont  $\leftarrow \joinrel  \rhook $}}{}{}\_\discretionary {\unhbox \voidb@x \hbox {\relax \fontsize  {7}{8}\selectfont  $\leftarrow \joinrel  \rhook $}}{}{}s Struct Reference}{35}{section.8.1}}
\newlabel{structGPIOInstance__s}{{8.1}{35}{G\+P\+I\+O\+Instance\+\_\+s Struct Reference}{section.8.1}{}}
\newlabel{structGPIOInstance__s_a54c6070a2baeacc8bc313fb15f473af0}{{8.1}{35}{Data Fields}{section*.21}{}}
\newlabel{structGPIOInstance__s_afe6007e487512e7ca1a066f722207948}{{8.1}{35}{Data Fields}{section*.21}{}}
\newlabel{structGPIOInstance__s_a522ceef5fc75e7b4556d7bfaf2dc1af2}{{8.1}{35}{Data Fields}{section*.21}{}}
\newlabel{structGPIOInstance__s_a33fb015cc136e93640423fe724d14177}{{8.1}{35}{Data Fields}{section*.21}{}}
\newlabel{structGPIOInstance__s_a7932939d4c527d961b4f9dd75ef164a9}{{8.1}{35}{Data Fields}{section*.21}{}}
\newlabel{structGPIOInstance__s_a944734d11ef162cad82d2bbc17cdce68}{{8.1}{35}{Data Fields}{section*.21}{}}
\newlabel{structGPIOInstance__s_aaaf0db3d2adb6c7103f627c1c87de705}{{8.1}{35}{Data Fields}{section*.21}{}}
\@writefile{toc}{\contentsline {subsection}{\numberline {8.1.1}Detailed Description}{35}{subsection.8.1.1}}
\@writefile{toc}{\contentsline {subsection}{\numberline {8.1.2}Field Documentation}{35}{subsection.8.1.2}}
\@writefile{toc}{\contentsline {subsubsection}{\numberline {8.1.2.1}G\discretionary {\unhbox \voidb@x \hbox {\relax \fontsize  {7}{8}\selectfont  $\leftarrow \joinrel  \rhook $}}{}{}P\discretionary {\unhbox \voidb@x \hbox {\relax \fontsize  {7}{8}\selectfont  $\leftarrow \joinrel  \rhook $}}{}{}I\discretionary {\unhbox \voidb@x \hbox {\relax \fontsize  {7}{8}\selectfont  $\leftarrow \joinrel  \rhook $}}{}{}O\discretionary {\unhbox \voidb@x \hbox {\relax \fontsize  {7}{8}\selectfont  $\leftarrow \joinrel  \rhook $}}{}{}X\discretionary {\unhbox \voidb@x \hbox {\relax \fontsize  {7}{8}\selectfont  $\leftarrow \joinrel  \rhook $}}{}{}\_\discretionary {\unhbox \voidb@x \hbox {\relax \fontsize  {7}{8}\selectfont  $\leftarrow \joinrel  \rhook $}}{}{}\discretionary {\unhbox \voidb@x \hbox {\relax \fontsize  {7}{8}\selectfont  $\leftarrow \joinrel  \rhook $}}{}{}Alternative\discretionary {\unhbox \voidb@x \hbox {\relax \fontsize  {7}{8}\selectfont  $\leftarrow \joinrel  \rhook $}}{}{}Function}{35}{subsubsection.8.1.2.1}}
\newlabel{structGPIOInstance__s_a0191b4f5200120529db7680bddc766d3}{{8.1.2.1}{35}{G\+P\+I\+O\+X\+\_\+\+Alternative\+Function}{subsubsection.8.1.2.1}{}}
\@writefile{toc}{\contentsline {section}{\numberline {8.2}measured\discretionary {\unhbox \voidb@x \hbox {\relax \fontsize  {7}{8}\selectfont  $\leftarrow \joinrel  \rhook $}}{}{}\_\discretionary {\unhbox \voidb@x \hbox {\relax \fontsize  {7}{8}\selectfont  $\leftarrow \joinrel  \rhook $}}{}{}data\discretionary {\unhbox \voidb@x \hbox {\relax \fontsize  {7}{8}\selectfont  $\leftarrow \joinrel  \rhook $}}{}{}\_\discretionary {\unhbox \voidb@x \hbox {\relax \fontsize  {7}{8}\selectfont  $\leftarrow \joinrel  \rhook $}}{}{}t Struct Reference}{36}{section.8.2}}
\newlabel{structmeasured__data__t}{{8.2}{36}{measured\+\_\+data\+\_\+t Struct Reference}{section.8.2}{}}
\newlabel{structmeasured__data__t_a9441db31baa51ef3da29c990d74845b3}{{8.2}{36}{Data Fields}{section*.22}{}}
\newlabel{structmeasured__data__t_aab8485118dacc2c2dacc6b97f1c2c274}{{8.2}{36}{Data Fields}{section*.22}{}}
\@writefile{toc}{\contentsline {chapter}{\numberline {9}File Documentation}{37}{chapter.9}}
\@writefile{lof}{\addvspace {10\p@ }}
\@writefile{lot}{\addvspace {10\p@ }}
\@writefile{toc}{\contentsline {section}{\numberline {9.1}A\discretionary {\unhbox \voidb@x \hbox {\relax \fontsize  {7}{8}\selectfont  $\leftarrow \joinrel  \rhook $}}{}{}P\discretionary {\unhbox \voidb@x \hbox {\relax \fontsize  {7}{8}\selectfont  $\leftarrow \joinrel  \rhook $}}{}{}I/inc/\discretionary {\unhbox \voidb@x \hbox {\relax \fontsize  {7}{8}\selectfont  $\leftarrow \joinrel  \rhook $}}{}{}A\discretionary {\unhbox \voidb@x \hbox {\relax \fontsize  {7}{8}\selectfont  $\leftarrow \joinrel  \rhook $}}{}{}D\discretionary {\unhbox \voidb@x \hbox {\relax \fontsize  {7}{8}\selectfont  $\leftarrow \joinrel  \rhook $}}{}{}C.h File Reference}{37}{section.9.1}}
\newlabel{ADC_8h}{{9.1}{37}{A\+P\+I/inc/\+A\+D\+C.h File Reference}{section.9.1}{}}
\gdef \PWST@ix{1}
\gdef \PWST@x{1}
\newlabel{ADC_8h_ac128cd0e932fff228d584776bf89c3ed}{{9.1}{38}{Functions}{section*.23}{}}
\@writefile{toc}{\contentsline {subsection}{\numberline {9.1.1}Detailed Description}{38}{subsection.9.1.1}}
\@writefile{toc}{\contentsline {subsection}{\numberline {9.1.2}Function Documentation}{38}{subsection.9.1.2}}
\@writefile{toc}{\contentsline {subsubsection}{\numberline {9.1.2.1}A\discretionary {\unhbox \voidb@x \hbox {\relax \fontsize  {7}{8}\selectfont  $\leftarrow \joinrel  \rhook $}}{}{}D\discretionary {\unhbox \voidb@x \hbox {\relax \fontsize  {7}{8}\selectfont  $\leftarrow \joinrel  \rhook $}}{}{}C\discretionary {\unhbox \voidb@x \hbox {\relax \fontsize  {7}{8}\selectfont  $\leftarrow \joinrel  \rhook $}}{}{}\_\discretionary {\unhbox \voidb@x \hbox {\relax \fontsize  {7}{8}\selectfont  $\leftarrow \joinrel  \rhook $}}{}{}\discretionary {\unhbox \voidb@x \hbox {\relax \fontsize  {7}{8}\selectfont  $\leftarrow \joinrel  \rhook $}}{}{}Get\discretionary {\unhbox \voidb@x \hbox {\relax \fontsize  {7}{8}\selectfont  $\leftarrow \joinrel  \rhook $}}{}{}Voltage}{38}{subsubsection.9.1.2.1}}
\newlabel{ADC_8h_a8136e67cca9eae124cf49bca2378dcf3}{{9.1.2.1}{38}{A\+D\+C\+\_\+\+Get\+Voltage}{subsubsection.9.1.2.1}{}}
\@writefile{toc}{\contentsline {subsubsection}{\numberline {9.1.2.2}A\discretionary {\unhbox \voidb@x \hbox {\relax \fontsize  {7}{8}\selectfont  $\leftarrow \joinrel  \rhook $}}{}{}D\discretionary {\unhbox \voidb@x \hbox {\relax \fontsize  {7}{8}\selectfont  $\leftarrow \joinrel  \rhook $}}{}{}C\discretionary {\unhbox \voidb@x \hbox {\relax \fontsize  {7}{8}\selectfont  $\leftarrow \joinrel  \rhook $}}{}{}\_\discretionary {\unhbox \voidb@x \hbox {\relax \fontsize  {7}{8}\selectfont  $\leftarrow \joinrel  \rhook $}}{}{}\discretionary {\unhbox \voidb@x \hbox {\relax \fontsize  {7}{8}\selectfont  $\leftarrow \joinrel  \rhook $}}{}{}Init}{38}{subsubsection.9.1.2.2}}
\newlabel{ADC_8h_a5137b551f1b83b0f4d8df7d071a3d3a6}{{9.1.2.2}{38}{A\+D\+C\+\_\+\+Init}{subsubsection.9.1.2.2}{}}
\@writefile{toc}{\contentsline {section}{\numberline {9.2}A\discretionary {\unhbox \voidb@x \hbox {\relax \fontsize  {7}{8}\selectfont  $\leftarrow \joinrel  \rhook $}}{}{}P\discretionary {\unhbox \voidb@x \hbox {\relax \fontsize  {7}{8}\selectfont  $\leftarrow \joinrel  \rhook $}}{}{}I/inc/\discretionary {\unhbox \voidb@x \hbox {\relax \fontsize  {7}{8}\selectfont  $\leftarrow \joinrel  \rhook $}}{}{}G\discretionary {\unhbox \voidb@x \hbox {\relax \fontsize  {7}{8}\selectfont  $\leftarrow \joinrel  \rhook $}}{}{}P\discretionary {\unhbox \voidb@x \hbox {\relax \fontsize  {7}{8}\selectfont  $\leftarrow \joinrel  \rhook $}}{}{}I\discretionary {\unhbox \voidb@x \hbox {\relax \fontsize  {7}{8}\selectfont  $\leftarrow \joinrel  \rhook $}}{}{}O.h File Reference}{38}{section.9.2}}
\newlabel{GPIO_8h}{{9.2}{38}{A\+P\+I/inc/\+G\+P\+I\+O.h File Reference}{section.9.2}{}}
\newlabel{GPIO_8h_a03fa898306cc8d6b228bcd458bbd90f1}{{9.2}{39}{Typedefs}{section*.25}{}}
\newlabel{GPIO_8h_a6affa5269f9de209c1b257a381a074fb}{{9.2}{39}{Enumerations}{section*.26}{}}
\newlabel{GPIO_8h_a43529df01e96a121b539143497deeb7b}{{9.2}{39}{Enumerations}{section*.26}{}}
\newlabel{GPIO_8h_acbe70da23cdb140ac415014d1417e079}{{9.2}{39}{Enumerations}{section*.26}{}}
\newlabel{GPIO_8h_acd9a2420c1f8a0bbf1205e758144fc11}{{9.2}{39}{Enumerations}{section*.26}{}}
\newlabel{GPIO_8h_a70f54b43315695802f19dde322387cee}{{9.2}{40}{Enumerations}{section*.26}{}}
\newlabel{GPIO_8h_a325a2efca19e3b77bd88cb7d6f1891be}{{9.2}{40}{Variables}{section*.28}{}}
\newlabel{GPIO_8h_a0af9f63fd516206bc9c111c77cfeff8a}{{9.2}{40}{Variables}{section*.28}{}}
\newlabel{GPIO_8h_a127e5b731cabe06270969257329ddbf2}{{9.2}{40}{Variables}{section*.28}{}}
\newlabel{GPIO_8h_a7ce20c6bd67c7ea79ff0d5a3d1f62257}{{9.2}{40}{Variables}{section*.28}{}}
\newlabel{GPIO_8h_aec4f22408b689321be8a39936043d4ae}{{9.2}{40}{Variables}{section*.28}{}}
\newlabel{GPIO_8h_a0774f5b0a352da541fae2422d934beba}{{9.2}{40}{Variables}{section*.28}{}}
\newlabel{GPIO_8h_a26f9bb6ffaa5bc301f4cad0381822fcd}{{9.2}{40}{Variables}{section*.28}{}}
\newlabel{GPIO_8h_a9e450a16e7abb8eb9e671728f97be5b9}{{9.2}{40}{Variables}{section*.28}{}}
\newlabel{GPIO_8h_aa18bb55c744ffdd3b37e6a6e0d32f155}{{9.2}{40}{Variables}{section*.28}{}}
\newlabel{GPIO_8h_abb00bd9c52f22ad61214a9186b6bed75}{{9.2}{40}{Variables}{section*.28}{}}
\newlabel{GPIO_8h_a775f5a87ed2d0fe3219d5bab91abc8a0}{{9.2}{40}{Variables}{section*.28}{}}
\newlabel{GPIO_8h_aa6ab84f88f26c64cb9109fbaf6173d1b}{{9.2}{40}{Variables}{section*.28}{}}
\newlabel{GPIO_8h_a8abfae746e3354f874721653e7b2eb74}{{9.2}{40}{Variables}{section*.28}{}}
\newlabel{GPIO_8h_ab376863e0a26a62a1a74b3efc9d83e9a}{{9.2}{40}{Variables}{section*.28}{}}
\newlabel{GPIO_8h_ae23277c4cc5a0a57280f0cb0291bc86b}{{9.2}{40}{Variables}{section*.28}{}}
\newlabel{GPIO_8h_af70761007c8c3908a3579220209836a4}{{9.2}{40}{Variables}{section*.28}{}}
\newlabel{GPIO_8h_afdf9414c856d091251751931c1e309a6}{{9.2}{40}{Variables}{section*.28}{}}
\newlabel{GPIO_8h_a310340bbfdc13b6938cb0d1bc4d8332b}{{9.2}{40}{Variables}{section*.28}{}}
\newlabel{GPIO_8h_ad627d774de7864ccdd353989241f6fa9}{{9.2}{40}{Variables}{section*.28}{}}
\newlabel{GPIO_8h_af8b07ad3aba6dfc1fe0a2c0f093893f4}{{9.2}{40}{Variables}{section*.28}{}}
\newlabel{GPIO_8h_a6c89239fd051bec61acbb6637c2a8642}{{9.2}{40}{Variables}{section*.28}{}}
\newlabel{GPIO_8h_ae11ca85479199a35a87d4ac721ef735f}{{9.2}{40}{Variables}{section*.28}{}}
\newlabel{GPIO_8h_a6e14b71987bbae1fe1b15c60fddf3edc}{{9.2}{40}{Variables}{section*.28}{}}
\newlabel{GPIO_8h_af5c6832994c23dd63b10ae5b1229a28a}{{9.2}{40}{Variables}{section*.28}{}}
\newlabel{GPIO_8h_ae4ddc7b2c03a73b537d8de996c1971a3}{{9.2}{40}{Variables}{section*.28}{}}
\newlabel{GPIO_8h_affe39cce297b078856b67cd2084090fd}{{9.2}{40}{Variables}{section*.28}{}}
\gdef \PWST@xi{1}
\gdef \PWST@xii{1}
\gdef \PWST@xiii{1}
\gdef \PWST@xiv{1}
\@writefile{toc}{\contentsline {subsection}{\numberline {9.2.1}Detailed Description}{41}{subsection.9.2.1}}
\@writefile{toc}{\contentsline {subsection}{\numberline {9.2.2}Function Documentation}{41}{subsection.9.2.2}}
\@writefile{toc}{\contentsline {subsubsection}{\numberline {9.2.2.1}Get\discretionary {\unhbox \voidb@x \hbox {\relax \fontsize  {7}{8}\selectfont  $\leftarrow \joinrel  \rhook $}}{}{}D\discretionary {\unhbox \voidb@x \hbox {\relax \fontsize  {7}{8}\selectfont  $\leftarrow \joinrel  \rhook $}}{}{}I}{41}{subsubsection.9.2.2.1}}
\newlabel{GPIO_8h_a86c036aa80b88e113e5783aa9f06a2b3}{{9.2.2.1}{41}{Get\+D\+I}{subsubsection.9.2.2.1}{}}
\@writefile{toc}{\contentsline {subsubsection}{\numberline {9.2.2.2}G\discretionary {\unhbox \voidb@x \hbox {\relax \fontsize  {7}{8}\selectfont  $\leftarrow \joinrel  \rhook $}}{}{}P\discretionary {\unhbox \voidb@x \hbox {\relax \fontsize  {7}{8}\selectfont  $\leftarrow \joinrel  \rhook $}}{}{}I\discretionary {\unhbox \voidb@x \hbox {\relax \fontsize  {7}{8}\selectfont  $\leftarrow \joinrel  \rhook $}}{}{}O\discretionary {\unhbox \voidb@x \hbox {\relax \fontsize  {7}{8}\selectfont  $\leftarrow \joinrel  \rhook $}}{}{}\_\discretionary {\unhbox \voidb@x \hbox {\relax \fontsize  {7}{8}\selectfont  $\leftarrow \joinrel  \rhook $}}{}{}\discretionary {\unhbox \voidb@x \hbox {\relax \fontsize  {7}{8}\selectfont  $\leftarrow \joinrel  \rhook $}}{}{}De\discretionary {\unhbox \voidb@x \hbox {\relax \fontsize  {7}{8}\selectfont  $\leftarrow \joinrel  \rhook $}}{}{}Init}{41}{subsubsection.9.2.2.2}}
\newlabel{GPIO_8h_a55274c05fa9e816b7d0567799f2adda3}{{9.2.2.2}{41}{G\+P\+I\+O\+\_\+\+De\+Init}{subsubsection.9.2.2.2}{}}
\@writefile{toc}{\contentsline {subsubsection}{\numberline {9.2.2.3}G\discretionary {\unhbox \voidb@x \hbox {\relax \fontsize  {7}{8}\selectfont  $\leftarrow \joinrel  \rhook $}}{}{}P\discretionary {\unhbox \voidb@x \hbox {\relax \fontsize  {7}{8}\selectfont  $\leftarrow \joinrel  \rhook $}}{}{}I\discretionary {\unhbox \voidb@x \hbox {\relax \fontsize  {7}{8}\selectfont  $\leftarrow \joinrel  \rhook $}}{}{}O\discretionary {\unhbox \voidb@x \hbox {\relax \fontsize  {7}{8}\selectfont  $\leftarrow \joinrel  \rhook $}}{}{}\_\discretionary {\unhbox \voidb@x \hbox {\relax \fontsize  {7}{8}\selectfont  $\leftarrow \joinrel  \rhook $}}{}{}\discretionary {\unhbox \voidb@x \hbox {\relax \fontsize  {7}{8}\selectfont  $\leftarrow \joinrel  \rhook $}}{}{}Init}{41}{subsubsection.9.2.2.3}}
\newlabel{GPIO_8h_a885c93e9837729510e85129e4ac82a86}{{9.2.2.3}{41}{G\+P\+I\+O\+\_\+\+Init}{subsubsection.9.2.2.3}{}}
\@writefile{toc}{\contentsline {subsubsection}{\numberline {9.2.2.4}Set\discretionary {\unhbox \voidb@x \hbox {\relax \fontsize  {7}{8}\selectfont  $\leftarrow \joinrel  \rhook $}}{}{}D\discretionary {\unhbox \voidb@x \hbox {\relax \fontsize  {7}{8}\selectfont  $\leftarrow \joinrel  \rhook $}}{}{}O}{41}{subsubsection.9.2.2.4}}
\newlabel{GPIO_8h_a183d1dc00b66e06267fc01ea2d9395e4}{{9.2.2.4}{41}{Set\+D\+O}{subsubsection.9.2.2.4}{}}
\gdef \PWST@xv{2}
\@writefile{toc}{\contentsline {section}{\numberline {9.3}A\discretionary {\unhbox \voidb@x \hbox {\relax \fontsize  {7}{8}\selectfont  $\leftarrow \joinrel  \rhook $}}{}{}P\discretionary {\unhbox \voidb@x \hbox {\relax \fontsize  {7}{8}\selectfont  $\leftarrow \joinrel  \rhook $}}{}{}I/inc/\discretionary {\unhbox \voidb@x \hbox {\relax \fontsize  {7}{8}\selectfont  $\leftarrow \joinrel  \rhook $}}{}{}L\discretionary {\unhbox \voidb@x \hbox {\relax \fontsize  {7}{8}\selectfont  $\leftarrow \joinrel  \rhook $}}{}{}P\discretionary {\unhbox \voidb@x \hbox {\relax \fontsize  {7}{8}\selectfont  $\leftarrow \joinrel  \rhook $}}{}{}T\discretionary {\unhbox \voidb@x \hbox {\relax \fontsize  {7}{8}\selectfont  $\leftarrow \joinrel  \rhook $}}{}{}I\discretionary {\unhbox \voidb@x \hbox {\relax \fontsize  {7}{8}\selectfont  $\leftarrow \joinrel  \rhook $}}{}{}M\discretionary {\unhbox \voidb@x \hbox {\relax \fontsize  {7}{8}\selectfont  $\leftarrow \joinrel  \rhook $}}{}{}E\discretionary {\unhbox \voidb@x \hbox {\relax \fontsize  {7}{8}\selectfont  $\leftarrow \joinrel  \rhook $}}{}{}R.h File Reference}{42}{section.9.3}}
\newlabel{LPTIMER_8h}{{9.3}{42}{A\+P\+I/inc/\+L\+P\+T\+I\+M\+E\+R.h File Reference}{section.9.3}{}}
\newlabel{LPTIMER_8h_a29af84c81e9838ea466fd0aa2e180748}{{9.3}{42}{Functions}{section*.29}{}}
\@writefile{toc}{\contentsline {subsection}{\numberline {9.3.1}Detailed Description}{42}{subsection.9.3.1}}
\@writefile{toc}{\contentsline {subsection}{\numberline {9.3.2}Function Documentation}{42}{subsection.9.3.2}}
\@writefile{toc}{\contentsline {subsubsection}{\numberline {9.3.2.1}L\discretionary {\unhbox \voidb@x \hbox {\relax \fontsize  {7}{8}\selectfont  $\leftarrow \joinrel  \rhook $}}{}{}P\discretionary {\unhbox \voidb@x \hbox {\relax \fontsize  {7}{8}\selectfont  $\leftarrow \joinrel  \rhook $}}{}{}T\discretionary {\unhbox \voidb@x \hbox {\relax \fontsize  {7}{8}\selectfont  $\leftarrow \joinrel  \rhook $}}{}{}I\discretionary {\unhbox \voidb@x \hbox {\relax \fontsize  {7}{8}\selectfont  $\leftarrow \joinrel  \rhook $}}{}{}M\discretionary {\unhbox \voidb@x \hbox {\relax \fontsize  {7}{8}\selectfont  $\leftarrow \joinrel  \rhook $}}{}{}E\discretionary {\unhbox \voidb@x \hbox {\relax \fontsize  {7}{8}\selectfont  $\leftarrow \joinrel  \rhook $}}{}{}R\discretionary {\unhbox \voidb@x \hbox {\relax \fontsize  {7}{8}\selectfont  $\leftarrow \joinrel  \rhook $}}{}{}\_\discretionary {\unhbox \voidb@x \hbox {\relax \fontsize  {7}{8}\selectfont  $\leftarrow \joinrel  \rhook $}}{}{}\discretionary {\unhbox \voidb@x \hbox {\relax \fontsize  {7}{8}\selectfont  $\leftarrow \joinrel  \rhook $}}{}{}Init}{42}{subsubsection.9.3.2.1}}
\newlabel{LPTIMER_8h_a2d4f5708d50ff6ccc3c313ed3321800d}{{9.3.2.1}{42}{L\+P\+T\+I\+M\+E\+R\+\_\+\+Init}{subsubsection.9.3.2.1}{}}
\gdef \PWST@xvi{2}
\@writefile{toc}{\contentsline {section}{\numberline {9.4}A\discretionary {\unhbox \voidb@x \hbox {\relax \fontsize  {7}{8}\selectfont  $\leftarrow \joinrel  \rhook $}}{}{}P\discretionary {\unhbox \voidb@x \hbox {\relax \fontsize  {7}{8}\selectfont  $\leftarrow \joinrel  \rhook $}}{}{}I/inc/\discretionary {\unhbox \voidb@x \hbox {\relax \fontsize  {7}{8}\selectfont  $\leftarrow \joinrel  \rhook $}}{}{}L\discretionary {\unhbox \voidb@x \hbox {\relax \fontsize  {7}{8}\selectfont  $\leftarrow \joinrel  \rhook $}}{}{}P\discretionary {\unhbox \voidb@x \hbox {\relax \fontsize  {7}{8}\selectfont  $\leftarrow \joinrel  \rhook $}}{}{}U\discretionary {\unhbox \voidb@x \hbox {\relax \fontsize  {7}{8}\selectfont  $\leftarrow \joinrel  \rhook $}}{}{}A\discretionary {\unhbox \voidb@x \hbox {\relax \fontsize  {7}{8}\selectfont  $\leftarrow \joinrel  \rhook $}}{}{}R\discretionary {\unhbox \voidb@x \hbox {\relax \fontsize  {7}{8}\selectfont  $\leftarrow \joinrel  \rhook $}}{}{}T.h File Reference}{43}{section.9.4}}
\newlabel{LPUART_8h}{{9.4}{43}{A\+P\+I/inc/\+L\+P\+U\+A\+R\+T.h File Reference}{section.9.4}{}}
\@writefile{toc}{\contentsline {subsection}{\numberline {9.4.1}Detailed Description}{43}{subsection.9.4.1}}
\gdef \PWST@xvii{1}
\gdef \PWST@xviii{1}
\@writefile{toc}{\contentsline {subsection}{\numberline {9.4.2}Function Documentation}{44}{subsection.9.4.2}}
\@writefile{toc}{\contentsline {subsubsection}{\numberline {9.4.2.1}L\discretionary {\unhbox \voidb@x \hbox {\relax \fontsize  {7}{8}\selectfont  $\leftarrow \joinrel  \rhook $}}{}{}P\discretionary {\unhbox \voidb@x \hbox {\relax \fontsize  {7}{8}\selectfont  $\leftarrow \joinrel  \rhook $}}{}{}U\discretionary {\unhbox \voidb@x \hbox {\relax \fontsize  {7}{8}\selectfont  $\leftarrow \joinrel  \rhook $}}{}{}A\discretionary {\unhbox \voidb@x \hbox {\relax \fontsize  {7}{8}\selectfont  $\leftarrow \joinrel  \rhook $}}{}{}R\discretionary {\unhbox \voidb@x \hbox {\relax \fontsize  {7}{8}\selectfont  $\leftarrow \joinrel  \rhook $}}{}{}T\discretionary {\unhbox \voidb@x \hbox {\relax \fontsize  {7}{8}\selectfont  $\leftarrow \joinrel  \rhook $}}{}{}\_\discretionary {\unhbox \voidb@x \hbox {\relax \fontsize  {7}{8}\selectfont  $\leftarrow \joinrel  \rhook $}}{}{}\discretionary {\unhbox \voidb@x \hbox {\relax \fontsize  {7}{8}\selectfont  $\leftarrow \joinrel  \rhook $}}{}{}Init}{44}{subsubsection.9.4.2.1}}
\newlabel{LPUART_8h_a01a78e16c0677cbfc83bab0e604f886b}{{9.4.2.1}{44}{L\+P\+U\+A\+R\+T\+\_\+\+Init}{subsubsection.9.4.2.1}{}}
\@writefile{toc}{\contentsline {subsubsection}{\numberline {9.4.2.2}L\discretionary {\unhbox \voidb@x \hbox {\relax \fontsize  {7}{8}\selectfont  $\leftarrow \joinrel  \rhook $}}{}{}P\discretionary {\unhbox \voidb@x \hbox {\relax \fontsize  {7}{8}\selectfont  $\leftarrow \joinrel  \rhook $}}{}{}U\discretionary {\unhbox \voidb@x \hbox {\relax \fontsize  {7}{8}\selectfont  $\leftarrow \joinrel  \rhook $}}{}{}A\discretionary {\unhbox \voidb@x \hbox {\relax \fontsize  {7}{8}\selectfont  $\leftarrow \joinrel  \rhook $}}{}{}R\discretionary {\unhbox \voidb@x \hbox {\relax \fontsize  {7}{8}\selectfont  $\leftarrow \joinrel  \rhook $}}{}{}T\discretionary {\unhbox \voidb@x \hbox {\relax \fontsize  {7}{8}\selectfont  $\leftarrow \joinrel  \rhook $}}{}{}\_\discretionary {\unhbox \voidb@x \hbox {\relax \fontsize  {7}{8}\selectfont  $\leftarrow \joinrel  \rhook $}}{}{}\discretionary {\unhbox \voidb@x \hbox {\relax \fontsize  {7}{8}\selectfont  $\leftarrow \joinrel  \rhook $}}{}{}Send}{44}{subsubsection.9.4.2.2}}
\newlabel{LPUART_8h_ad4eaf405476d9a39f4024b41dedf91bb}{{9.4.2.2}{44}{L\+P\+U\+A\+R\+T\+\_\+\+Send}{subsubsection.9.4.2.2}{}}
\@writefile{toc}{\contentsline {section}{\numberline {9.5}A\discretionary {\unhbox \voidb@x \hbox {\relax \fontsize  {7}{8}\selectfont  $\leftarrow \joinrel  \rhook $}}{}{}P\discretionary {\unhbox \voidb@x \hbox {\relax \fontsize  {7}{8}\selectfont  $\leftarrow \joinrel  \rhook $}}{}{}I/inc/\discretionary {\unhbox \voidb@x \hbox {\relax \fontsize  {7}{8}\selectfont  $\leftarrow \joinrel  \rhook $}}{}{}U\discretionary {\unhbox \voidb@x \hbox {\relax \fontsize  {7}{8}\selectfont  $\leftarrow \joinrel  \rhook $}}{}{}S\discretionary {\unhbox \voidb@x \hbox {\relax \fontsize  {7}{8}\selectfont  $\leftarrow \joinrel  \rhook $}}{}{}A\discretionary {\unhbox \voidb@x \hbox {\relax \fontsize  {7}{8}\selectfont  $\leftarrow \joinrel  \rhook $}}{}{}R\discretionary {\unhbox \voidb@x \hbox {\relax \fontsize  {7}{8}\selectfont  $\leftarrow \joinrel  \rhook $}}{}{}T.h File Reference}{44}{section.9.5}}
\newlabel{USART_8h}{{9.5}{44}{A\+P\+I/inc/\+U\+S\+A\+R\+T.h File Reference}{section.9.5}{}}
\@writefile{toc}{\contentsline {subsection}{\numberline {9.5.1}Detailed Description}{45}{subsection.9.5.1}}
\gdef \PWST@xix{1}
\gdef \PWST@xx{1}
\@writefile{toc}{\contentsline {subsection}{\numberline {9.5.2}Function Documentation}{46}{subsection.9.5.2}}
\@writefile{toc}{\contentsline {subsubsection}{\numberline {9.5.2.1}U\discretionary {\unhbox \voidb@x \hbox {\relax \fontsize  {7}{8}\selectfont  $\leftarrow \joinrel  \rhook $}}{}{}S\discretionary {\unhbox \voidb@x \hbox {\relax \fontsize  {7}{8}\selectfont  $\leftarrow \joinrel  \rhook $}}{}{}A\discretionary {\unhbox \voidb@x \hbox {\relax \fontsize  {7}{8}\selectfont  $\leftarrow \joinrel  \rhook $}}{}{}R\discretionary {\unhbox \voidb@x \hbox {\relax \fontsize  {7}{8}\selectfont  $\leftarrow \joinrel  \rhook $}}{}{}T\discretionary {\unhbox \voidb@x \hbox {\relax \fontsize  {7}{8}\selectfont  $\leftarrow \joinrel  \rhook $}}{}{}\_\discretionary {\unhbox \voidb@x \hbox {\relax \fontsize  {7}{8}\selectfont  $\leftarrow \joinrel  \rhook $}}{}{}\discretionary {\unhbox \voidb@x \hbox {\relax \fontsize  {7}{8}\selectfont  $\leftarrow \joinrel  \rhook $}}{}{}Init}{46}{subsubsection.9.5.2.1}}
\newlabel{USART_8h_a28717534874ca2be99d5b3c478d2ab3c}{{9.5.2.1}{46}{U\+S\+A\+R\+T\+\_\+\+Init}{subsubsection.9.5.2.1}{}}
\@writefile{toc}{\contentsline {subsubsection}{\numberline {9.5.2.2}U\discretionary {\unhbox \voidb@x \hbox {\relax \fontsize  {7}{8}\selectfont  $\leftarrow \joinrel  \rhook $}}{}{}S\discretionary {\unhbox \voidb@x \hbox {\relax \fontsize  {7}{8}\selectfont  $\leftarrow \joinrel  \rhook $}}{}{}A\discretionary {\unhbox \voidb@x \hbox {\relax \fontsize  {7}{8}\selectfont  $\leftarrow \joinrel  \rhook $}}{}{}R\discretionary {\unhbox \voidb@x \hbox {\relax \fontsize  {7}{8}\selectfont  $\leftarrow \joinrel  \rhook $}}{}{}T\discretionary {\unhbox \voidb@x \hbox {\relax \fontsize  {7}{8}\selectfont  $\leftarrow \joinrel  \rhook $}}{}{}\_\discretionary {\unhbox \voidb@x \hbox {\relax \fontsize  {7}{8}\selectfont  $\leftarrow \joinrel  \rhook $}}{}{}\discretionary {\unhbox \voidb@x \hbox {\relax \fontsize  {7}{8}\selectfont  $\leftarrow \joinrel  \rhook $}}{}{}Send}{46}{subsubsection.9.5.2.2}}
\newlabel{USART_8h_a4190eb49c715c132cc1ff0968347eb07}{{9.5.2.2}{46}{U\+S\+A\+R\+T\+\_\+\+Send}{subsubsection.9.5.2.2}{}}
\@writefile{toc}{\contentsline {section}{\numberline {9.6}A\discretionary {\unhbox \voidb@x \hbox {\relax \fontsize  {7}{8}\selectfont  $\leftarrow \joinrel  \rhook $}}{}{}P\discretionary {\unhbox \voidb@x \hbox {\relax \fontsize  {7}{8}\selectfont  $\leftarrow \joinrel  \rhook $}}{}{}I/inc/\discretionary {\unhbox \voidb@x \hbox {\relax \fontsize  {7}{8}\selectfont  $\leftarrow \joinrel  \rhook $}}{}{}W\discretionary {\unhbox \voidb@x \hbox {\relax \fontsize  {7}{8}\selectfont  $\leftarrow \joinrel  \rhook $}}{}{}W\discretionary {\unhbox \voidb@x \hbox {\relax \fontsize  {7}{8}\selectfont  $\leftarrow \joinrel  \rhook $}}{}{}D\discretionary {\unhbox \voidb@x \hbox {\relax \fontsize  {7}{8}\selectfont  $\leftarrow \joinrel  \rhook $}}{}{}G.h File Reference}{46}{section.9.6}}
\newlabel{WWDG_8h}{{9.6}{46}{A\+P\+I/inc/\+W\+W\+D\+G.h File Reference}{section.9.6}{}}
\newlabel{WWDG_8h_a1532f0a4303fd72246e7ee02da141c4a}{{9.6}{46}{Functions}{section*.32}{}}
\gdef \PWST@xxi{1}
\newlabel{WWDG_8h_a36afd91f097b346e0278a5aa9c15b511}{{9.6}{47}{Functions}{section*.32}{}}
\newlabel{WWDG_8h_aa564ca1c548c7e41e902d9561660eaac}{{9.6}{47}{Functions}{section*.32}{}}
\newlabel{WWDG_8h_a049e27b7d5d0d36a331e6ef5e78e1fc5}{{9.6}{47}{Functions}{section*.32}{}}
\@writefile{toc}{\contentsline {subsection}{\numberline {9.6.1}Detailed Description}{47}{subsection.9.6.1}}
\@writefile{toc}{\contentsline {subsection}{\numberline {9.6.2}Function Documentation}{47}{subsection.9.6.2}}
\@writefile{toc}{\contentsline {subsubsection}{\numberline {9.6.2.1}W\discretionary {\unhbox \voidb@x \hbox {\relax \fontsize  {7}{8}\selectfont  $\leftarrow \joinrel  \rhook $}}{}{}W\discretionary {\unhbox \voidb@x \hbox {\relax \fontsize  {7}{8}\selectfont  $\leftarrow \joinrel  \rhook $}}{}{}D\discretionary {\unhbox \voidb@x \hbox {\relax \fontsize  {7}{8}\selectfont  $\leftarrow \joinrel  \rhook $}}{}{}G\discretionary {\unhbox \voidb@x \hbox {\relax \fontsize  {7}{8}\selectfont  $\leftarrow \joinrel  \rhook $}}{}{}\_\discretionary {\unhbox \voidb@x \hbox {\relax \fontsize  {7}{8}\selectfont  $\leftarrow \joinrel  \rhook $}}{}{}\discretionary {\unhbox \voidb@x \hbox {\relax \fontsize  {7}{8}\selectfont  $\leftarrow \joinrel  \rhook $}}{}{}Init}{47}{subsubsection.9.6.2.1}}
\newlabel{WWDG_8h_a4665ae3093446dcef1d6c703528e21b0}{{9.6.2.1}{47}{W\+W\+D\+G\+\_\+\+Init}{subsubsection.9.6.2.1}{}}
\@writefile{toc}{\contentsline {section}{\numberline {9.7}A\discretionary {\unhbox \voidb@x \hbox {\relax \fontsize  {7}{8}\selectfont  $\leftarrow \joinrel  \rhook $}}{}{}P\discretionary {\unhbox \voidb@x \hbox {\relax \fontsize  {7}{8}\selectfont  $\leftarrow \joinrel  \rhook $}}{}{}I/src/\discretionary {\unhbox \voidb@x \hbox {\relax \fontsize  {7}{8}\selectfont  $\leftarrow \joinrel  \rhook $}}{}{}A\discretionary {\unhbox \voidb@x \hbox {\relax \fontsize  {7}{8}\selectfont  $\leftarrow \joinrel  \rhook $}}{}{}D\discretionary {\unhbox \voidb@x \hbox {\relax \fontsize  {7}{8}\selectfont  $\leftarrow \joinrel  \rhook $}}{}{}C.c File Reference}{47}{section.9.7}}
\newlabel{ADC_8c}{{9.7}{47}{A\+P\+I/src/\+A\+D\+C.c File Reference}{section.9.7}{}}
\gdef \PWST@xxii{1}
\newlabel{ADC_8c_a2d52976aedaedf74a90019a689170620}{{9.7}{48}{Macros}{section*.33}{}}
\newlabel{ADC_8c_a7eb6744d5738bf35b1cb86b44cdc99ad}{{9.7}{48}{Functions}{section*.34}{}}
\newlabel{ADC_8c_a4267de5bc303060b4dfd2997c078c602}{{9.7}{48}{Functions}{section*.34}{}}
\newlabel{ADC_8c_aa256af5b8a253bdc3f6aacaa29830e64}{{9.7}{48}{Functions}{section*.34}{}}
\newlabel{ADC_8c_af25852d7314929ee34e273d856cf15de}{{9.7}{48}{Variables}{section*.35}{}}
\@writefile{toc}{\contentsline {subsection}{\numberline {9.7.1}Detailed Description}{48}{subsection.9.7.1}}
\@writefile{toc}{\contentsline {subsection}{\numberline {9.7.2}Function Documentation}{48}{subsection.9.7.2}}
\@writefile{toc}{\contentsline {subsubsection}{\numberline {9.7.2.1}A\discretionary {\unhbox \voidb@x \hbox {\relax \fontsize  {7}{8}\selectfont  $\leftarrow \joinrel  \rhook $}}{}{}D\discretionary {\unhbox \voidb@x \hbox {\relax \fontsize  {7}{8}\selectfont  $\leftarrow \joinrel  \rhook $}}{}{}C\discretionary {\unhbox \voidb@x \hbox {\relax \fontsize  {7}{8}\selectfont  $\leftarrow \joinrel  \rhook $}}{}{}\_\discretionary {\unhbox \voidb@x \hbox {\relax \fontsize  {7}{8}\selectfont  $\leftarrow \joinrel  \rhook $}}{}{}\discretionary {\unhbox \voidb@x \hbox {\relax \fontsize  {7}{8}\selectfont  $\leftarrow \joinrel  \rhook $}}{}{}Get\discretionary {\unhbox \voidb@x \hbox {\relax \fontsize  {7}{8}\selectfont  $\leftarrow \joinrel  \rhook $}}{}{}Voltage}{48}{subsubsection.9.7.2.1}}
\newlabel{ADC_8c_a8136e67cca9eae124cf49bca2378dcf3}{{9.7.2.1}{48}{A\+D\+C\+\_\+\+Get\+Voltage}{subsubsection.9.7.2.1}{}}
\@writefile{toc}{\contentsline {subsubsection}{\numberline {9.7.2.2}A\discretionary {\unhbox \voidb@x \hbox {\relax \fontsize  {7}{8}\selectfont  $\leftarrow \joinrel  \rhook $}}{}{}D\discretionary {\unhbox \voidb@x \hbox {\relax \fontsize  {7}{8}\selectfont  $\leftarrow \joinrel  \rhook $}}{}{}C\discretionary {\unhbox \voidb@x \hbox {\relax \fontsize  {7}{8}\selectfont  $\leftarrow \joinrel  \rhook $}}{}{}\_\discretionary {\unhbox \voidb@x \hbox {\relax \fontsize  {7}{8}\selectfont  $\leftarrow \joinrel  \rhook $}}{}{}\discretionary {\unhbox \voidb@x \hbox {\relax \fontsize  {7}{8}\selectfont  $\leftarrow \joinrel  \rhook $}}{}{}Init}{48}{subsubsection.9.7.2.2}}
\newlabel{ADC_8c_a3fdaf3b8949082abe85a7e7083087eb7}{{9.7.2.2}{48}{A\+D\+C\+\_\+\+Init}{subsubsection.9.7.2.2}{}}
\gdef \PWST@xxiii{1}
\@writefile{toc}{\contentsline {section}{\numberline {9.8}A\discretionary {\unhbox \voidb@x \hbox {\relax \fontsize  {7}{8}\selectfont  $\leftarrow \joinrel  \rhook $}}{}{}P\discretionary {\unhbox \voidb@x \hbox {\relax \fontsize  {7}{8}\selectfont  $\leftarrow \joinrel  \rhook $}}{}{}I/src/\discretionary {\unhbox \voidb@x \hbox {\relax \fontsize  {7}{8}\selectfont  $\leftarrow \joinrel  \rhook $}}{}{}G\discretionary {\unhbox \voidb@x \hbox {\relax \fontsize  {7}{8}\selectfont  $\leftarrow \joinrel  \rhook $}}{}{}P\discretionary {\unhbox \voidb@x \hbox {\relax \fontsize  {7}{8}\selectfont  $\leftarrow \joinrel  \rhook $}}{}{}I\discretionary {\unhbox \voidb@x \hbox {\relax \fontsize  {7}{8}\selectfont  $\leftarrow \joinrel  \rhook $}}{}{}O.c File Reference}{49}{section.9.8}}
\newlabel{GPIO_8c}{{9.8}{49}{A\+P\+I/src/\+G\+P\+I\+O.c File Reference}{section.9.8}{}}
\gdef \PWST@xxiv{1}
\gdef \PWST@xxv{1}
\gdef \PWST@xxvi{1}
\@writefile{toc}{\contentsline {subsection}{\numberline {9.8.1}Detailed Description}{50}{subsection.9.8.1}}
\@writefile{toc}{\contentsline {subsection}{\numberline {9.8.2}Function Documentation}{50}{subsection.9.8.2}}
\@writefile{toc}{\contentsline {subsubsection}{\numberline {9.8.2.1}Get\discretionary {\unhbox \voidb@x \hbox {\relax \fontsize  {7}{8}\selectfont  $\leftarrow \joinrel  \rhook $}}{}{}D\discretionary {\unhbox \voidb@x \hbox {\relax \fontsize  {7}{8}\selectfont  $\leftarrow \joinrel  \rhook $}}{}{}I}{50}{subsubsection.9.8.2.1}}
\newlabel{GPIO_8c_a86c036aa80b88e113e5783aa9f06a2b3}{{9.8.2.1}{50}{Get\+D\+I}{subsubsection.9.8.2.1}{}}
\@writefile{toc}{\contentsline {subsubsection}{\numberline {9.8.2.2}G\discretionary {\unhbox \voidb@x \hbox {\relax \fontsize  {7}{8}\selectfont  $\leftarrow \joinrel  \rhook $}}{}{}P\discretionary {\unhbox \voidb@x \hbox {\relax \fontsize  {7}{8}\selectfont  $\leftarrow \joinrel  \rhook $}}{}{}I\discretionary {\unhbox \voidb@x \hbox {\relax \fontsize  {7}{8}\selectfont  $\leftarrow \joinrel  \rhook $}}{}{}O\discretionary {\unhbox \voidb@x \hbox {\relax \fontsize  {7}{8}\selectfont  $\leftarrow \joinrel  \rhook $}}{}{}\_\discretionary {\unhbox \voidb@x \hbox {\relax \fontsize  {7}{8}\selectfont  $\leftarrow \joinrel  \rhook $}}{}{}\discretionary {\unhbox \voidb@x \hbox {\relax \fontsize  {7}{8}\selectfont  $\leftarrow \joinrel  \rhook $}}{}{}De\discretionary {\unhbox \voidb@x \hbox {\relax \fontsize  {7}{8}\selectfont  $\leftarrow \joinrel  \rhook $}}{}{}Init}{50}{subsubsection.9.8.2.2}}
\newlabel{GPIO_8c_a55274c05fa9e816b7d0567799f2adda3}{{9.8.2.2}{50}{G\+P\+I\+O\+\_\+\+De\+Init}{subsubsection.9.8.2.2}{}}
\@writefile{toc}{\contentsline {subsubsection}{\numberline {9.8.2.3}G\discretionary {\unhbox \voidb@x \hbox {\relax \fontsize  {7}{8}\selectfont  $\leftarrow \joinrel  \rhook $}}{}{}P\discretionary {\unhbox \voidb@x \hbox {\relax \fontsize  {7}{8}\selectfont  $\leftarrow \joinrel  \rhook $}}{}{}I\discretionary {\unhbox \voidb@x \hbox {\relax \fontsize  {7}{8}\selectfont  $\leftarrow \joinrel  \rhook $}}{}{}O\discretionary {\unhbox \voidb@x \hbox {\relax \fontsize  {7}{8}\selectfont  $\leftarrow \joinrel  \rhook $}}{}{}\_\discretionary {\unhbox \voidb@x \hbox {\relax \fontsize  {7}{8}\selectfont  $\leftarrow \joinrel  \rhook $}}{}{}\discretionary {\unhbox \voidb@x \hbox {\relax \fontsize  {7}{8}\selectfont  $\leftarrow \joinrel  \rhook $}}{}{}Init}{50}{subsubsection.9.8.2.3}}
\newlabel{GPIO_8c_a885c93e9837729510e85129e4ac82a86}{{9.8.2.3}{50}{G\+P\+I\+O\+\_\+\+Init}{subsubsection.9.8.2.3}{}}
\gdef \PWST@xxvii{1}
\gdef \PWST@xxviii{1}
\@writefile{toc}{\contentsline {subsubsection}{\numberline {9.8.2.4}Set\discretionary {\unhbox \voidb@x \hbox {\relax \fontsize  {7}{8}\selectfont  $\leftarrow \joinrel  \rhook $}}{}{}D\discretionary {\unhbox \voidb@x \hbox {\relax \fontsize  {7}{8}\selectfont  $\leftarrow \joinrel  \rhook $}}{}{}O}{51}{subsubsection.9.8.2.4}}
\newlabel{GPIO_8c_a183d1dc00b66e06267fc01ea2d9395e4}{{9.8.2.4}{51}{Set\+D\+O}{subsubsection.9.8.2.4}{}}
\@writefile{toc}{\contentsline {subsection}{\numberline {9.8.3}Variable Documentation}{51}{subsection.9.8.3}}
\@writefile{toc}{\contentsline {subsubsection}{\numberline {9.8.3.1}P\discretionary {\unhbox \voidb@x \hbox {\relax \fontsize  {7}{8}\selectfont  $\leftarrow \joinrel  \rhook $}}{}{}A0}{51}{subsubsection.9.8.3.1}}
\newlabel{GPIO_8c_a325a2efca19e3b77bd88cb7d6f1891be}{{9.8.3.1}{51}{P\+A0}{subsubsection.9.8.3.1}{}}
\@writefile{toc}{\contentsline {subsubsection}{\numberline {9.8.3.2}P\discretionary {\unhbox \voidb@x \hbox {\relax \fontsize  {7}{8}\selectfont  $\leftarrow \joinrel  \rhook $}}{}{}A1}{51}{subsubsection.9.8.3.2}}
\newlabel{GPIO_8c_a0af9f63fd516206bc9c111c77cfeff8a}{{9.8.3.2}{51}{P\+A1}{subsubsection.9.8.3.2}{}}
\@writefile{toc}{\contentsline {subsubsection}{\numberline {9.8.3.3}P\discretionary {\unhbox \voidb@x \hbox {\relax \fontsize  {7}{8}\selectfont  $\leftarrow \joinrel  \rhook $}}{}{}A10}{51}{subsubsection.9.8.3.3}}
\newlabel{GPIO_8c_a775f5a87ed2d0fe3219d5bab91abc8a0}{{9.8.3.3}{51}{P\+A10}{subsubsection.9.8.3.3}{}}
\@writefile{toc}{\contentsline {subsubsection}{\numberline {9.8.3.4}P\discretionary {\unhbox \voidb@x \hbox {\relax \fontsize  {7}{8}\selectfont  $\leftarrow \joinrel  \rhook $}}{}{}A11}{51}{subsubsection.9.8.3.4}}
\newlabel{GPIO_8c_aa6ab84f88f26c64cb9109fbaf6173d1b}{{9.8.3.4}{51}{P\+A11}{subsubsection.9.8.3.4}{}}
\@writefile{toc}{\contentsline {subsubsection}{\numberline {9.8.3.5}P\discretionary {\unhbox \voidb@x \hbox {\relax \fontsize  {7}{8}\selectfont  $\leftarrow \joinrel  \rhook $}}{}{}A12}{51}{subsubsection.9.8.3.5}}
\newlabel{GPIO_8c_a8abfae746e3354f874721653e7b2eb74}{{9.8.3.5}{51}{P\+A12}{subsubsection.9.8.3.5}{}}
\@writefile{toc}{\contentsline {subsubsection}{\numberline {9.8.3.6}P\discretionary {\unhbox \voidb@x \hbox {\relax \fontsize  {7}{8}\selectfont  $\leftarrow \joinrel  \rhook $}}{}{}A13}{52}{subsubsection.9.8.3.6}}
\newlabel{GPIO_8c_ab376863e0a26a62a1a74b3efc9d83e9a}{{9.8.3.6}{52}{P\+A13}{subsubsection.9.8.3.6}{}}
\@writefile{toc}{\contentsline {subsubsection}{\numberline {9.8.3.7}P\discretionary {\unhbox \voidb@x \hbox {\relax \fontsize  {7}{8}\selectfont  $\leftarrow \joinrel  \rhook $}}{}{}A14}{52}{subsubsection.9.8.3.7}}
\newlabel{GPIO_8c_ae23277c4cc5a0a57280f0cb0291bc86b}{{9.8.3.7}{52}{P\+A14}{subsubsection.9.8.3.7}{}}
\@writefile{toc}{\contentsline {subsubsection}{\numberline {9.8.3.8}P\discretionary {\unhbox \voidb@x \hbox {\relax \fontsize  {7}{8}\selectfont  $\leftarrow \joinrel  \rhook $}}{}{}A15}{52}{subsubsection.9.8.3.8}}
\newlabel{GPIO_8c_af70761007c8c3908a3579220209836a4}{{9.8.3.8}{52}{P\+A15}{subsubsection.9.8.3.8}{}}
\@writefile{toc}{\contentsline {subsubsection}{\numberline {9.8.3.9}P\discretionary {\unhbox \voidb@x \hbox {\relax \fontsize  {7}{8}\selectfont  $\leftarrow \joinrel  \rhook $}}{}{}A2}{52}{subsubsection.9.8.3.9}}
\newlabel{GPIO_8c_a127e5b731cabe06270969257329ddbf2}{{9.8.3.9}{52}{P\+A2}{subsubsection.9.8.3.9}{}}
\@writefile{toc}{\contentsline {subsubsection}{\numberline {9.8.3.10}P\discretionary {\unhbox \voidb@x \hbox {\relax \fontsize  {7}{8}\selectfont  $\leftarrow \joinrel  \rhook $}}{}{}A3}{52}{subsubsection.9.8.3.10}}
\newlabel{GPIO_8c_a7ce20c6bd67c7ea79ff0d5a3d1f62257}{{9.8.3.10}{52}{P\+A3}{subsubsection.9.8.3.10}{}}
\@writefile{toc}{\contentsline {subsubsection}{\numberline {9.8.3.11}P\discretionary {\unhbox \voidb@x \hbox {\relax \fontsize  {7}{8}\selectfont  $\leftarrow \joinrel  \rhook $}}{}{}A4}{52}{subsubsection.9.8.3.11}}
\newlabel{GPIO_8c_aec4f22408b689321be8a39936043d4ae}{{9.8.3.11}{52}{P\+A4}{subsubsection.9.8.3.11}{}}
\@writefile{toc}{\contentsline {subsubsection}{\numberline {9.8.3.12}P\discretionary {\unhbox \voidb@x \hbox {\relax \fontsize  {7}{8}\selectfont  $\leftarrow \joinrel  \rhook $}}{}{}A5}{52}{subsubsection.9.8.3.12}}
\newlabel{GPIO_8c_a0774f5b0a352da541fae2422d934beba}{{9.8.3.12}{52}{P\+A5}{subsubsection.9.8.3.12}{}}
\@writefile{toc}{\contentsline {subsubsection}{\numberline {9.8.3.13}P\discretionary {\unhbox \voidb@x \hbox {\relax \fontsize  {7}{8}\selectfont  $\leftarrow \joinrel  \rhook $}}{}{}A6}{53}{subsubsection.9.8.3.13}}
\newlabel{GPIO_8c_a26f9bb6ffaa5bc301f4cad0381822fcd}{{9.8.3.13}{53}{P\+A6}{subsubsection.9.8.3.13}{}}
\@writefile{toc}{\contentsline {subsubsection}{\numberline {9.8.3.14}P\discretionary {\unhbox \voidb@x \hbox {\relax \fontsize  {7}{8}\selectfont  $\leftarrow \joinrel  \rhook $}}{}{}A7}{53}{subsubsection.9.8.3.14}}
\newlabel{GPIO_8c_a9e450a16e7abb8eb9e671728f97be5b9}{{9.8.3.14}{53}{P\+A7}{subsubsection.9.8.3.14}{}}
\@writefile{toc}{\contentsline {subsubsection}{\numberline {9.8.3.15}P\discretionary {\unhbox \voidb@x \hbox {\relax \fontsize  {7}{8}\selectfont  $\leftarrow \joinrel  \rhook $}}{}{}A8}{53}{subsubsection.9.8.3.15}}
\newlabel{GPIO_8c_aa18bb55c744ffdd3b37e6a6e0d32f155}{{9.8.3.15}{53}{P\+A8}{subsubsection.9.8.3.15}{}}
\@writefile{toc}{\contentsline {subsubsection}{\numberline {9.8.3.16}P\discretionary {\unhbox \voidb@x \hbox {\relax \fontsize  {7}{8}\selectfont  $\leftarrow \joinrel  \rhook $}}{}{}A9}{53}{subsubsection.9.8.3.16}}
\newlabel{GPIO_8c_abb00bd9c52f22ad61214a9186b6bed75}{{9.8.3.16}{53}{P\+A9}{subsubsection.9.8.3.16}{}}
\@writefile{toc}{\contentsline {subsubsection}{\numberline {9.8.3.17}P\discretionary {\unhbox \voidb@x \hbox {\relax \fontsize  {7}{8}\selectfont  $\leftarrow \joinrel  \rhook $}}{}{}B0}{53}{subsubsection.9.8.3.17}}
\newlabel{GPIO_8c_afdf9414c856d091251751931c1e309a6}{{9.8.3.17}{53}{P\+B0}{subsubsection.9.8.3.17}{}}
\@writefile{toc}{\contentsline {subsubsection}{\numberline {9.8.3.18}P\discretionary {\unhbox \voidb@x \hbox {\relax \fontsize  {7}{8}\selectfont  $\leftarrow \joinrel  \rhook $}}{}{}B1}{53}{subsubsection.9.8.3.18}}
\newlabel{GPIO_8c_a310340bbfdc13b6938cb0d1bc4d8332b}{{9.8.3.18}{53}{P\+B1}{subsubsection.9.8.3.18}{}}
\@writefile{toc}{\contentsline {subsubsection}{\numberline {9.8.3.19}P\discretionary {\unhbox \voidb@x \hbox {\relax \fontsize  {7}{8}\selectfont  $\leftarrow \joinrel  \rhook $}}{}{}B3}{53}{subsubsection.9.8.3.19}}
\newlabel{GPIO_8c_ad627d774de7864ccdd353989241f6fa9}{{9.8.3.19}{53}{P\+B3}{subsubsection.9.8.3.19}{}}
\@writefile{toc}{\contentsline {subsubsection}{\numberline {9.8.3.20}P\discretionary {\unhbox \voidb@x \hbox {\relax \fontsize  {7}{8}\selectfont  $\leftarrow \joinrel  \rhook $}}{}{}B4}{54}{subsubsection.9.8.3.20}}
\newlabel{GPIO_8c_af8b07ad3aba6dfc1fe0a2c0f093893f4}{{9.8.3.20}{54}{P\+B4}{subsubsection.9.8.3.20}{}}
\@writefile{toc}{\contentsline {subsubsection}{\numberline {9.8.3.21}P\discretionary {\unhbox \voidb@x \hbox {\relax \fontsize  {7}{8}\selectfont  $\leftarrow \joinrel  \rhook $}}{}{}B5}{54}{subsubsection.9.8.3.21}}
\newlabel{GPIO_8c_a6c89239fd051bec61acbb6637c2a8642}{{9.8.3.21}{54}{P\+B5}{subsubsection.9.8.3.21}{}}
\@writefile{toc}{\contentsline {subsubsection}{\numberline {9.8.3.22}P\discretionary {\unhbox \voidb@x \hbox {\relax \fontsize  {7}{8}\selectfont  $\leftarrow \joinrel  \rhook $}}{}{}B6}{54}{subsubsection.9.8.3.22}}
\newlabel{GPIO_8c_ae11ca85479199a35a87d4ac721ef735f}{{9.8.3.22}{54}{P\+B6}{subsubsection.9.8.3.22}{}}
\@writefile{toc}{\contentsline {subsubsection}{\numberline {9.8.3.23}P\discretionary {\unhbox \voidb@x \hbox {\relax \fontsize  {7}{8}\selectfont  $\leftarrow \joinrel  \rhook $}}{}{}B7}{54}{subsubsection.9.8.3.23}}
\newlabel{GPIO_8c_a6e14b71987bbae1fe1b15c60fddf3edc}{{9.8.3.23}{54}{P\+B7}{subsubsection.9.8.3.23}{}}
\@writefile{toc}{\contentsline {subsubsection}{\numberline {9.8.3.24}P\discretionary {\unhbox \voidb@x \hbox {\relax \fontsize  {7}{8}\selectfont  $\leftarrow \joinrel  \rhook $}}{}{}B9}{54}{subsubsection.9.8.3.24}}
\newlabel{GPIO_8c_af5c6832994c23dd63b10ae5b1229a28a}{{9.8.3.24}{54}{P\+B9}{subsubsection.9.8.3.24}{}}
\@writefile{toc}{\contentsline {subsubsection}{\numberline {9.8.3.25}P\discretionary {\unhbox \voidb@x \hbox {\relax \fontsize  {7}{8}\selectfont  $\leftarrow \joinrel  \rhook $}}{}{}C14}{54}{subsubsection.9.8.3.25}}
\newlabel{GPIO_8c_ae4ddc7b2c03a73b537d8de996c1971a3}{{9.8.3.25}{54}{P\+C14}{subsubsection.9.8.3.25}{}}
\@writefile{toc}{\contentsline {subsubsection}{\numberline {9.8.3.26}P\discretionary {\unhbox \voidb@x \hbox {\relax \fontsize  {7}{8}\selectfont  $\leftarrow \joinrel  \rhook $}}{}{}C15}{54}{subsubsection.9.8.3.26}}
\newlabel{GPIO_8c_affe39cce297b078856b67cd2084090fd}{{9.8.3.26}{54}{P\+C15}{subsubsection.9.8.3.26}{}}
\@writefile{toc}{\contentsline {section}{\numberline {9.9}A\discretionary {\unhbox \voidb@x \hbox {\relax \fontsize  {7}{8}\selectfont  $\leftarrow \joinrel  \rhook $}}{}{}P\discretionary {\unhbox \voidb@x \hbox {\relax \fontsize  {7}{8}\selectfont  $\leftarrow \joinrel  \rhook $}}{}{}I/src/\discretionary {\unhbox \voidb@x \hbox {\relax \fontsize  {7}{8}\selectfont  $\leftarrow \joinrel  \rhook $}}{}{}L\discretionary {\unhbox \voidb@x \hbox {\relax \fontsize  {7}{8}\selectfont  $\leftarrow \joinrel  \rhook $}}{}{}P\discretionary {\unhbox \voidb@x \hbox {\relax \fontsize  {7}{8}\selectfont  $\leftarrow \joinrel  \rhook $}}{}{}T\discretionary {\unhbox \voidb@x \hbox {\relax \fontsize  {7}{8}\selectfont  $\leftarrow \joinrel  \rhook $}}{}{}I\discretionary {\unhbox \voidb@x \hbox {\relax \fontsize  {7}{8}\selectfont  $\leftarrow \joinrel  \rhook $}}{}{}M\discretionary {\unhbox \voidb@x \hbox {\relax \fontsize  {7}{8}\selectfont  $\leftarrow \joinrel  \rhook $}}{}{}E\discretionary {\unhbox \voidb@x \hbox {\relax \fontsize  {7}{8}\selectfont  $\leftarrow \joinrel  \rhook $}}{}{}R.c File Reference}{55}{section.9.9}}
\newlabel{LPTIMER_8c}{{9.9}{55}{A\+P\+I/src/\+L\+P\+T\+I\+M\+E\+R.c File Reference}{section.9.9}{}}
\newlabel{LPTIMER_8c_a29af84c81e9838ea466fd0aa2e180748}{{9.9}{55}{Functions}{section*.38}{}}
\newlabel{LPTIMER_8c_af395599d8a77faa78d99c1beb0e72de3}{{9.9}{55}{Functions}{section*.38}{}}
\newlabel{LPTIMER_8c_ac101311c05f9cce0da622d128c01284a}{{9.9}{55}{Variables}{section*.39}{}}
\newlabel{LPTIMER_8c_a1c4f179457199bc33233070d6b1dd934}{{9.9}{55}{Variables}{section*.39}{}}
\@writefile{toc}{\contentsline {subsection}{\numberline {9.9.1}Detailed Description}{55}{subsection.9.9.1}}
\@writefile{toc}{\contentsline {subsection}{\numberline {9.9.2}Function Documentation}{56}{subsection.9.9.2}}
\@writefile{toc}{\contentsline {subsubsection}{\numberline {9.9.2.1}L\discretionary {\unhbox \voidb@x \hbox {\relax \fontsize  {7}{8}\selectfont  $\leftarrow \joinrel  \rhook $}}{}{}P\discretionary {\unhbox \voidb@x \hbox {\relax \fontsize  {7}{8}\selectfont  $\leftarrow \joinrel  \rhook $}}{}{}T\discretionary {\unhbox \voidb@x \hbox {\relax \fontsize  {7}{8}\selectfont  $\leftarrow \joinrel  \rhook $}}{}{}I\discretionary {\unhbox \voidb@x \hbox {\relax \fontsize  {7}{8}\selectfont  $\leftarrow \joinrel  \rhook $}}{}{}M\discretionary {\unhbox \voidb@x \hbox {\relax \fontsize  {7}{8}\selectfont  $\leftarrow \joinrel  \rhook $}}{}{}E\discretionary {\unhbox \voidb@x \hbox {\relax \fontsize  {7}{8}\selectfont  $\leftarrow \joinrel  \rhook $}}{}{}R\discretionary {\unhbox \voidb@x \hbox {\relax \fontsize  {7}{8}\selectfont  $\leftarrow \joinrel  \rhook $}}{}{}\_\discretionary {\unhbox \voidb@x \hbox {\relax \fontsize  {7}{8}\selectfont  $\leftarrow \joinrel  \rhook $}}{}{}\discretionary {\unhbox \voidb@x \hbox {\relax \fontsize  {7}{8}\selectfont  $\leftarrow \joinrel  \rhook $}}{}{}Init}{56}{subsubsection.9.9.2.1}}
\newlabel{LPTIMER_8c_a2d4f5708d50ff6ccc3c313ed3321800d}{{9.9.2.1}{56}{L\+P\+T\+I\+M\+E\+R\+\_\+\+Init}{subsubsection.9.9.2.1}{}}
\gdef \PWST@xxix{1}
\@writefile{toc}{\contentsline {section}{\numberline {9.10}A\discretionary {\unhbox \voidb@x \hbox {\relax \fontsize  {7}{8}\selectfont  $\leftarrow \joinrel  \rhook $}}{}{}P\discretionary {\unhbox \voidb@x \hbox {\relax \fontsize  {7}{8}\selectfont  $\leftarrow \joinrel  \rhook $}}{}{}I/src/\discretionary {\unhbox \voidb@x \hbox {\relax \fontsize  {7}{8}\selectfont  $\leftarrow \joinrel  \rhook $}}{}{}L\discretionary {\unhbox \voidb@x \hbox {\relax \fontsize  {7}{8}\selectfont  $\leftarrow \joinrel  \rhook $}}{}{}P\discretionary {\unhbox \voidb@x \hbox {\relax \fontsize  {7}{8}\selectfont  $\leftarrow \joinrel  \rhook $}}{}{}U\discretionary {\unhbox \voidb@x \hbox {\relax \fontsize  {7}{8}\selectfont  $\leftarrow \joinrel  \rhook $}}{}{}A\discretionary {\unhbox \voidb@x \hbox {\relax \fontsize  {7}{8}\selectfont  $\leftarrow \joinrel  \rhook $}}{}{}R\discretionary {\unhbox \voidb@x \hbox {\relax \fontsize  {7}{8}\selectfont  $\leftarrow \joinrel  \rhook $}}{}{}T.c File Reference}{57}{section.9.10}}
\newlabel{LPUART_8c}{{9.10}{57}{A\+P\+I/src/\+L\+P\+U\+A\+R\+T.c File Reference}{section.9.10}{}}
\newlabel{LPUART_8c_a059c597457fde5d70d0d030cc72ff396}{{9.10}{57}{Macros}{section*.40}{}}
\newlabel{LPUART_8c_aa1fcbccf0107eb5f5af03f95f13d2872}{{9.10}{57}{Macros}{section*.40}{}}
\newlabel{LPUART_8c_aeff5ab457831144b784114f6da09a5de}{{9.10}{57}{Functions}{section*.41}{}}
\newlabel{LPUART_8c_aedf923a36e99dd50350a393d4e94bc21}{{9.10}{57}{Functions}{section*.41}{}}
\newlabel{LPUART_8c_a1646ff05b598e1d8eb8b0de64d9cd61f}{{9.10}{57}{Variables}{section*.42}{}}
\newlabel{LPUART_8c_a187656c39e3a735c6fb73f60e194baae}{{9.10}{57}{Variables}{section*.42}{}}
\newlabel{LPUART_8c_af14f5a3fed682e20ea9cab49e5d42f60}{{9.10}{57}{Variables}{section*.42}{}}
\gdef \PWST@xxx{1}
\gdef \PWST@xxxi{1}
\@writefile{toc}{\contentsline {subsection}{\numberline {9.10.1}Detailed Description}{58}{subsection.9.10.1}}
\@writefile{toc}{\contentsline {subsection}{\numberline {9.10.2}Function Documentation}{58}{subsection.9.10.2}}
\@writefile{toc}{\contentsline {subsubsection}{\numberline {9.10.2.1}L\discretionary {\unhbox \voidb@x \hbox {\relax \fontsize  {7}{8}\selectfont  $\leftarrow \joinrel  \rhook $}}{}{}P\discretionary {\unhbox \voidb@x \hbox {\relax \fontsize  {7}{8}\selectfont  $\leftarrow \joinrel  \rhook $}}{}{}U\discretionary {\unhbox \voidb@x \hbox {\relax \fontsize  {7}{8}\selectfont  $\leftarrow \joinrel  \rhook $}}{}{}A\discretionary {\unhbox \voidb@x \hbox {\relax \fontsize  {7}{8}\selectfont  $\leftarrow \joinrel  \rhook $}}{}{}R\discretionary {\unhbox \voidb@x \hbox {\relax \fontsize  {7}{8}\selectfont  $\leftarrow \joinrel  \rhook $}}{}{}T\discretionary {\unhbox \voidb@x \hbox {\relax \fontsize  {7}{8}\selectfont  $\leftarrow \joinrel  \rhook $}}{}{}\_\discretionary {\unhbox \voidb@x \hbox {\relax \fontsize  {7}{8}\selectfont  $\leftarrow \joinrel  \rhook $}}{}{}\discretionary {\unhbox \voidb@x \hbox {\relax \fontsize  {7}{8}\selectfont  $\leftarrow \joinrel  \rhook $}}{}{}Init}{58}{subsubsection.9.10.2.1}}
\newlabel{LPUART_8c_a01a78e16c0677cbfc83bab0e604f886b}{{9.10.2.1}{58}{L\+P\+U\+A\+R\+T\+\_\+\+Init}{subsubsection.9.10.2.1}{}}
\@writefile{toc}{\contentsline {subsubsection}{\numberline {9.10.2.2}L\discretionary {\unhbox \voidb@x \hbox {\relax \fontsize  {7}{8}\selectfont  $\leftarrow \joinrel  \rhook $}}{}{}P\discretionary {\unhbox \voidb@x \hbox {\relax \fontsize  {7}{8}\selectfont  $\leftarrow \joinrel  \rhook $}}{}{}U\discretionary {\unhbox \voidb@x \hbox {\relax \fontsize  {7}{8}\selectfont  $\leftarrow \joinrel  \rhook $}}{}{}A\discretionary {\unhbox \voidb@x \hbox {\relax \fontsize  {7}{8}\selectfont  $\leftarrow \joinrel  \rhook $}}{}{}R\discretionary {\unhbox \voidb@x \hbox {\relax \fontsize  {7}{8}\selectfont  $\leftarrow \joinrel  \rhook $}}{}{}T\discretionary {\unhbox \voidb@x \hbox {\relax \fontsize  {7}{8}\selectfont  $\leftarrow \joinrel  \rhook $}}{}{}\_\discretionary {\unhbox \voidb@x \hbox {\relax \fontsize  {7}{8}\selectfont  $\leftarrow \joinrel  \rhook $}}{}{}\discretionary {\unhbox \voidb@x \hbox {\relax \fontsize  {7}{8}\selectfont  $\leftarrow \joinrel  \rhook $}}{}{}Send}{58}{subsubsection.9.10.2.2}}
\newlabel{LPUART_8c_ad4eaf405476d9a39f4024b41dedf91bb}{{9.10.2.2}{58}{L\+P\+U\+A\+R\+T\+\_\+\+Send}{subsubsection.9.10.2.2}{}}
\@writefile{toc}{\contentsline {section}{\numberline {9.11}A\discretionary {\unhbox \voidb@x \hbox {\relax \fontsize  {7}{8}\selectfont  $\leftarrow \joinrel  \rhook $}}{}{}P\discretionary {\unhbox \voidb@x \hbox {\relax \fontsize  {7}{8}\selectfont  $\leftarrow \joinrel  \rhook $}}{}{}I/src/\discretionary {\unhbox \voidb@x \hbox {\relax \fontsize  {7}{8}\selectfont  $\leftarrow \joinrel  \rhook $}}{}{}U\discretionary {\unhbox \voidb@x \hbox {\relax \fontsize  {7}{8}\selectfont  $\leftarrow \joinrel  \rhook $}}{}{}S\discretionary {\unhbox \voidb@x \hbox {\relax \fontsize  {7}{8}\selectfont  $\leftarrow \joinrel  \rhook $}}{}{}A\discretionary {\unhbox \voidb@x \hbox {\relax \fontsize  {7}{8}\selectfont  $\leftarrow \joinrel  \rhook $}}{}{}R\discretionary {\unhbox \voidb@x \hbox {\relax \fontsize  {7}{8}\selectfont  $\leftarrow \joinrel  \rhook $}}{}{}T.c File Reference}{58}{section.9.11}}
\newlabel{USART_8c}{{9.11}{58}{A\+P\+I/src/\+U\+S\+A\+R\+T.c File Reference}{section.9.11}{}}
\newlabel{USART_8c_a059c597457fde5d70d0d030cc72ff396}{{9.11}{59}{Macros}{section*.43}{}}
\newlabel{USART_8c_aa1fcbccf0107eb5f5af03f95f13d2872}{{9.11}{59}{Macros}{section*.43}{}}
\newlabel{USART_8c_a8154bf4deec9038cb02299f2e649bcd9}{{9.11}{59}{Functions}{section*.44}{}}
\newlabel{USART_8c_aa3195e116f1b68a5e2acb9ebbd148d0e}{{9.11}{59}{Functions}{section*.44}{}}
\newlabel{USART_8c_a1646ff05b598e1d8eb8b0de64d9cd61f}{{9.11}{59}{Variables}{section*.45}{}}
\newlabel{USART_8c_a187656c39e3a735c6fb73f60e194baae}{{9.11}{59}{Variables}{section*.45}{}}
\newlabel{USART_8c_af15ca81552660fd567efe8cc1b2496f7}{{9.11}{59}{Variables}{section*.45}{}}
\@writefile{toc}{\contentsline {subsection}{\numberline {9.11.1}Detailed Description}{59}{subsection.9.11.1}}
\gdef \PWST@xxxii{1}
\gdef \PWST@xxxiii{1}
\@writefile{toc}{\contentsline {subsection}{\numberline {9.11.2}Function Documentation}{60}{subsection.9.11.2}}
\@writefile{toc}{\contentsline {subsubsection}{\numberline {9.11.2.1}U\discretionary {\unhbox \voidb@x \hbox {\relax \fontsize  {7}{8}\selectfont  $\leftarrow \joinrel  \rhook $}}{}{}S\discretionary {\unhbox \voidb@x \hbox {\relax \fontsize  {7}{8}\selectfont  $\leftarrow \joinrel  \rhook $}}{}{}A\discretionary {\unhbox \voidb@x \hbox {\relax \fontsize  {7}{8}\selectfont  $\leftarrow \joinrel  \rhook $}}{}{}R\discretionary {\unhbox \voidb@x \hbox {\relax \fontsize  {7}{8}\selectfont  $\leftarrow \joinrel  \rhook $}}{}{}T\discretionary {\unhbox \voidb@x \hbox {\relax \fontsize  {7}{8}\selectfont  $\leftarrow \joinrel  \rhook $}}{}{}\_\discretionary {\unhbox \voidb@x \hbox {\relax \fontsize  {7}{8}\selectfont  $\leftarrow \joinrel  \rhook $}}{}{}\discretionary {\unhbox \voidb@x \hbox {\relax \fontsize  {7}{8}\selectfont  $\leftarrow \joinrel  \rhook $}}{}{}Init}{60}{subsubsection.9.11.2.1}}
\newlabel{USART_8c_a28717534874ca2be99d5b3c478d2ab3c}{{9.11.2.1}{60}{U\+S\+A\+R\+T\+\_\+\+Init}{subsubsection.9.11.2.1}{}}
\@writefile{toc}{\contentsline {subsubsection}{\numberline {9.11.2.2}U\discretionary {\unhbox \voidb@x \hbox {\relax \fontsize  {7}{8}\selectfont  $\leftarrow \joinrel  \rhook $}}{}{}S\discretionary {\unhbox \voidb@x \hbox {\relax \fontsize  {7}{8}\selectfont  $\leftarrow \joinrel  \rhook $}}{}{}A\discretionary {\unhbox \voidb@x \hbox {\relax \fontsize  {7}{8}\selectfont  $\leftarrow \joinrel  \rhook $}}{}{}R\discretionary {\unhbox \voidb@x \hbox {\relax \fontsize  {7}{8}\selectfont  $\leftarrow \joinrel  \rhook $}}{}{}T\discretionary {\unhbox \voidb@x \hbox {\relax \fontsize  {7}{8}\selectfont  $\leftarrow \joinrel  \rhook $}}{}{}\_\discretionary {\unhbox \voidb@x \hbox {\relax \fontsize  {7}{8}\selectfont  $\leftarrow \joinrel  \rhook $}}{}{}\discretionary {\unhbox \voidb@x \hbox {\relax \fontsize  {7}{8}\selectfont  $\leftarrow \joinrel  \rhook $}}{}{}Send}{60}{subsubsection.9.11.2.2}}
\newlabel{USART_8c_a4190eb49c715c132cc1ff0968347eb07}{{9.11.2.2}{60}{U\+S\+A\+R\+T\+\_\+\+Send}{subsubsection.9.11.2.2}{}}
\@writefile{toc}{\contentsline {section}{\numberline {9.12}A\discretionary {\unhbox \voidb@x \hbox {\relax \fontsize  {7}{8}\selectfont  $\leftarrow \joinrel  \rhook $}}{}{}P\discretionary {\unhbox \voidb@x \hbox {\relax \fontsize  {7}{8}\selectfont  $\leftarrow \joinrel  \rhook $}}{}{}I/src/\discretionary {\unhbox \voidb@x \hbox {\relax \fontsize  {7}{8}\selectfont  $\leftarrow \joinrel  \rhook $}}{}{}W\discretionary {\unhbox \voidb@x \hbox {\relax \fontsize  {7}{8}\selectfont  $\leftarrow \joinrel  \rhook $}}{}{}W\discretionary {\unhbox \voidb@x \hbox {\relax \fontsize  {7}{8}\selectfont  $\leftarrow \joinrel  \rhook $}}{}{}D\discretionary {\unhbox \voidb@x \hbox {\relax \fontsize  {7}{8}\selectfont  $\leftarrow \joinrel  \rhook $}}{}{}G.c File Reference}{60}{section.9.12}}
\newlabel{WWDG_8c}{{9.12}{60}{A\+P\+I/src/\+W\+W\+D\+G.c File Reference}{section.9.12}{}}
\newlabel{WWDG_8c_a1532f0a4303fd72246e7ee02da141c4a}{{9.12}{61}{Functions}{section*.46}{}}
\newlabel{WWDG_8c_a36afd91f097b346e0278a5aa9c15b511}{{9.12}{61}{Functions}{section*.46}{}}
\newlabel{WWDG_8c_aa564ca1c548c7e41e902d9561660eaac}{{9.12}{61}{Functions}{section*.46}{}}
\newlabel{WWDG_8c_a049e27b7d5d0d36a331e6ef5e78e1fc5}{{9.12}{61}{Functions}{section*.46}{}}
\newlabel{WWDG_8c_ab4707dd0d4268deb12ca7d5e05aa8a5d}{{9.12}{61}{Variables}{section*.47}{}}
\@writefile{toc}{\contentsline {subsection}{\numberline {9.12.1}Detailed Description}{61}{subsection.9.12.1}}
\@writefile{toc}{\contentsline {subsection}{\numberline {9.12.2}Function Documentation}{61}{subsection.9.12.2}}
\@writefile{toc}{\contentsline {subsubsection}{\numberline {9.12.2.1}W\discretionary {\unhbox \voidb@x \hbox {\relax \fontsize  {7}{8}\selectfont  $\leftarrow \joinrel  \rhook $}}{}{}W\discretionary {\unhbox \voidb@x \hbox {\relax \fontsize  {7}{8}\selectfont  $\leftarrow \joinrel  \rhook $}}{}{}D\discretionary {\unhbox \voidb@x \hbox {\relax \fontsize  {7}{8}\selectfont  $\leftarrow \joinrel  \rhook $}}{}{}G\discretionary {\unhbox \voidb@x \hbox {\relax \fontsize  {7}{8}\selectfont  $\leftarrow \joinrel  \rhook $}}{}{}\_\discretionary {\unhbox \voidb@x \hbox {\relax \fontsize  {7}{8}\selectfont  $\leftarrow \joinrel  \rhook $}}{}{}\discretionary {\unhbox \voidb@x \hbox {\relax \fontsize  {7}{8}\selectfont  $\leftarrow \joinrel  \rhook $}}{}{}Init}{61}{subsubsection.9.12.2.1}}
\newlabel{WWDG_8c_a4665ae3093446dcef1d6c703528e21b0}{{9.12.2.1}{61}{W\+W\+D\+G\+\_\+\+Init}{subsubsection.9.12.2.1}{}}
\gdef \PWST@xxxiv{1}
\@writefile{toc}{\contentsline {section}{\numberline {9.13}inc/application.h File Reference}{62}{section.9.13}}
\newlabel{application_8h}{{9.13}{62}{inc/application.h File Reference}{section.9.13}{}}
\newlabel{application_8h_a71be4a990011c7b00830abf5f3b2190d}{{9.13}{63}{Macros}{section*.49}{}}
\newlabel{application_8h_a6a53a6c94a70cc286e300a0ea8f46ba4}{{9.13}{63}{Macros}{section*.49}{}}
\newlabel{application_8h_ac33ed2ced8112df86c931eeadd9146b2}{{9.13}{63}{Macros}{section*.49}{}}
\newlabel{application_8h_a304fd59b0fc2e8306dc3593bfa339e85}{{9.13}{63}{Macros}{section*.49}{}}
\newlabel{application_8h_a5a7c79253c2e5117ecc29a8a6d8864c7}{{9.13}{63}{Macros}{section*.49}{}}
\newlabel{application_8h_affede87460e0ca4c46b3a67e9eed7252}{{9.13}{63}{Macros}{section*.49}{}}
\newlabel{application_8h_a72f90a6a502f2b36e69642e399ef095e}{{9.13}{63}{Macros}{section*.49}{}}
\newlabel{application_8h_a5681625b00ef266b6f40ed3d929f3994}{{9.13}{63}{Macros}{section*.49}{}}
\newlabel{application_8h_ad3f36a35130def93e899ca88dab3271b}{{9.13}{63}{Macros}{section*.49}{}}
\newlabel{application_8h_a8ed36c3a0862bf0613fde72fc6f867fc}{{9.13}{63}{Macros}{section*.49}{}}
\newlabel{application_8h_a0710acd18175d909399e6b46f466929f}{{9.13}{63}{Macros}{section*.49}{}}
\newlabel{application_8h_abdf995a8ce125dfeef6c4828930da080}{{9.13}{63}{Macros}{section*.49}{}}
\newlabel{application_8h_a27572d2787651eb2a3ad6eb08b713bca}{{9.13}{63}{Macros}{section*.49}{}}
\newlabel{application_8h_aece3229b2b6280a49b76fa09d0388f28}{{9.13}{63}{Macros}{section*.49}{}}
\newlabel{application_8h_aff79330fdc21dadc176bd41b7918bfb8}{{9.13}{63}{Macros}{section*.49}{}}
\newlabel{application_8h_ad642956861aa4bd21dc6b0d600b729d6}{{9.13}{63}{Macros}{section*.49}{}}
\newlabel{application_8h_a94ee2c165b8234eb398e71ebcb607c4f}{{9.13}{63}{Macros}{section*.49}{}}
\newlabel{application_8h_a6cb127c1c7f3d155f43090640b401f2c}{{9.13}{63}{Macros}{section*.49}{}}
\newlabel{application_8h_a792fd0d95457f39c571eae7ca861be7f}{{9.13}{63}{Macros}{section*.49}{}}
\newlabel{application_8h_acf2762d46e54c20986eb120bddd525fd}{{9.13}{63}{Macros}{section*.49}{}}
\newlabel{application_8h_a7a2abf58047fe69a7ad2a30f53e4be3f}{{9.13}{63}{Macros}{section*.49}{}}
\newlabel{application_8h_a1751dfa7077c9e0937622a4246b6a5b4}{{9.13}{63}{Macros}{section*.49}{}}
\newlabel{application_8h_ad640b7b7fb9e6d507bc3fa6cc232d01a}{{9.13}{63}{Macros}{section*.49}{}}
\newlabel{application_8h_a610ce945f490a1f4f600f13c497f3fc3}{{9.13}{63}{Macros}{section*.49}{}}
\newlabel{application_8h_abb51525076240d03970b593f99e8d15b}{{9.13}{63}{Macros}{section*.49}{}}
\newlabel{application_8h_af8d9daf3b15940a7c2931615a08a7d80}{{9.13}{63}{Macros}{section*.49}{}}
\newlabel{application_8h_ab30e2d6f3ee7cc6e0ba9fc2f3beb5ac6}{{9.13}{63}{Macros}{section*.49}{}}
\newlabel{application_8h_adfc61aa860f1cbb42ad9611aa21bbd34}{{9.13}{63}{Macros}{section*.49}{}}
\newlabel{application_8h_a98374b3ed7ab743e79aaff799fc0c737}{{9.13}{63}{Macros}{section*.49}{}}
\newlabel{application_8h_ac1dea134187c4dd26a028d0964538d48}{{9.13}{63}{Macros}{section*.49}{}}
\newlabel{application_8h_abc0ef5091e06abf8599cf6b52929c32c}{{9.13}{63}{Macros}{section*.49}{}}
\newlabel{application_8h_a7fe5218765bcbcec5633fbc83c77e642}{{9.13}{63}{Macros}{section*.49}{}}
\newlabel{application_8h_ab412fff656e8ef08cd115139d45aa238}{{9.13}{63}{Macros}{section*.49}{}}
\newlabel{application_8h_abf4678f2fb7e65236d03f363fc26c73f}{{9.13}{63}{Macros}{section*.49}{}}
\newlabel{application_8h_aa9300fdf7c9f91715623305c2b7650ea}{{9.13}{63}{Macros}{section*.49}{}}
\newlabel{application_8h_a8b1196a0e39250646bc45f17964ea737}{{9.13}{63}{Macros}{section*.49}{}}
\newlabel{application_8h_af9e5b4a157af0235b013e025a2b8fe4e}{{9.13}{63}{Macros}{section*.49}{}}
\newlabel{application_8h_ae4620bfd25b46dff0cb1f3de5e3283eb}{{9.13}{63}{Macros}{section*.49}{}}
\newlabel{application_8h_a12f15312ae33e2a31fc41ebc7b3fbd38}{{9.13}{63}{Macros}{section*.49}{}}
\newlabel{application_8h_a5658e2f1f1279f0da3f2f57da496549a}{{9.13}{63}{Macros}{section*.49}{}}
\newlabel{application_8h_af20f8c0b33c89785db48e28f7aaac7f9}{{9.13}{63}{Macros}{section*.49}{}}
\newlabel{application_8h_ad34dc641842c11d549bd55627da56ded}{{9.13}{63}{Macros}{section*.49}{}}
\newlabel{application_8h_acfa73f2fd0ffa6ab61bbd1c2d388d1df}{{9.13}{63}{Macros}{section*.49}{}}
\newlabel{application_8h_af2e439f2b04834d172773e10ee426317}{{9.13}{63}{Macros}{section*.49}{}}
\gdef \PWST@xxxv{1}
\newlabel{application_8h_aa4805281aa2b04894f32e3da9e5a340e}{{9.13}{64}{Macros}{section*.49}{}}
\newlabel{application_8h_ab0bc2304f15c0f90a2eaa1dfd2a87df0}{{9.13}{64}{Macros}{section*.49}{}}
\newlabel{application_8h_a13d9e1c12926c3cf40995d4b5baafd1a}{{9.13}{64}{Functions}{section*.50}{}}
\@writefile{toc}{\contentsline {subsection}{\numberline {9.13.1}Detailed Description}{64}{subsection.9.13.1}}
\@writefile{toc}{\contentsline {subsection}{\numberline {9.13.2}Macro Definition Documentation}{64}{subsection.9.13.2}}
\@writefile{toc}{\contentsline {subsubsection}{\numberline {9.13.2.1}U\discretionary {\unhbox \voidb@x \hbox {\relax \fontsize  {7}{8}\selectfont  $\leftarrow \joinrel  \rhook $}}{}{}\_\discretionary {\unhbox \voidb@x \hbox {\relax \fontsize  {7}{8}\selectfont  $\leftarrow \joinrel  \rhook $}}{}{}\discretionary {\unhbox \voidb@x \hbox {\relax \fontsize  {7}{8}\selectfont  $\leftarrow \joinrel  \rhook $}}{}{}D\discretionary {\unhbox \voidb@x \hbox {\relax \fontsize  {7}{8}\selectfont  $\leftarrow \joinrel  \rhook $}}{}{}I\discretionary {\unhbox \voidb@x \hbox {\relax \fontsize  {7}{8}\selectfont  $\leftarrow \joinrel  \rhook $}}{}{}F\discretionary {\unhbox \voidb@x \hbox {\relax \fontsize  {7}{8}\selectfont  $\leftarrow \joinrel  \rhook $}}{}{}F}{64}{subsubsection.9.13.2.1}}
\newlabel{application_8h_ae50dd200af8b9f7da9406922f71655bc}{{9.13.2.1}{64}{U\+\_\+\+D\+I\+F\+F}{subsubsection.9.13.2.1}{}}
\@writefile{toc}{\contentsline {subsection}{\numberline {9.13.3}Function Documentation}{64}{subsection.9.13.3}}
\@writefile{toc}{\contentsline {subsubsection}{\numberline {9.13.3.1}set\discretionary {\unhbox \voidb@x \hbox {\relax \fontsize  {7}{8}\selectfont  $\leftarrow \joinrel  \rhook $}}{}{}\_\discretionary {\unhbox \voidb@x \hbox {\relax \fontsize  {7}{8}\selectfont  $\leftarrow \joinrel  \rhook $}}{}{}led}{64}{subsubsection.9.13.3.1}}
\newlabel{application_8h_a972149ddf8c5a245a0457877732117bc}{{9.13.3.1}{64}{set\+\_\+led}{subsubsection.9.13.3.1}{}}
\@writefile{toc}{\contentsline {section}{\numberline {9.14}inc/main.h File Reference}{64}{section.9.14}}
\newlabel{main_8h}{{9.14}{64}{inc/main.h File Reference}{section.9.14}{}}
\@writefile{toc}{\contentsline {subsection}{\numberline {9.14.1}Detailed Description}{65}{subsection.9.14.1}}
\@writefile{toc}{\contentsline {section}{\numberline {9.15}inc/system\discretionary {\unhbox \voidb@x \hbox {\relax \fontsize  {7}{8}\selectfont  $\leftarrow \joinrel  \rhook $}}{}{}\_\discretionary {\unhbox \voidb@x \hbox {\relax \fontsize  {7}{8}\selectfont  $\leftarrow \joinrel  \rhook $}}{}{}stm32l0xx.h File Reference}{66}{section.9.15}}
\newlabel{system__stm32l0xx_8h}{{9.15}{66}{inc/system\+\_\+stm32l0xx.h File Reference}{section.9.15}{}}
\@writefile{toc}{\contentsline {subsection}{\numberline {9.15.1}Detailed Description}{66}{subsection.9.15.1}}
\@writefile{toc}{\contentsline {section}{\numberline {9.16}src/application.c File Reference}{67}{section.9.16}}
\newlabel{application_8c}{{9.16}{67}{src/application.c File Reference}{section.9.16}{}}
\newlabel{application_8c_a13d9e1c12926c3cf40995d4b5baafd1a}{{9.16}{67}{Functions}{section*.54}{}}
\newlabel{application_8c_a16ab82c8a753266e4ffede309ca4259c}{{9.16}{67}{Functions}{section*.54}{}}
\gdef \PWST@xxxvi{1}
\newlabel{application_8c_a2080215bcaaf67f6e9b87b06c6f32a47}{{9.16}{68}{Functions}{section*.54}{}}
\newlabel{application_8c_abd5a655d2ae02e2266a2215f3b2e64d1}{{9.16}{68}{Variables}{section*.55}{}}
\newlabel{application_8c_a7882ae0be5c0e7308062c842d3fe7c88}{{9.16}{68}{Variables}{section*.55}{}}
\newlabel{application_8c_a817070dd4b0bdeb10561d20e8da689cb}{{9.16}{68}{Variables}{section*.55}{}}
\newlabel{application_8c_ad3cadd4aa11ddf117d1ede07739be9b4}{{9.16}{68}{Variables}{section*.55}{}}
\newlabel{application_8c_a27a5c8ab16e81cd991cb5ca2380eedf8}{{9.16}{68}{Variables}{section*.55}{}}
\@writefile{toc}{\contentsline {subsection}{\numberline {9.16.1}Detailed Description}{68}{subsection.9.16.1}}
\@writefile{toc}{\contentsline {subsection}{\numberline {9.16.2}Function Documentation}{68}{subsection.9.16.2}}
\@writefile{toc}{\contentsline {subsubsection}{\numberline {9.16.2.1}crc16\discretionary {\unhbox \voidb@x \hbox {\relax \fontsize  {7}{8}\selectfont  $\leftarrow \joinrel  \rhook $}}{}{}\_\discretionary {\unhbox \voidb@x \hbox {\relax \fontsize  {7}{8}\selectfont  $\leftarrow \joinrel  \rhook $}}{}{}ok}{68}{subsubsection.9.16.2.1}}
\newlabel{application_8c_a985b46cca3411314489e668a89ccce54}{{9.16.2.1}{68}{crc16\+\_\+ok}{subsubsection.9.16.2.1}{}}
\@writefile{toc}{\contentsline {subsubsection}{\numberline {9.16.2.2}get\discretionary {\unhbox \voidb@x \hbox {\relax \fontsize  {7}{8}\selectfont  $\leftarrow \joinrel  \rhook $}}{}{}\_\discretionary {\unhbox \voidb@x \hbox {\relax \fontsize  {7}{8}\selectfont  $\leftarrow \joinrel  \rhook $}}{}{}error\discretionary {\unhbox \voidb@x \hbox {\relax \fontsize  {7}{8}\selectfont  $\leftarrow \joinrel  \rhook $}}{}{}\_\discretionary {\unhbox \voidb@x \hbox {\relax \fontsize  {7}{8}\selectfont  $\leftarrow \joinrel  \rhook $}}{}{}code}{68}{subsubsection.9.16.2.2}}
\newlabel{application_8c_ad85f4406496b593af05dbaed475462e9}{{9.16.2.2}{68}{get\+\_\+error\+\_\+code}{subsubsection.9.16.2.2}{}}
\gdef \PWST@xxxvii{1}
\gdef \PWST@xxxviii{1}
\gdef \PWST@xxxix{1}
\gdef \PWST@xl{1}
\gdef \PWST@xli{1}
\gdef \PWST@xlii{1}
\gdef \PWST@xliii{1}
\@writefile{toc}{\contentsline {subsubsection}{\numberline {9.16.2.3}get\discretionary {\unhbox \voidb@x \hbox {\relax \fontsize  {7}{8}\selectfont  $\leftarrow \joinrel  \rhook $}}{}{}\_\discretionary {\unhbox \voidb@x \hbox {\relax \fontsize  {7}{8}\selectfont  $\leftarrow \joinrel  \rhook $}}{}{}plate\discretionary {\unhbox \voidb@x \hbox {\relax \fontsize  {7}{8}\selectfont  $\leftarrow \joinrel  \rhook $}}{}{}\_\discretionary {\unhbox \voidb@x \hbox {\relax \fontsize  {7}{8}\selectfont  $\leftarrow \joinrel  \rhook $}}{}{}state}{69}{subsubsection.9.16.2.3}}
\newlabel{application_8c_a36dcfc6fee22b0974badca8dff09e55d}{{9.16.2.3}{69}{get\+\_\+plate\+\_\+state}{subsubsection.9.16.2.3}{}}
\@writefile{toc}{\contentsline {subsubsection}{\numberline {9.16.2.4}is\discretionary {\unhbox \voidb@x \hbox {\relax \fontsize  {7}{8}\selectfont  $\leftarrow \joinrel  \rhook $}}{}{}\_\discretionary {\unhbox \voidb@x \hbox {\relax \fontsize  {7}{8}\selectfont  $\leftarrow \joinrel  \rhook $}}{}{}last\discretionary {\unhbox \voidb@x \hbox {\relax \fontsize  {7}{8}\selectfont  $\leftarrow \joinrel  \rhook $}}{}{}\_\discretionary {\unhbox \voidb@x \hbox {\relax \fontsize  {7}{8}\selectfont  $\leftarrow \joinrel  \rhook $}}{}{}board}{69}{subsubsection.9.16.2.4}}
\newlabel{application_8c_af0c030ef2e6fcfbc87477d3f0ff9450a}{{9.16.2.4}{69}{is\+\_\+last\+\_\+board}{subsubsection.9.16.2.4}{}}
\@writefile{toc}{\contentsline {subsubsection}{\numberline {9.16.2.5}lpuart\discretionary {\unhbox \voidb@x \hbox {\relax \fontsize  {7}{8}\selectfont  $\leftarrow \joinrel  \rhook $}}{}{}\_\discretionary {\unhbox \voidb@x \hbox {\relax \fontsize  {7}{8}\selectfont  $\leftarrow \joinrel  \rhook $}}{}{}received\discretionary {\unhbox \voidb@x \hbox {\relax \fontsize  {7}{8}\selectfont  $\leftarrow \joinrel  \rhook $}}{}{}\_\discretionary {\unhbox \voidb@x \hbox {\relax \fontsize  {7}{8}\selectfont  $\leftarrow \joinrel  \rhook $}}{}{}handler}{69}{subsubsection.9.16.2.5}}
\newlabel{application_8c_a9cbc3d9fe770f18edadfac923e609164}{{9.16.2.5}{69}{lpuart\+\_\+received\+\_\+handler}{subsubsection.9.16.2.5}{}}
\@writefile{toc}{\contentsline {subsubsection}{\numberline {9.16.2.6}measure\discretionary {\unhbox \voidb@x \hbox {\relax \fontsize  {7}{8}\selectfont  $\leftarrow \joinrel  \rhook $}}{}{}\_\discretionary {\unhbox \voidb@x \hbox {\relax \fontsize  {7}{8}\selectfont  $\leftarrow \joinrel  \rhook $}}{}{}state\discretionary {\unhbox \voidb@x \hbox {\relax \fontsize  {7}{8}\selectfont  $\leftarrow \joinrel  \rhook $}}{}{}\_\discretionary {\unhbox \voidb@x \hbox {\relax \fontsize  {7}{8}\selectfont  $\leftarrow \joinrel  \rhook $}}{}{}machine}{69}{subsubsection.9.16.2.6}}
\newlabel{application_8c_a4c6bb82dbda8b2832ea1da7405a140d1}{{9.16.2.6}{69}{measure\+\_\+state\+\_\+machine}{subsubsection.9.16.2.6}{}}
\@writefile{toc}{\contentsline {subsubsection}{\numberline {9.16.2.7}set\discretionary {\unhbox \voidb@x \hbox {\relax \fontsize  {7}{8}\selectfont  $\leftarrow \joinrel  \rhook $}}{}{}\_\discretionary {\unhbox \voidb@x \hbox {\relax \fontsize  {7}{8}\selectfont  $\leftarrow \joinrel  \rhook $}}{}{}led}{69}{subsubsection.9.16.2.7}}
\newlabel{application_8c_a972149ddf8c5a245a0457877732117bc}{{9.16.2.7}{69}{set\+\_\+led}{subsubsection.9.16.2.7}{}}
\@writefile{toc}{\contentsline {subsubsection}{\numberline {9.16.2.8}usart\discretionary {\unhbox \voidb@x \hbox {\relax \fontsize  {7}{8}\selectfont  $\leftarrow \joinrel  \rhook $}}{}{}\_\discretionary {\unhbox \voidb@x \hbox {\relax \fontsize  {7}{8}\selectfont  $\leftarrow \joinrel  \rhook $}}{}{}received\discretionary {\unhbox \voidb@x \hbox {\relax \fontsize  {7}{8}\selectfont  $\leftarrow \joinrel  \rhook $}}{}{}\_\discretionary {\unhbox \voidb@x \hbox {\relax \fontsize  {7}{8}\selectfont  $\leftarrow \joinrel  \rhook $}}{}{}handler}{69}{subsubsection.9.16.2.8}}
\newlabel{application_8c_aeb51d77ac5f7ea3f81d0ba5adb585b0f}{{9.16.2.8}{69}{usart\+\_\+received\+\_\+handler}{subsubsection.9.16.2.8}{}}
\gdef \PWST@xliv{1}
\@writefile{toc}{\contentsline {section}{\numberline {9.17}src/main.c File Reference}{70}{section.9.17}}
\newlabel{main_8c}{{9.17}{70}{src/main.c File Reference}{section.9.17}{}}
\newlabel{main_8c_ae66f6b31b5ad750f1fe042a706a4e3d4}{{9.17}{70}{Functions}{section*.56}{}}
\@writefile{toc}{\contentsline {subsection}{\numberline {9.17.1}Detailed Description}{70}{subsection.9.17.1}}
\@writefile{toc}{\contentsline {section}{\numberline {9.18}src/system\discretionary {\unhbox \voidb@x \hbox {\relax \fontsize  {7}{8}\selectfont  $\leftarrow \joinrel  \rhook $}}{}{}\_\discretionary {\unhbox \voidb@x \hbox {\relax \fontsize  {7}{8}\selectfont  $\leftarrow \joinrel  \rhook $}}{}{}stm32l0xx.c File Reference}{70}{section.9.18}}
\newlabel{system__stm32l0xx_8c}{{9.18}{70}{src/system\+\_\+stm32l0xx.c File Reference}{section.9.18}{}}
\@writefile{toc}{\contentsline {subsection}{\numberline {9.18.1}Detailed Description}{71}{subsection.9.18.1}}
