{
    "panes": {
        "quadrants": [
            "Source",
            "Console",
            "TabSet1",
            "TabSet2"
        ],
        "tabSet1": [
            "Environment",
            "History",
            "Connections",
            "Build",
            "VCS",
            "Tutorial",
            "Presentation"
        ],
        "tabSet2": [
            "Files",
            "Plots",
            "Packages",
            "Help",
            "Viewer",
            "Presentations"
        ],
        "hiddenTabSet": [],
        "console_left_on_top": false,
        "console_right_on_top": true,
        "additional_source_columns": 0
    },
    "save_workspace": "never",
    "load_workspace": false,
    "auto_append_newline": true,
    "font_size_points": 11,
    "editor_theme": "Monokai",
    "posix_terminal_shell": "bash",
    "default_project_location": "~/work",
    "initial_working_directory": "~/work/hdbi-data-outputs-quarto-presentations",
    "use_spaces_for_tab": false,
    "num_spaces_for_tab": 4,
    "insert_native_pipe_operator": true,
    "show_invisibles": true,
    "show_indent_guides": true,
    "scroll_past_end_of_document": true,
    "rainbow_parentheses": true,
    "code_completion_characters": 2,
    "server_editor_font_enabled": true,
    "server_editor_font": "Fira Code",
    "show_doc_outline_rmd": true,
    "terminal_bell_style": "none",
    "show_hidden_files": true,
    "jobs_tab_visibility": "shown"
}