com\atguigu\jxc\dao\RoleMenuDao.class
com\atguigu\jxc\controller\GoodsController.class
com\atguigu\jxc\entity\PurchaseListGoods.class
com\atguigu\jxc\service\PurchaseListGoodsService.class
com\atguigu\jxc\dao\MenuDao.class
com\atguigu\jxc\controller\DrawImageController.class
com\atguigu\jxc\domain\SuccessCode.class
com\atguigu\jxc\entity\Log.class
com\atguigu\jxc\service\RoleService.class
com\atguigu\jxc\dao\GoodsTypeDao.class
com\atguigu\jxc\util\BigDecimalUtil.class
com\atguigu\jxc\dao\SaleListGoodsDao.class
com\atguigu\jxc\dao\UserRoleDao.class
com\atguigu\jxc\entity\DamageListGoods.class
com\atguigu\jxc\entity\SaleListGoods.class
com\atguigu\jxc\dao\ReturnListGoodsDao.class
com\atguigu\jxc\entity\SaleData.class
com\atguigu\jxc\dao\LogDao.class
com\atguigu\jxc\entity\PurchaseList.class
com\atguigu\jxc\dao\PurchaseListGoodsDao.class
com\atguigu\jxc\service\impl\LogServiceImpl.class
com\atguigu\jxc\service\ReturnListGoodsService.class
com\atguigu\jxc\service\GoodsTypeService.class
com\atguigu\jxc\controller\MenuController.class
com\atguigu\jxc\entity\CustomerReturnList.class
com\atguigu\jxc\entity\OverflowList.class
com\atguigu\jxc\service\impl\GoodsTypeServiceImpl.class
com\atguigu\jxc\dao\CustomerReturnListGoodsDao.class
com\atguigu\jxc\dao\UserDao.class
com\atguigu\jxc\service\MenuService.class
com\atguigu\jxc\dao\RoleDao.class
com\atguigu\jxc\service\DrawImageService.class
com\atguigu\jxc\config\ShiroConfig.class
com\atguigu\jxc\entity\UserLogin.class
com\atguigu\jxc\controller\LogController.class
com\atguigu\jxc\service\UserService.class
com\atguigu\jxc\entity\ReturnList.class
com\atguigu\jxc\entity\CustomerReturnListGoods.class
com\atguigu\jxc\service\CustomerReturnListGoodsService.class
com\atguigu\jxc\entity\Customer.class
com\atguigu\jxc\entity\Goods.class
com\atguigu\jxc\entity\UserRole.class
com\atguigu\jxc\entity\Unit.class
com\atguigu\jxc\entity\OverflowListGoods.class
com\atguigu\jxc\domain\ErrorCode.class
com\atguigu\jxc\service\impl\SaleListGoodsServiceImpl.class
com\atguigu\jxc\service\SaleListGoodsService.class
com\atguigu\jxc\config\MyRealm.class
com\atguigu\jxc\entity\Menu.class
com\atguigu\jxc\entity\RoleMenu.class
com\atguigu\jxc\service\impl\CustomerReturnListGoodsServiceImpl.class
com\atguigu\jxc\service\impl\DrawImageServiceImpl.class
com\atguigu\jxc\service\impl\PurchaseListGoodsServiceImpl.class
com\atguigu\jxc\domain\ServiceVO.class
com\atguigu\jxc\entity\ReturnListGoods.class
com\atguigu\jxc\controller\PurchaseListGoodsController.class
com\atguigu\jxc\service\impl\ReturnListGoodsServiceImpl.class
com\atguigu\jxc\dao\GoodsDao.class
com\atguigu\jxc\entity\DamageList.class
com\atguigu\jxc\JxcApplication.class
com\atguigu\jxc\controller\CustomerReturnListGoodsController.class
com\atguigu\jxc\service\impl\RoleServiceImpl.class
com\atguigu\jxc\controller\ReturnListGoodsController.class
com\atguigu\jxc\entity\Supplier.class
com\atguigu\jxc\controller\IndexController.class
com\atguigu\jxc\service\impl\UserServiceImpl.class
com\atguigu\jxc\service\impl\GoodsServiceImpl.class
com\atguigu\jxc\util\DateUtil.class
com\atguigu\jxc\service\impl\MenuServiceImpl.class
com\atguigu\jxc\util\StringUtil.class
com\atguigu\jxc\controller\SaleListGoodsController.class
com\atguigu\jxc\controller\RoleController.class
com\atguigu\jxc\entity\Role.class
com\atguigu\jxc\controller\GoodsTypeController.class
com\atguigu\jxc\entity\SaleList.class
com\atguigu\jxc\controller\UserController.class
com\atguigu\jxc\service\GoodsService.class
com\atguigu\jxc\service\LogService.class
com\atguigu\jxc\entity\User.class
com\atguigu\jxc\entity\GoodsType.class
