<?xml version="1.0" encoding="UTF-8"?>
<testsuite xmlns:xsi="http://www.w3.org/2001/XMLSchema-instance" xsi:noNamespaceSchemaLocation="https://maven.apache.org/surefire/maven-surefire-plugin/xsd/surefire-test-report.xsd" name="com.atguigu.jxc.JxcApplicationTests" time="4.88" tests="1" errors="0" skipped="0" failures="0">
  <properties>
    <property name="sun.desktop" value="windows"/>
    <property name="awt.toolkit" value="sun.awt.windows.WToolkit"/>
    <property name="file.encoding.pkg" value="sun.io"/>
    <property name="java.specification.version" value="1.8"/>
    <property name="sun.cpu.isalist" value="amd64"/>
    <property name="sun.jnu.encoding" value="GBK"/>
    <property name="java.class.path" value="F:\jxc\target\test-classes;F:\jxc\target\classes;F:\maven\apache-maven-3.6.3-bin\apache-maven-3.6.3\respository\org\springframework\boot\spring-boot-starter\2.7.6\spring-boot-starter-2.7.6.jar;F:\maven\apache-maven-3.6.3-bin\apache-maven-3.6.3\respository\org\springframework\boot\spring-boot\2.7.6\spring-boot-2.7.6.jar;F:\maven\apache-maven-3.6.3-bin\apache-maven-3.6.3\respository\org\springframework\spring-context\5.3.24\spring-context-5.3.24.jar;F:\maven\apache-maven-3.6.3-bin\apache-maven-3.6.3\respository\org\springframework\boot\spring-boot-autoconfigure\2.7.6\spring-boot-autoconfigure-2.7.6.jar;F:\maven\apache-maven-3.6.3-bin\apache-maven-3.6.3\respository\org\springframework\boot\spring-boot-starter-logging\2.7.6\spring-boot-starter-logging-2.7.6.jar;F:\maven\apache-maven-3.6.3-bin\apache-maven-3.6.3\respository\ch\qos\logback\logback-classic\1.2.11\logback-classic-1.2.11.jar;F:\maven\apache-maven-3.6.3-bin\apache-maven-3.6.3\respository\ch\qos\logback\logback-core\1.2.11\logback-core-1.2.11.jar;F:\maven\apache-maven-3.6.3-bin\apache-maven-3.6.3\respository\org\apache\logging\log4j\log4j-to-slf4j\2.17.2\log4j-to-slf4j-2.17.2.jar;F:\maven\apache-maven-3.6.3-bin\apache-maven-3.6.3\respository\org\apache\logging\log4j\log4j-api\2.17.2\log4j-api-2.17.2.jar;F:\maven\apache-maven-3.6.3-bin\apache-maven-3.6.3\respository\org\slf4j\jul-to-slf4j\1.7.36\jul-to-slf4j-1.7.36.jar;F:\maven\apache-maven-3.6.3-bin\apache-maven-3.6.3\respository\jakarta\annotation\jakarta.annotation-api\1.3.5\jakarta.annotation-api-1.3.5.jar;F:\maven\apache-maven-3.6.3-bin\apache-maven-3.6.3\respository\org\springframework\spring-core\5.3.24\spring-core-5.3.24.jar;F:\maven\apache-maven-3.6.3-bin\apache-maven-3.6.3\respository\org\springframework\spring-jcl\5.3.24\spring-jcl-5.3.24.jar;F:\maven\apache-maven-3.6.3-bin\apache-maven-3.6.3\respository\org\yaml\snakeyaml\1.30\snakeyaml-1.30.jar;F:\maven\apache-maven-3.6.3-bin\apache-maven-3.6.3\respository\org\springframework\boot\spring-boot-starter-web\2.7.6\spring-boot-starter-web-2.7.6.jar;F:\maven\apache-maven-3.6.3-bin\apache-maven-3.6.3\respository\org\springframework\boot\spring-boot-starter-json\2.7.6\spring-boot-starter-json-2.7.6.jar;F:\maven\apache-maven-3.6.3-bin\apache-maven-3.6.3\respository\com\fasterxml\jackson\core\jackson-databind\2.13.4.2\jackson-databind-2.13.4.2.jar;F:\maven\apache-maven-3.6.3-bin\apache-maven-3.6.3\respository\com\fasterxml\jackson\core\jackson-annotations\2.13.4\jackson-annotations-2.13.4.jar;F:\maven\apache-maven-3.6.3-bin\apache-maven-3.6.3\respository\com\fasterxml\jackson\core\jackson-core\2.13.4\jackson-core-2.13.4.jar;F:\maven\apache-maven-3.6.3-bin\apache-maven-3.6.3\respository\com\fasterxml\jackson\datatype\jackson-datatype-jdk8\2.13.4\jackson-datatype-jdk8-2.13.4.jar;F:\maven\apache-maven-3.6.3-bin\apache-maven-3.6.3\respository\com\fasterxml\jackson\datatype\jackson-datatype-jsr310\2.13.4\jackson-datatype-jsr310-2.13.4.jar;F:\maven\apache-maven-3.6.3-bin\apache-maven-3.6.3\respository\com\fasterxml\jackson\module\jackson-module-parameter-names\2.13.4\jackson-module-parameter-names-2.13.4.jar;F:\maven\apache-maven-3.6.3-bin\apache-maven-3.6.3\respository\org\springframework\boot\spring-boot-starter-tomcat\2.7.6\spring-boot-starter-tomcat-2.7.6.jar;F:\maven\apache-maven-3.6.3-bin\apache-maven-3.6.3\respository\org\apache\tomcat\embed\tomcat-embed-core\9.0.69\tomcat-embed-core-9.0.69.jar;F:\maven\apache-maven-3.6.3-bin\apache-maven-3.6.3\respository\org\apache\tomcat\embed\tomcat-embed-el\9.0.69\tomcat-embed-el-9.0.69.jar;F:\maven\apache-maven-3.6.3-bin\apache-maven-3.6.3\respository\org\apache\tomcat\embed\tomcat-embed-websocket\9.0.69\tomcat-embed-websocket-9.0.69.jar;F:\maven\apache-maven-3.6.3-bin\apache-maven-3.6.3\respository\org\springframework\spring-web\5.3.24\spring-web-5.3.24.jar;F:\maven\apache-maven-3.6.3-bin\apache-maven-3.6.3\respository\org\springframework\spring-beans\5.3.24\spring-beans-5.3.24.jar;F:\maven\apache-maven-3.6.3-bin\apache-maven-3.6.3\respository\org\springframework\spring-webmvc\5.3.24\spring-webmvc-5.3.24.jar;F:\maven\apache-maven-3.6.3-bin\apache-maven-3.6.3\respository\org\springframework\spring-aop\5.3.24\spring-aop-5.3.24.jar;F:\maven\apache-maven-3.6.3-bin\apache-maven-3.6.3\respository\org\springframework\spring-expression\5.3.24\spring-expression-5.3.24.jar;F:\maven\apache-maven-3.6.3-bin\apache-maven-3.6.3\respository\org\mybatis\spring\boot\mybatis-spring-boot-starter\1.3.2\mybatis-spring-boot-starter-1.3.2.jar;F:\maven\apache-maven-3.6.3-bin\apache-maven-3.6.3\respository\org\springframework\boot\spring-boot-starter-jdbc\2.7.6\spring-boot-starter-jdbc-2.7.6.jar;F:\maven\apache-maven-3.6.3-bin\apache-maven-3.6.3\respository\com\zaxxer\HikariCP\4.0.3\HikariCP-4.0.3.jar;F:\maven\apache-maven-3.6.3-bin\apache-maven-3.6.3\respository\org\springframework\spring-jdbc\5.3.24\spring-jdbc-5.3.24.jar;F:\maven\apache-maven-3.6.3-bin\apache-maven-3.6.3\respository\org\springframework\spring-tx\5.3.24\spring-tx-5.3.24.jar;F:\maven\apache-maven-3.6.3-bin\apache-maven-3.6.3\respository\org\mybatis\spring\boot\mybatis-spring-boot-autoconfigure\1.3.2\mybatis-spring-boot-autoconfigure-1.3.2.jar;F:\maven\apache-maven-3.6.3-bin\apache-maven-3.6.3\respository\org\mybatis\mybatis\3.4.6\mybatis-3.4.6.jar;F:\maven\apache-maven-3.6.3-bin\apache-maven-3.6.3\respository\org\mybatis\mybatis-spring\1.3.2\mybatis-spring-1.3.2.jar;F:\maven\apache-maven-3.6.3-bin\apache-maven-3.6.3\respository\mysql\mysql-connector-java\5.1.47\mysql-connector-java-5.1.47.jar;F:\maven\apache-maven-3.6.3-bin\apache-maven-3.6.3\respository\org\springframework\boot\spring-boot-starter-test\2.7.6\spring-boot-starter-test-2.7.6.jar;F:\maven\apache-maven-3.6.3-bin\apache-maven-3.6.3\respository\org\springframework\boot\spring-boot-test\2.7.6\spring-boot-test-2.7.6.jar;F:\maven\apache-maven-3.6.3-bin\apache-maven-3.6.3\respository\org\springframework\boot\spring-boot-test-autoconfigure\2.7.6\spring-boot-test-autoconfigure-2.7.6.jar;F:\maven\apache-maven-3.6.3-bin\apache-maven-3.6.3\respository\com\jayway\jsonpath\json-path\2.7.0\json-path-2.7.0.jar;F:\maven\apache-maven-3.6.3-bin\apache-maven-3.6.3\respository\net\minidev\json-smart\2.4.8\json-smart-2.4.8.jar;F:\maven\apache-maven-3.6.3-bin\apache-maven-3.6.3\respository\net\minidev\accessors-smart\2.4.8\accessors-smart-2.4.8.jar;F:\maven\apache-maven-3.6.3-bin\apache-maven-3.6.3\respository\org\ow2\asm\asm\9.1\asm-9.1.jar;F:\maven\apache-maven-3.6.3-bin\apache-maven-3.6.3\respository\org\slf4j\slf4j-api\1.7.36\slf4j-api-1.7.36.jar;F:\maven\apache-maven-3.6.3-bin\apache-maven-3.6.3\respository\jakarta\xml\bind\jakarta.xml.bind-api\2.3.3\jakarta.xml.bind-api-2.3.3.jar;F:\maven\apache-maven-3.6.3-bin\apache-maven-3.6.3\respository\jakarta\activation\jakarta.activation-api\1.2.2\jakarta.activation-api-1.2.2.jar;F:\maven\apache-maven-3.6.3-bin\apache-maven-3.6.3\respository\org\assertj\assertj-core\3.22.0\assertj-core-3.22.0.jar;F:\maven\apache-maven-3.6.3-bin\apache-maven-3.6.3\respository\org\hamcrest\hamcrest\2.2\hamcrest-2.2.jar;F:\maven\apache-maven-3.6.3-bin\apache-maven-3.6.3\respository\org\junit\jupiter\junit-jupiter\5.8.2\junit-jupiter-5.8.2.jar;F:\maven\apache-maven-3.6.3-bin\apache-maven-3.6.3\respository\org\junit\jupiter\junit-jupiter-api\5.8.2\junit-jupiter-api-5.8.2.jar;F:\maven\apache-maven-3.6.3-bin\apache-maven-3.6.3\respository\org\opentest4j\opentest4j\1.2.0\opentest4j-1.2.0.jar;F:\maven\apache-maven-3.6.3-bin\apache-maven-3.6.3\respository\org\junit\platform\junit-platform-commons\1.8.2\junit-platform-commons-1.8.2.jar;F:\maven\apache-maven-3.6.3-bin\apache-maven-3.6.3\respository\org\apiguardian\apiguardian-api\1.1.2\apiguardian-api-1.1.2.jar;F:\maven\apache-maven-3.6.3-bin\apache-maven-3.6.3\respository\org\junit\jupiter\junit-jupiter-params\5.8.2\junit-jupiter-params-5.8.2.jar;F:\maven\apache-maven-3.6.3-bin\apache-maven-3.6.3\respository\org\junit\jupiter\junit-jupiter-engine\5.8.2\junit-jupiter-engine-5.8.2.jar;F:\maven\apache-maven-3.6.3-bin\apache-maven-3.6.3\respository\org\junit\platform\junit-platform-engine\1.8.2\junit-platform-engine-1.8.2.jar;F:\maven\apache-maven-3.6.3-bin\apache-maven-3.6.3\respository\org\mockito\mockito-core\4.5.1\mockito-core-4.5.1.jar;F:\maven\apache-maven-3.6.3-bin\apache-maven-3.6.3\respository\net\bytebuddy\byte-buddy\1.12.19\byte-buddy-1.12.19.jar;F:\maven\apache-maven-3.6.3-bin\apache-maven-3.6.3\respository\net\bytebuddy\byte-buddy-agent\1.12.19\byte-buddy-agent-1.12.19.jar;F:\maven\apache-maven-3.6.3-bin\apache-maven-3.6.3\respository\org\objenesis\objenesis\3.2\objenesis-3.2.jar;F:\maven\apache-maven-3.6.3-bin\apache-maven-3.6.3\respository\org\mockito\mockito-junit-jupiter\4.5.1\mockito-junit-jupiter-4.5.1.jar;F:\maven\apache-maven-3.6.3-bin\apache-maven-3.6.3\respository\org\skyscreamer\jsonassert\1.5.1\jsonassert-1.5.1.jar;F:\maven\apache-maven-3.6.3-bin\apache-maven-3.6.3\respository\com\vaadin\external\google\android-json\0.0.20131108.vaadin1\android-json-0.0.20131108.vaadin1.jar;F:\maven\apache-maven-3.6.3-bin\apache-maven-3.6.3\respository\org\springframework\spring-test\5.3.24\spring-test-5.3.24.jar;F:\maven\apache-maven-3.6.3-bin\apache-maven-3.6.3\respository\org\xmlunit\xmlunit-core\2.9.0\xmlunit-core-2.9.0.jar;F:\maven\apache-maven-3.6.3-bin\apache-maven-3.6.3\respository\org\apache\shiro\shiro-core\1.4.0\shiro-core-1.4.0.jar;F:\maven\apache-maven-3.6.3-bin\apache-maven-3.6.3\respository\org\apache\shiro\shiro-lang\1.4.0\shiro-lang-1.4.0.jar;F:\maven\apache-maven-3.6.3-bin\apache-maven-3.6.3\respository\org\apache\shiro\shiro-cache\1.4.0\shiro-cache-1.4.0.jar;F:\maven\apache-maven-3.6.3-bin\apache-maven-3.6.3\respository\org\apache\shiro\shiro-crypto-hash\1.4.0\shiro-crypto-hash-1.4.0.jar;F:\maven\apache-maven-3.6.3-bin\apache-maven-3.6.3\respository\org\apache\shiro\shiro-crypto-core\1.4.0\shiro-crypto-core-1.4.0.jar;F:\maven\apache-maven-3.6.3-bin\apache-maven-3.6.3\respository\org\apache\shiro\shiro-crypto-cipher\1.4.0\shiro-crypto-cipher-1.4.0.jar;F:\maven\apache-maven-3.6.3-bin\apache-maven-3.6.3\respository\org\apache\shiro\shiro-config-core\1.4.0\shiro-config-core-1.4.0.jar;F:\maven\apache-maven-3.6.3-bin\apache-maven-3.6.3\respository\org\apache\shiro\shiro-config-ogdl\1.4.0\shiro-config-ogdl-1.4.0.jar;F:\maven\apache-maven-3.6.3-bin\apache-maven-3.6.3\respository\commons-beanutils\commons-beanutils\1.9.3\commons-beanutils-1.9.3.jar;F:\maven\apache-maven-3.6.3-bin\apache-maven-3.6.3\respository\commons-collections\commons-collections\3.2.2\commons-collections-3.2.2.jar;F:\maven\apache-maven-3.6.3-bin\apache-maven-3.6.3\respository\org\apache\shiro\shiro-event\1.4.0\shiro-event-1.4.0.jar;F:\maven\apache-maven-3.6.3-bin\apache-maven-3.6.3\respository\org\apache\shiro\shiro-spring\1.4.0\shiro-spring-1.4.0.jar;F:\maven\apache-maven-3.6.3-bin\apache-maven-3.6.3\respository\org\apache\shiro\shiro-web\1.4.0\shiro-web-1.4.0.jar;F:\maven\apache-maven-3.6.3-bin\apache-maven-3.6.3\respository\com\google\code\gson\gson\2.9.1\gson-2.9.1.jar;F:\maven\apache-maven-3.6.3-bin\apache-maven-3.6.3\respository\org\projectlombok\lombok\1.18.24\lombok-1.18.24.jar;"/>
    <property name="java.vm.vendor" value="Oracle Corporation"/>
    <property name="sun.arch.data.model" value="64"/>
    <property name="user.variant" value=""/>
    <property name="java.vendor.url" value="http://java.oracle.com/"/>
    <property name="user.timezone" value="Asia/Shanghai"/>
    <property name="java.vm.specification.version" value="1.8"/>
    <property name="os.name" value="Windows 10"/>
    <property name="user.country" value="CN"/>
    <property name="sun.java.launcher" value="SUN_STANDARD"/>
    <property name="sun.boot.library.path" value="C:\Program Files\Java\jdk1.8.0_271\jre\bin"/>
    <property name="sun.java.command" value="C:\Users\86180\AppData\Local\Temp\surefire1552062968859140225\surefirebooter4662442483271157370.jar C:\Users\86180\AppData\Local\Temp\surefire1552062968859140225 2023-04-10T09-57-07_648-jvmRun1 surefire2552557891321373514tmp surefire_05284046336678638544tmp"/>
    <property name="surefire.test.class.path" value="F:\jxc\target\test-classes;F:\jxc\target\classes;F:\maven\apache-maven-3.6.3-bin\apache-maven-3.6.3\respository\org\springframework\boot\spring-boot-starter\2.7.6\spring-boot-starter-2.7.6.jar;F:\maven\apache-maven-3.6.3-bin\apache-maven-3.6.3\respository\org\springframework\boot\spring-boot\2.7.6\spring-boot-2.7.6.jar;F:\maven\apache-maven-3.6.3-bin\apache-maven-3.6.3\respository\org\springframework\spring-context\5.3.24\spring-context-5.3.24.jar;F:\maven\apache-maven-3.6.3-bin\apache-maven-3.6.3\respository\org\springframework\boot\spring-boot-autoconfigure\2.7.6\spring-boot-autoconfigure-2.7.6.jar;F:\maven\apache-maven-3.6.3-bin\apache-maven-3.6.3\respository\org\springframework\boot\spring-boot-starter-logging\2.7.6\spring-boot-starter-logging-2.7.6.jar;F:\maven\apache-maven-3.6.3-bin\apache-maven-3.6.3\respository\ch\qos\logback\logback-classic\1.2.11\logback-classic-1.2.11.jar;F:\maven\apache-maven-3.6.3-bin\apache-maven-3.6.3\respository\ch\qos\logback\logback-core\1.2.11\logback-core-1.2.11.jar;F:\maven\apache-maven-3.6.3-bin\apache-maven-3.6.3\respository\org\apache\logging\log4j\log4j-to-slf4j\2.17.2\log4j-to-slf4j-2.17.2.jar;F:\maven\apache-maven-3.6.3-bin\apache-maven-3.6.3\respository\org\apache\logging\log4j\log4j-api\2.17.2\log4j-api-2.17.2.jar;F:\maven\apache-maven-3.6.3-bin\apache-maven-3.6.3\respository\org\slf4j\jul-to-slf4j\1.7.36\jul-to-slf4j-1.7.36.jar;F:\maven\apache-maven-3.6.3-bin\apache-maven-3.6.3\respository\jakarta\annotation\jakarta.annotation-api\1.3.5\jakarta.annotation-api-1.3.5.jar;F:\maven\apache-maven-3.6.3-bin\apache-maven-3.6.3\respository\org\springframework\spring-core\5.3.24\spring-core-5.3.24.jar;F:\maven\apache-maven-3.6.3-bin\apache-maven-3.6.3\respository\org\springframework\spring-jcl\5.3.24\spring-jcl-5.3.24.jar;F:\maven\apache-maven-3.6.3-bin\apache-maven-3.6.3\respository\org\yaml\snakeyaml\1.30\snakeyaml-1.30.jar;F:\maven\apache-maven-3.6.3-bin\apache-maven-3.6.3\respository\org\springframework\boot\spring-boot-starter-web\2.7.6\spring-boot-starter-web-2.7.6.jar;F:\maven\apache-maven-3.6.3-bin\apache-maven-3.6.3\respository\org\springframework\boot\spring-boot-starter-json\2.7.6\spring-boot-starter-json-2.7.6.jar;F:\maven\apache-maven-3.6.3-bin\apache-maven-3.6.3\respository\com\fasterxml\jackson\core\jackson-databind\2.13.4.2\jackson-databind-2.13.4.2.jar;F:\maven\apache-maven-3.6.3-bin\apache-maven-3.6.3\respository\com\fasterxml\jackson\core\jackson-annotations\2.13.4\jackson-annotations-2.13.4.jar;F:\maven\apache-maven-3.6.3-bin\apache-maven-3.6.3\respository\com\fasterxml\jackson\core\jackson-core\2.13.4\jackson-core-2.13.4.jar;F:\maven\apache-maven-3.6.3-bin\apache-maven-3.6.3\respository\com\fasterxml\jackson\datatype\jackson-datatype-jdk8\2.13.4\jackson-datatype-jdk8-2.13.4.jar;F:\maven\apache-maven-3.6.3-bin\apache-maven-3.6.3\respository\com\fasterxml\jackson\datatype\jackson-datatype-jsr310\2.13.4\jackson-datatype-jsr310-2.13.4.jar;F:\maven\apache-maven-3.6.3-bin\apache-maven-3.6.3\respository\com\fasterxml\jackson\module\jackson-module-parameter-names\2.13.4\jackson-module-parameter-names-2.13.4.jar;F:\maven\apache-maven-3.6.3-bin\apache-maven-3.6.3\respository\org\springframework\boot\spring-boot-starter-tomcat\2.7.6\spring-boot-starter-tomcat-2.7.6.jar;F:\maven\apache-maven-3.6.3-bin\apache-maven-3.6.3\respository\org\apache\tomcat\embed\tomcat-embed-core\9.0.69\tomcat-embed-core-9.0.69.jar;F:\maven\apache-maven-3.6.3-bin\apache-maven-3.6.3\respository\org\apache\tomcat\embed\tomcat-embed-el\9.0.69\tomcat-embed-el-9.0.69.jar;F:\maven\apache-maven-3.6.3-bin\apache-maven-3.6.3\respository\org\apache\tomcat\embed\tomcat-embed-websocket\9.0.69\tomcat-embed-websocket-9.0.69.jar;F:\maven\apache-maven-3.6.3-bin\apache-maven-3.6.3\respository\org\springframework\spring-web\5.3.24\spring-web-5.3.24.jar;F:\maven\apache-maven-3.6.3-bin\apache-maven-3.6.3\respository\org\springframework\spring-beans\5.3.24\spring-beans-5.3.24.jar;F:\maven\apache-maven-3.6.3-bin\apache-maven-3.6.3\respository\org\springframework\spring-webmvc\5.3.24\spring-webmvc-5.3.24.jar;F:\maven\apache-maven-3.6.3-bin\apache-maven-3.6.3\respository\org\springframework\spring-aop\5.3.24\spring-aop-5.3.24.jar;F:\maven\apache-maven-3.6.3-bin\apache-maven-3.6.3\respository\org\springframework\spring-expression\5.3.24\spring-expression-5.3.24.jar;F:\maven\apache-maven-3.6.3-bin\apache-maven-3.6.3\respository\org\mybatis\spring\boot\mybatis-spring-boot-starter\1.3.2\mybatis-spring-boot-starter-1.3.2.jar;F:\maven\apache-maven-3.6.3-bin\apache-maven-3.6.3\respository\org\springframework\boot\spring-boot-starter-jdbc\2.7.6\spring-boot-starter-jdbc-2.7.6.jar;F:\maven\apache-maven-3.6.3-bin\apache-maven-3.6.3\respository\com\zaxxer\HikariCP\4.0.3\HikariCP-4.0.3.jar;F:\maven\apache-maven-3.6.3-bin\apache-maven-3.6.3\respository\org\springframework\spring-jdbc\5.3.24\spring-jdbc-5.3.24.jar;F:\maven\apache-maven-3.6.3-bin\apache-maven-3.6.3\respository\org\springframework\spring-tx\5.3.24\spring-tx-5.3.24.jar;F:\maven\apache-maven-3.6.3-bin\apache-maven-3.6.3\respository\org\mybatis\spring\boot\mybatis-spring-boot-autoconfigure\1.3.2\mybatis-spring-boot-autoconfigure-1.3.2.jar;F:\maven\apache-maven-3.6.3-bin\apache-maven-3.6.3\respository\org\mybatis\mybatis\3.4.6\mybatis-3.4.6.jar;F:\maven\apache-maven-3.6.3-bin\apache-maven-3.6.3\respository\org\mybatis\mybatis-spring\1.3.2\mybatis-spring-1.3.2.jar;F:\maven\apache-maven-3.6.3-bin\apache-maven-3.6.3\respository\mysql\mysql-connector-java\5.1.47\mysql-connector-java-5.1.47.jar;F:\maven\apache-maven-3.6.3-bin\apache-maven-3.6.3\respository\org\springframework\boot\spring-boot-starter-test\2.7.6\spring-boot-starter-test-2.7.6.jar;F:\maven\apache-maven-3.6.3-bin\apache-maven-3.6.3\respository\org\springframework\boot\spring-boot-test\2.7.6\spring-boot-test-2.7.6.jar;F:\maven\apache-maven-3.6.3-bin\apache-maven-3.6.3\respository\org\springframework\boot\spring-boot-test-autoconfigure\2.7.6\spring-boot-test-autoconfigure-2.7.6.jar;F:\maven\apache-maven-3.6.3-bin\apache-maven-3.6.3\respository\com\jayway\jsonpath\json-path\2.7.0\json-path-2.7.0.jar;F:\maven\apache-maven-3.6.3-bin\apache-maven-3.6.3\respository\net\minidev\json-smart\2.4.8\json-smart-2.4.8.jar;F:\maven\apache-maven-3.6.3-bin\apache-maven-3.6.3\respository\net\minidev\accessors-smart\2.4.8\accessors-smart-2.4.8.jar;F:\maven\apache-maven-3.6.3-bin\apache-maven-3.6.3\respository\org\ow2\asm\asm\9.1\asm-9.1.jar;F:\maven\apache-maven-3.6.3-bin\apache-maven-3.6.3\respository\org\slf4j\slf4j-api\1.7.36\slf4j-api-1.7.36.jar;F:\maven\apache-maven-3.6.3-bin\apache-maven-3.6.3\respository\jakarta\xml\bind\jakarta.xml.bind-api\2.3.3\jakarta.xml.bind-api-2.3.3.jar;F:\maven\apache-maven-3.6.3-bin\apache-maven-3.6.3\respository\jakarta\activation\jakarta.activation-api\1.2.2\jakarta.activation-api-1.2.2.jar;F:\maven\apache-maven-3.6.3-bin\apache-maven-3.6.3\respository\org\assertj\assertj-core\3.22.0\assertj-core-3.22.0.jar;F:\maven\apache-maven-3.6.3-bin\apache-maven-3.6.3\respository\org\hamcrest\hamcrest\2.2\hamcrest-2.2.jar;F:\maven\apache-maven-3.6.3-bin\apache-maven-3.6.3\respository\org\junit\jupiter\junit-jupiter\5.8.2\junit-jupiter-5.8.2.jar;F:\maven\apache-maven-3.6.3-bin\apache-maven-3.6.3\respository\org\junit\jupiter\junit-jupiter-api\5.8.2\junit-jupiter-api-5.8.2.jar;F:\maven\apache-maven-3.6.3-bin\apache-maven-3.6.3\respository\org\opentest4j\opentest4j\1.2.0\opentest4j-1.2.0.jar;F:\maven\apache-maven-3.6.3-bin\apache-maven-3.6.3\respository\org\junit\platform\junit-platform-commons\1.8.2\junit-platform-commons-1.8.2.jar;F:\maven\apache-maven-3.6.3-bin\apache-maven-3.6.3\respository\org\apiguardian\apiguardian-api\1.1.2\apiguardian-api-1.1.2.jar;F:\maven\apache-maven-3.6.3-bin\apache-maven-3.6.3\respository\org\junit\jupiter\junit-jupiter-params\5.8.2\junit-jupiter-params-5.8.2.jar;F:\maven\apache-maven-3.6.3-bin\apache-maven-3.6.3\respository\org\junit\jupiter\junit-jupiter-engine\5.8.2\junit-jupiter-engine-5.8.2.jar;F:\maven\apache-maven-3.6.3-bin\apache-maven-3.6.3\respository\org\junit\platform\junit-platform-engine\1.8.2\junit-platform-engine-1.8.2.jar;F:\maven\apache-maven-3.6.3-bin\apache-maven-3.6.3\respository\org\mockito\mockito-core\4.5.1\mockito-core-4.5.1.jar;F:\maven\apache-maven-3.6.3-bin\apache-maven-3.6.3\respository\net\bytebuddy\byte-buddy\1.12.19\byte-buddy-1.12.19.jar;F:\maven\apache-maven-3.6.3-bin\apache-maven-3.6.3\respository\net\bytebuddy\byte-buddy-agent\1.12.19\byte-buddy-agent-1.12.19.jar;F:\maven\apache-maven-3.6.3-bin\apache-maven-3.6.3\respository\org\objenesis\objenesis\3.2\objenesis-3.2.jar;F:\maven\apache-maven-3.6.3-bin\apache-maven-3.6.3\respository\org\mockito\mockito-junit-jupiter\4.5.1\mockito-junit-jupiter-4.5.1.jar;F:\maven\apache-maven-3.6.3-bin\apache-maven-3.6.3\respository\org\skyscreamer\jsonassert\1.5.1\jsonassert-1.5.1.jar;F:\maven\apache-maven-3.6.3-bin\apache-maven-3.6.3\respository\com\vaadin\external\google\android-json\0.0.20131108.vaadin1\android-json-0.0.20131108.vaadin1.jar;F:\maven\apache-maven-3.6.3-bin\apache-maven-3.6.3\respository\org\springframework\spring-test\5.3.24\spring-test-5.3.24.jar;F:\maven\apache-maven-3.6.3-bin\apache-maven-3.6.3\respository\org\xmlunit\xmlunit-core\2.9.0\xmlunit-core-2.9.0.jar;F:\maven\apache-maven-3.6.3-bin\apache-maven-3.6.3\respository\org\apache\shiro\shiro-core\1.4.0\shiro-core-1.4.0.jar;F:\maven\apache-maven-3.6.3-bin\apache-maven-3.6.3\respository\org\apache\shiro\shiro-lang\1.4.0\shiro-lang-1.4.0.jar;F:\maven\apache-maven-3.6.3-bin\apache-maven-3.6.3\respository\org\apache\shiro\shiro-cache\1.4.0\shiro-cache-1.4.0.jar;F:\maven\apache-maven-3.6.3-bin\apache-maven-3.6.3\respository\org\apache\shiro\shiro-crypto-hash\1.4.0\shiro-crypto-hash-1.4.0.jar;F:\maven\apache-maven-3.6.3-bin\apache-maven-3.6.3\respository\org\apache\shiro\shiro-crypto-core\1.4.0\shiro-crypto-core-1.4.0.jar;F:\maven\apache-maven-3.6.3-bin\apache-maven-3.6.3\respository\org\apache\shiro\shiro-crypto-cipher\1.4.0\shiro-crypto-cipher-1.4.0.jar;F:\maven\apache-maven-3.6.3-bin\apache-maven-3.6.3\respository\org\apache\shiro\shiro-config-core\1.4.0\shiro-config-core-1.4.0.jar;F:\maven\apache-maven-3.6.3-bin\apache-maven-3.6.3\respository\org\apache\shiro\shiro-config-ogdl\1.4.0\shiro-config-ogdl-1.4.0.jar;F:\maven\apache-maven-3.6.3-bin\apache-maven-3.6.3\respository\commons-beanutils\commons-beanutils\1.9.3\commons-beanutils-1.9.3.jar;F:\maven\apache-maven-3.6.3-bin\apache-maven-3.6.3\respository\commons-collections\commons-collections\3.2.2\commons-collections-3.2.2.jar;F:\maven\apache-maven-3.6.3-bin\apache-maven-3.6.3\respository\org\apache\shiro\shiro-event\1.4.0\shiro-event-1.4.0.jar;F:\maven\apache-maven-3.6.3-bin\apache-maven-3.6.3\respository\org\apache\shiro\shiro-spring\1.4.0\shiro-spring-1.4.0.jar;F:\maven\apache-maven-3.6.3-bin\apache-maven-3.6.3\respository\org\apache\shiro\shiro-web\1.4.0\shiro-web-1.4.0.jar;F:\maven\apache-maven-3.6.3-bin\apache-maven-3.6.3\respository\com\google\code\gson\gson\2.9.1\gson-2.9.1.jar;F:\maven\apache-maven-3.6.3-bin\apache-maven-3.6.3\respository\org\projectlombok\lombok\1.18.24\lombok-1.18.24.jar;"/>
    <property name="sun.cpu.endian" value="little"/>
    <property name="user.home" value="C:\Users\86180"/>
    <property name="user.language" value="zh"/>
    <property name="java.specification.vendor" value="Oracle Corporation"/>
    <property name="java.home" value="C:\Program Files\Java\jdk1.8.0_271\jre"/>
    <property name="basedir" value="F:\jxc"/>
    <property name="file.separator" value="\"/>
    <property name="line.separator" value="&#10;"/>
    <property name="java.vm.specification.vendor" value="Oracle Corporation"/>
    <property name="java.specification.name" value="Java Platform API Specification"/>
    <property name="java.awt.graphicsenv" value="sun.awt.Win32GraphicsEnvironment"/>
    <property name="surefire.real.class.path" value="C:\Users\86180\AppData\Local\Temp\surefire1552062968859140225\surefirebooter4662442483271157370.jar"/>
    <property name="sun.boot.class.path" value="C:\Program Files\Java\jdk1.8.0_271\jre\lib\resources.jar;C:\Program Files\Java\jdk1.8.0_271\jre\lib\rt.jar;C:\Program Files\Java\jdk1.8.0_271\jre\lib\sunrsasign.jar;C:\Program Files\Java\jdk1.8.0_271\jre\lib\jsse.jar;C:\Program Files\Java\jdk1.8.0_271\jre\lib\jce.jar;C:\Program Files\Java\jdk1.8.0_271\jre\lib\charsets.jar;C:\Program Files\Java\jdk1.8.0_271\jre\lib\jfr.jar;C:\Program Files\Java\jdk1.8.0_271\jre\classes"/>
    <property name="user.script" value=""/>
    <property name="sun.management.compiler" value="HotSpot 64-Bit Tiered Compilers"/>
    <property name="java.runtime.version" value="1.8.0_271-b09"/>
    <property name="user.name" value="86180"/>
    <property name="path.separator" value=";"/>
    <property name="os.version" value="10.0"/>
    <property name="java.endorsed.dirs" value="C:\Program Files\Java\jdk1.8.0_271\jre\lib\endorsed"/>
    <property name="java.runtime.name" value="Java(TM) SE Runtime Environment"/>
    <property name="file.encoding" value="GBK"/>
    <property name="java.vm.name" value="Java HotSpot(TM) 64-Bit Server VM"/>
    <property name="localRepository" value="F:\maven\apache-maven-3.6.3-bin\apache-maven-3.6.3\respository"/>
    <property name="java.vendor.url.bug" value="http://bugreport.sun.com/bugreport/"/>
    <property name="java.io.tmpdir" value="C:\Users\86180\AppData\Local\Temp\"/>
    <property name="idea.version" value="2020.2"/>
    <property name="java.version" value="1.8.0_271"/>
    <property name="user.dir" value="F:\jxc"/>
    <property name="os.arch" value="amd64"/>
    <property name="java.vm.specification.name" value="Java Virtual Machine Specification"/>
    <property name="java.awt.printerjob" value="sun.awt.windows.WPrinterJob"/>
    <property name="sun.os.patch.level" value=""/>
    <property name="java.library.path" value="C:\Program Files\Java\jdk1.8.0_271\jre\bin;C:\Windows\Sun\Java\bin;C:\Windows\system32;C:\Windows;C:\Program Files\Java\jdk1.8.0_271\bin;F:\JAVAGJ\vm\bin\;C:\Program Files (x86)\Common Files\Oracle\Java\javapath;C:\Windows\system32;C:\Windows;C:\Windows\System32\Wbem;C:\Windows\System32\WindowsPowerShell\v1.0\;C:\Windows\System32\OpenSSH\;C:\Program Files\Bandizip\;F:\JAVAGJ\Mysql\MySQL_Server8.0\bin;F:\maven\apache-maven-3.6.3-bin\apache-maven-3.6.3\bin;F:\JAVAGJ\NodeJs\;C:\Users\86180\AppData\Local\Microsoft\WindowsApps;;F:\JAVAGJ\Microsoft VS Code\bin;C:\Users\86180\AppData\Roaming\npm;F:\JAVAGJ\idea2020\IntelliJ IDEA 2022.1.2\bin;;."/>
    <property name="java.vm.info" value="mixed mode"/>
    <property name="java.vendor" value="Oracle Corporation"/>
    <property name="java.vm.version" value="25.271-b09"/>
    <property name="java.ext.dirs" value="C:\Program Files\Java\jdk1.8.0_271\jre\lib\ext;C:\Windows\Sun\Java\lib\ext"/>
    <property name="sun.io.unicode.encoding" value="UnicodeLittle"/>
    <property name="maven.repo.local" value="F:\maven\apache-maven-3.6.3-bin\apache-maven-3.6.3\respository"/>
    <property name="java.class.version" value="52.0"/>
  </properties>
  <testcase name="contextLoads" classname="com.atguigu.jxc.JxcApplicationTests" time="0.309"/>
</testsuite>