\relax 
\catcode `"\active 
\bibstyle{lni}
\select@language{english}
\@writefile{toc}{\select@language{english}}
\@writefile{lof}{\select@language{english}}
\@writefile{lot}{\select@language{english}}
\select@language{english}
\@writefile{toc}{\select@language{english}}
\@writefile{lof}{\select@language{english}}
\@writefile{lot}{\select@language{english}}
\@writefile{toc}{\contentsline {section}{\numberline {1}Schritt 1}{1}}
\@writefile{toc}{\contentsline {subsection}{\numberline {1.1}Aufgabenstellung}{1}}
\@writefile{toc}{\contentsline {subsection}{\numberline {1.2}Implementierung}{1}}
\@writefile{toc}{\contentsline {subsection}{\numberline {1.3}Test}{4}}
\@writefile{toc}{\contentsline {section}{\numberline {2}Schritt 2}{5}}
\@writefile{toc}{\contentsline {subsection}{\numberline {2.1}Aufgabenstellung}{5}}
\@writefile{toc}{\contentsline {subsection}{\numberline {2.2}Implementierung}{5}}
\@writefile{toc}{\contentsline {subsection}{\numberline {2.3}Test}{8}}
\@writefile{toc}{\contentsline {section}{\numberline {3}Schritt 3}{9}}
\@writefile{toc}{\contentsline {subsection}{\numberline {3.1}Aufgabenstellung}{9}}
\@writefile{toc}{\contentsline {subsection}{\numberline {3.2}Implementierung}{9}}
\@writefile{toc}{\contentsline {subsection}{\numberline {3.3}Test}{12}}
\@writefile{toc}{\contentsline {section}{\numberline {4}Schritt 4}{13}}
\@writefile{toc}{\contentsline {subsection}{\numberline {4.1}Aufgabenstellung}{13}}
\@writefile{toc}{\contentsline {subsection}{\numberline {4.2}Implementierung}{13}}
\@writefile{toc}{\contentsline {subsection}{\numberline {4.3}Test}{19}}
\@writefile{toc}{\contentsline {section}{\numberline {5}Schritt 5}{20}}
\@writefile{toc}{\contentsline {subsection}{\numberline {5.1}Aufgabenstellung}{20}}
\@writefile{toc}{\contentsline {subsection}{\numberline {5.2}Implementierung}{20}}
\@writefile{toc}{\contentsline {subsection}{\numberline {5.3}Test}{22}}
