[{
  "_id": {
    "$oid": "60946c0dac0e3b497429fa26"
  },
  "subTitle1": "QUI SOMMES NOUS",
  "subTitle2": "",
  "subTitle3": "",
  "content": "Nous sommes une entreprise qui oeuvre dans le    Lorem ipsum dolor sit amet, consectetur adipiscing elit. Ut ultricies iaculis auctor. Pellentesque eu dui eleifend elit egestas lacinia vitae et arcu.   Aenean a eleifend enim. Mauris bibendum condimentum magna, at laoreet nulla luctus ac. Nulla a arcu vitae lectus vehicula egestas a quis ligula. ",
  "createdAt": {
    "$date": "2021-05-06T22:22:05.674Z"
  },
  "updatedAt": {
    "$date": "2021-05-06T22:22:05.674Z"
  },
  "__v": 0
},{
  "_id": {
    "$oid": "60946c40ac0e3b497429fa27"
  },
  "subTitle1": "",
  "subTitle2": "NOTRE ÉQUIPE",
  "subTitle3": "",
  "content": "",
  "createdAt": {
    "$date": "2021-05-06T22:22:56.760Z"
  },
  "updatedAt": {
    "$date": "2021-05-06T22:22:56.760Z"
  },
  "__v": 0
},{
  "_id": {
    "$oid": "60946c95ac0e3b497429fa28"
  },
  "subTitle1": "",
  "subTitle2": "",
  "subTitle3": "NOTRE HISTOIRE",
  "content": "Nous sommes une entreprise qui oeuvre dans le    Lorem ipsum dolor sit amet, consectetur adipiscing elit. Ut ultricies iaculis auctor. Pellentesque eu dui eleifend elit egestas lacinia vitae et arcu.   Aenean a eleifend enim. Mauris bibendum condimentum magna, at laoreet nulla luctus ac. Nulla a arcu vitae lectus vehicula egestas a quis ligula.   Nous sommes une entreprise qui oeuvre dans le    Lorem ipsum dolor sit amet, consectetur adipiscing elit. Ut ultricies iaculis auctor. Pellentesque eu dui eleifend elit egestas lacinia vitae et arcu.   Aenean a eleifend enim. Mauris bibendum condimentum magna, at laoreet nulla luctus ac. Nulla a arcu vitae lectus vehicula egestas a quis ligula. ",
  "createdAt": {
    "$date": "2021-05-06T22:24:21.146Z"
  },
  "updatedAt": {
    "$date": "2021-05-06T22:24:21.146Z"
  },
  "__v": 0
}]