[{
  "_id": {
    "$oid": "60cb9178c017633b60884511"
  },
  "title": "Avoir un bon C.V.",
  "img": "/images/cms/pages/office-building.svg",
  "date": "2021-06-01",
  "author": "Hans Bherer",
  "category": "Profil d'employés",
  "content": "Lorem ipsum dolor sit amet, consectetur adipiscing elit, sed do eiusmod tempor incididunt ut labore et dolore magna aliqua. Quisque non tellus orci ac auctor. Justo donec enim diam vulputate ut pharetra sit amet. Scelerisque varius morbi enim nunc faucibus a pellentesque. Nec ullamcorper sit amet risus nullam eget felis. Suspendisse interdum consectetur libero id faucibus. Suscipit adipiscing bibendum est ultricies integer quis auctor elit. Congue eu consequat ac felis donec. Adipiscing commodo elit at imperdiet dui accumsan sit amet. Nunc sed velit dignissim sodales ut eu sem. Placerat orci nulla pellentesque dignissim enim sit amet venenatis. Diam maecenas ultricies mi eget mauris pharetra et. Sed risus ultricies tristique nulla aliquet enim. Lectus nulla at volutpat diam ut venenatis tellus in metus. Dis parturient montes nascetur ridiculus mus mauris. Felis donec et odio pellentesque diam. Et magnis dis parturient montes nascetur ridiculus. Volutpat sed cras ornare arcu dui vivamus.\r\n\r\nMagnis dis parturient montes nascetur ridiculus mus. Libero volutpat sed cras ornare arcu dui vivamus arcu felis. Suspendisse ultrices gravida dictum fusce ut. Adipiscing bibendum est ultricies integer quis auctor elit. Tellus pellentesque eu tincidunt tortor aliquam nulla facilisi cras fermentum. Arcu cursus vitae congue mauris rhoncus aenean. Nulla facilisi cras fermentum odio eu feugiat pretium nibh. Tincidunt id aliquet risus feugiat in ante metus dictum at. Egestas sed tempus urna et pharetra pharetra massa. Massa sed elementum tempus egestas. Id leo in vitae turpis massa. Lobortis mattis aliquam faucibus purus. Aliquam sem fringilla ut morbi tincidunt augue interdum. Eget nullam non nisi est sit amet. Orci dapibus ultrices in iaculis nunc sed augue lacus.",
  "__v": 0
},{
  "_id": {
    "$oid": "60cb91dcc017633b60884512"
  },
  "title": "Le meilleur produit de désinfectent",
  "img": "/images/cms/pages/cleaning-staff.svg",
  "date": "2021-06-12",
  "author": "Hans Bherer",
  "category": "Présentation protuis",
  "content": "Lorem ipsum dolor sit amet, consectetur adipiscing elit, sed do eiusmod tempor incididunt ut labore et dolore magna aliqua. Quisque non tellus orci ac auctor. Justo donec enim diam vulputate ut pharetra sit amet. Scelerisque varius morbi enim nunc faucibus a pellentesque. Nec ullamcorper sit amet risus nullam eget felis. Suspendisse interdum consectetur libero id faucibus. Suscipit adipiscing bibendum est ultricies integer quis auctor elit. Congue eu consequat ac felis donec. Adipiscing commodo elit at imperdiet dui accumsan sit amet. Nunc sed velit dignissim sodales ut eu sem. Placerat orci nulla pellentesque dignissim enim sit amet venenatis. Diam maecenas ultricies mi eget mauris pharetra et. Sed risus ultricies tristique nulla aliquet enim. Lectus nulla at volutpat diam ut venenatis tellus in metus. Dis parturient montes nascetur ridiculus mus mauris. Felis donec et odio pellentesque diam. Et magnis dis parturient montes nascetur ridiculus. Volutpat sed cras ornare arcu dui vivamus.\r\n\r\nMagnis dis parturient montes nascetur ridiculus mus. Libero volutpat sed cras ornare arcu dui vivamus arcu felis. Suspendisse ultrices gravida dictum fusce ut. Adipiscing bibendum est ultricies integer quis auctor elit. Tellus pellentesque eu tincidunt tortor aliquam nulla facilisi cras fermentum. Arcu cursus vitae congue mauris rhoncus aenean. Nulla facilisi cras fermentum odio eu feugiat pretium nibh. Tincidunt id aliquet risus feugiat in ante metus dictum at. Egestas sed tempus urna et pharetra pharetra massa. Massa sed elementum tempus egestas. Id leo in vitae turpis massa. Lobortis mattis aliquam faucibus purus. Aliquam sem fringilla ut morbi tincidunt augue interdum. Eget nullam non nisi est sit amet. Orci dapibus ultrices in iaculis nunc sed augue lacus.",
  "__v": 0
},{
  "_id": {
    "$oid": "60cb9239c017633b60884513"
  },
  "title": "Comment laver un salle de bain",
  "img": "/images/cms/pages/man.svg",
  "date": "2021-06-14",
  "author": "Hans Bherer",
  "category": "Trucs et astuces",
  "content": "Lorem ipsum dolor sit amet, consectetur adipiscing elit, sed do eiusmod tempor incididunt ut labore et dolore magna aliqua. Quisque non tellus orci ac auctor. Justo donec enim diam vulputate ut pharetra sit amet. Scelerisque varius morbi enim nunc faucibus a pellentesque. Nec ullamcorper sit amet risus nullam eget felis. Suspendisse interdum consectetur libero id faucibus. Suscipit adipiscing bibendum est ultricies integer quis auctor elit. Congue eu consequat ac felis donec. Adipiscing commodo elit at imperdiet dui accumsan sit amet. Nunc sed velit dignissim sodales ut eu sem. Placerat orci nulla pellentesque dignissim enim sit amet venenatis. Diam maecenas ultricies mi eget mauris pharetra et. Sed risus ultricies tristique nulla aliquet enim. Lectus nulla at volutpat diam ut venenatis tellus in metus. Dis parturient montes nascetur ridiculus mus mauris. Felis donec et odio pellentesque diam. Et magnis dis parturient montes nascetur ridiculus. Volutpat sed cras ornare arcu dui vivamus.\r\n\r\nMagnis dis parturient montes nascetur ridiculus mus. Libero volutpat sed cras ornare arcu dui vivamus arcu felis. Suspendisse ultrices gravida dictum fusce ut. Adipiscing bibendum est ultricies integer quis auctor elit. Tellus pellentesque eu tincidunt tortor aliquam nulla facilisi cras fermentum. Arcu cursus vitae congue mauris rhoncus aenean. Nulla facilisi cras fermentum odio eu feugiat pretium nibh. Tincidunt id aliquet risus feugiat in ante metus dictum at. Egestas sed tempus urna et pharetra pharetra massa. Massa sed elementum tempus egestas. Id leo in vitae turpis massa. Lobortis mattis aliquam faucibus purus. Aliquam sem fringilla ut morbi tincidunt augue interdum. Eget nullam non nisi est sit amet. Orci dapibus ultrices in iaculis nunc sed augue lacus.",
  "__v": 0
},{
  "_id": {
    "$oid": "60cb9279c017633b60884514"
  },
  "title": "Le profil rechercher",
  "img": "/images/cms/pages/presentation.svg",
  "date": "2021-06-16",
  "author": "Hans Bherer",
  "category": "Profil d'employés",
  "content": "Lorem ipsum dolor sit amet, consectetur adipiscing elit, sed do eiusmod tempor incididunt ut labore et dolore magna aliqua. Quisque non tellus orci ac auctor. Justo donec enim diam vulputate ut pharetra sit amet. Scelerisque varius morbi enim nunc faucibus a pellentesque. Nec ullamcorper sit amet risus nullam eget felis. Suspendisse interdum consectetur libero id faucibus. Suscipit adipiscing bibendum est ultricies integer quis auctor elit. Congue eu consequat ac felis donec. Adipiscing commodo elit at imperdiet dui accumsan sit amet. Nunc sed velit dignissim sodales ut eu sem. Placerat orci nulla pellentesque dignissim enim sit amet venenatis. Diam maecenas ultricies mi eget mauris pharetra et. Sed risus ultricies tristique nulla aliquet enim. Lectus nulla at volutpat diam ut venenatis tellus in metus. Dis parturient montes nascetur ridiculus mus mauris. Felis donec et odio pellentesque diam. Et magnis dis parturient montes nascetur ridiculus. Volutpat sed cras ornare arcu dui vivamus.\r\n\r\nMagnis dis parturient montes nascetur ridiculus mus. Libero volutpat sed cras ornare arcu dui vivamus arcu felis. Suspendisse ultrices gravida dictum fusce ut. Adipiscing bibendum est ultricies integer quis auctor elit. Tellus pellentesque eu tincidunt tortor aliquam nulla facilisi cras fermentum. Arcu cursus vitae congue mauris rhoncus aenean. Nulla facilisi cras fermentum odio eu feugiat pretium nibh. Tincidunt id aliquet risus feugiat in ante metus dictum at. Egestas sed tempus urna et pharetra pharetra massa. Massa sed elementum tempus egestas. Id leo in vitae turpis massa. Lobortis mattis aliquam faucibus purus. Aliquam sem fringilla ut morbi tincidunt augue interdum. Eget nullam non nisi est sit amet. Orci dapibus ultrices in iaculis nunc sed augue lacus.",
  "__v": 0
},{
  "_id": {
    "$oid": "60cb92aec017633b60884515"
  },
  "title": "Ne pas utiliser le vinaigre pour vos planché",
  "img": "/images/cms/pages/articleColor.svg",
  "date": "2021-06-16",
  "author": "Hans Bherer",
  "category": "Présentation protuis",
  "content": "Lorem ipsum dolor sit amet, consectetur adipiscing elit, sed do eiusmod tempor incididunt ut labore et dolore magna aliqua. Quisque non tellus orci ac auctor. Justo donec enim diam vulputate ut pharetra sit amet. Scelerisque varius morbi enim nunc faucibus a pellentesque. Nec ullamcorper sit amet risus nullam eget felis. Suspendisse interdum consectetur libero id faucibus. Suscipit adipiscing bibendum est ultricies integer quis auctor elit. Congue eu consequat ac felis donec. Adipiscing commodo elit at imperdiet dui accumsan sit amet. Nunc sed velit dignissim sodales ut eu sem. Placerat orci nulla pellentesque dignissim enim sit amet venenatis. Diam maecenas ultricies mi eget mauris pharetra et. Sed risus ultricies tristique nulla aliquet enim. Lectus nulla at volutpat diam ut venenatis tellus in metus. Dis parturient montes nascetur ridiculus mus mauris. Felis donec et odio pellentesque diam. Et magnis dis parturient montes nascetur ridiculus. Volutpat sed cras ornare arcu dui vivamus.\r\n\r\nMagnis dis parturient montes nascetur ridiculus mus. Libero volutpat sed cras ornare arcu dui vivamus arcu felis. Suspendisse ultrices gravida dictum fusce ut. Adipiscing bibendum est ultricies integer quis auctor elit. Tellus pellentesque eu tincidunt tortor aliquam nulla facilisi cras fermentum. Arcu cursus vitae congue mauris rhoncus aenean. Nulla facilisi cras fermentum odio eu feugiat pretium nibh. Tincidunt id aliquet risus feugiat in ante metus dictum at. Egestas sed tempus urna et pharetra pharetra massa. Massa sed elementum tempus egestas. Id leo in vitae turpis massa. Lobortis mattis aliquam faucibus purus. Aliquam sem fringilla ut morbi tincidunt augue interdum. Eget nullam non nisi est sit amet. Orci dapibus ultrices in iaculis nunc sed augue lacus.",
  "__v": 0
},{
  "_id": {
    "$oid": "60cb9306c017633b60884516"
  },
  "title": "Le ménage pour un faible prix",
  "img": "/images/cms/pages/031-money-bag.svg",
  "date": "2021-06-17",
  "author": "Hans Bherer",
  "category": "Trucs et astuces",
  "content": "Lorem ipsum dolor sit amet, consectetur adipiscing elit, sed do eiusmod tempor incididunt ut labore et dolore magna aliqua. Quisque non tellus orci ac auctor. Justo donec enim diam vulputate ut pharetra sit amet. Scelerisque varius morbi enim nunc faucibus a pellentesque. Nec ullamcorper sit amet risus nullam eget felis. Suspendisse interdum consectetur libero id faucibus. Suscipit adipiscing bibendum est ultricies integer quis auctor elit. Congue eu consequat ac felis donec. Adipiscing commodo elit at imperdiet dui accumsan sit amet. Nunc sed velit dignissim sodales ut eu sem. Placerat orci nulla pellentesque dignissim enim sit amet venenatis. Diam maecenas ultricies mi eget mauris pharetra et. Sed risus ultricies tristique nulla aliquet enim. Lectus nulla at volutpat diam ut venenatis tellus in metus. Dis parturient montes nascetur ridiculus mus mauris. Felis donec et odio pellentesque diam. Et magnis dis parturient montes nascetur ridiculus. Volutpat sed cras ornare arcu dui vivamus.\r\n\r\nMagnis dis parturient montes nascetur ridiculus mus. Libero volutpat sed cras ornare arcu dui vivamus arcu felis. Suspendisse ultrices gravida dictum fusce ut. Adipiscing bibendum est ultricies integer quis auctor elit. Tellus pellentesque eu tincidunt tortor aliquam nulla facilisi cras fermentum. Arcu cursus vitae congue mauris rhoncus aenean. Nulla facilisi cras fermentum odio eu feugiat pretium nibh. Tincidunt id aliquet risus feugiat in ante metus dictum at. Egestas sed tempus urna et pharetra pharetra massa. Massa sed elementum tempus egestas. Id leo in vitae turpis massa. Lobortis mattis aliquam faucibus purus. Aliquam sem fringilla ut morbi tincidunt augue interdum. Eget nullam non nisi est sit amet. Orci dapibus ultrices in iaculis nunc sed augue lacus.",
  "__v": 0
}]