[{
  "_id": {
    "$oid": "60cb95ccc017633b60884519"
  },
  "img": "/images/Image-Hans.jpg",
  "titre": "Hans Bherer",
  "content": "Lorem ipsum dolor sit amet, consectetur adipiscing elit, sed do eiusmod tempor incididunt ut labore et dolore magna aliqua. Quisque non tellus orci ac auctor. Justo donec enim diam vulputate ut pharetra sit amet. Scelerisque varius morbi enim nunc faucibus a pellentesque. Nec ullamcorper sit amet risus nullam eget felis. Suspendisse interdum consectetur libero id faucibus. Suscipit adipiscing bibendum est ultricies integer quis auctor elit. Congue eu consequat ac felis donec. Adipiscing commodo elit at imperdiet dui accumsan sit amet. Nunc sed velit dignissim sodales ut eu sem.",
  "__v": 0
},{
  "_id": {
    "$oid": "60cb95e8c017633b6088451a"
  },
  "img": "/images/image-Imane.jpeg",
  "titre": "Imane Sbiti",
  "content": "Lorem ipsum dolor sit amet, consectetur adipiscing elit, sed do eiusmod tempor incididunt ut labore et dolore magna aliqua. Quisque non tellus orci ac auctor. Justo donec enim diam vulputate ut pharetra sit amet. Scelerisque varius morbi enim nunc faucibus a pellentesque. Nec ullamcorper sit amet risus nullam eget felis. Suspendisse interdum consectetur libero id faucibus. Suscipit adipiscing bibendum est ultricies integer quis auctor elit. Congue eu consequat ac felis donec. Adipiscing commodo elit at imperdiet dui accumsan sit amet. Nunc sed velit dignissim sodales ut eu sem.",
  "__v": 0
},{
  "_id": {
    "$oid": "60cb961ac017633b6088451b"
  },
  "img": "/images/image-nabil.jpeg",
  "titre": "Nabil Bouazzaoui",
  "content": "Lorem ipsum dolor sit amet, consectetur adipiscing elit, sed do eiusmod tempor incididunt ut labore et dolore magna aliqua. Quisque non tellus orci ac auctor. Justo donec enim diam vulputate ut pharetra sit amet. Scelerisque varius morbi enim nunc faucibus a pellentesque. Nec ullamcorper sit amet risus nullam eget felis. Suspendisse interdum consectetur libero id faucibus. Suscipit adipiscing bibendum est ultricies integer quis auctor elit. Congue eu consequat ac felis donec. Adipiscing commodo elit at imperdiet dui accumsan sit amet. Nunc sed velit dignissim sodales ut eu sem.",
  "__v": 0
},{
  "_id": {
    "$oid": "60cb9641c017633b6088451c"
  },
  "img": "/images/image-nabil.jpeg",
  "titre": "Gabriel Lessard",
  "content": "Lorem ipsum dolor sit amet, consectetur adipiscing elit, sed do eiusmod tempor incididunt ut labore et dolore magna aliqua. Quisque non tellus orci ac auctor. Justo donec enim diam vulputate ut pharetra sit amet. Scelerisque varius morbi enim nunc faucibus a pellentesque. Nec ullamcorper sit amet risus nullam eget felis. Suspendisse interdum consectetur libero id faucibus. Suscipit adipiscing bibendum est ultricies integer quis auctor elit. Congue eu consequat ac felis donec. Adipiscing commodo elit at imperdiet dui accumsan sit amet. Nunc sed velit dignissim sodales ut eu sem.",
  "__v": 0
},{
  "_id": {
    "$oid": "60cb9df3c017633b6088451f"
  },
  "img": "/images/cms/pages/cleaning-staff.svg",
  "titre": "- Présentation de l'entreprise -",
  "content": "Lorem ipsum dolor sit amet, consectetur adipiscing elit, sed do eiusmod tempor incididunt ut labore et dolore magna aliqua. Quisque non tellus orci ac auctor. Justo donec enim diam vulputate ut pharetra sit amet. Scelerisque varius morbi enim nunc faucibus a pellentesque. Nec ullamcorper sit amet risus nullam eget felis. Suspendisse interdum consectetur libero id faucibus. Suscipit adipiscing bibendum est ultricies integer quis auctor elit. Congue eu consequat ac felis donec. Adipiscing commodo elit at imperdiet dui accumsan sit amet. Nunc sed velit dignissim sodales ut eu sem. Placerat orci nulla pellentesque dignissim enim sit amet venenatis. Diam maecenas ultricies mi eget mauris pharetra et. Sed risus ultricies tristique nulla aliquet enim. Lectus nulla at volutpat diam ut venenatis tellus in metus. Dis parturient montes nascetur ridiculus mus mauris. Felis donec et odio pellentesque diam. Et magnis dis parturient montes nascetur ridiculus. Volutpat sed cras ornare arcu dui vivamus.\r\n\r\nMagnis dis parturient montes nascetur ridiculus mus. Libero volutpat sed cras ornare arcu dui vivamus arcu felis. Suspendisse ultrices gravida dictum fusce ut. Adipiscing bibendum est ultricies integer quis auctor elit. Tellus pellentesque eu tincidunt tortor aliquam nulla facilisi cras fermentum. Arcu cursus vitae congue mauris rhoncus aenean. Nulla facilisi cras fermentum odio eu feugiat pretium nibh. Tincidunt id aliquet risus feugiat in ante metus dictum at. Egestas sed tempus urna et pharetra pharetra massa. Massa sed elementum tempus egestas. Id leo in vitae turpis massa. Lobortis mattis aliquam faucibus purus. Aliquam sem fringilla ut morbi tincidunt augue interdum. Eget nullam non nisi est sit amet. Orci dapibus ultrices in iaculis nunc sed augue lacus.\r\n\r\nDuis convallis convallis tellus id interdum. A diam sollicitudin tempor id eu nisl nunc mi ipsum. Id interdum velit laoreet id donec ultrices. Tincidunt eget nullam non nisi. Lacus suspendisse faucibus interdum posuere lorem ipsum. Tincidunt dui ut ornare lectus sit amet est placerat. Erat velit scelerisque in dictum non consectetur a. Eget lorem dolor sed viverra. Interdum velit laoreet id donec. Vestibulum morbi blandit cursus risus at ultrices. Sit amet massa vitae tortor condimentum lacinia quis vel eros. Augue lacus viverra vitae congue eu consequat ac felis. In hac habitasse platea dictumst quisque sagittis purus sit amet. Eget nullam non nisi est sit amet. Sagittis nisl rhoncus mattis rhoncus urna.",
  "__v": 0
}]