vehicule,sold,capacity
RENAULT ZOE, 18817, 52
TESLA MODEL 3 (50/75), 6455, 50
NISSAN LEAF (40/62), 3738, 40
BMW I3, 2793, 42.2
KIA E-NIRO (39.2/64), 1850, 39.2
SMART EQ FORTWO, 1790, 17.6
HYUNDAI KONA ELECTRIC, 1513, 67.1
VOLKSWAGEN E-GOLF, 661, 55.7
HYUNDAI IONIQ ELECTRIC, 553, 38.3
CITROËN C-ZERO, 543, 14.5