<?xml version="1.0" encoding="UTF-8" standalone="no"?>
<!-- Created with Inkscape (http://www.inkscape.org/) -->

<svg
   xmlns:dc="http://purl.org/dc/elements/1.1/"
   xmlns:cc="http://creativecommons.org/ns#"
   xmlns:rdf="http://www.w3.org/1999/02/22-rdf-syntax-ns#"
   xmlns:svg="http://www.w3.org/2000/svg"
   xmlns="http://www.w3.org/2000/svg"
   xmlns:sodipodi="http://sodipodi.sourceforge.net/DTD/sodipodi-0.dtd"
   xmlns:inkscape="http://www.inkscape.org/namespaces/inkscape"
   width="744.09448819"
   height="1052.3622047"
   id="svg2"
   version="1.1"
   inkscape:version="0.48.5 r10040"
   sodipodi:docname="New document 1">
  <defs
     id="defs4">
    <inkscape:path-effect
       effect="spiro"
       id="path-effect3999"
       is_visible="true" />
    <inkscape:path-effect
       effect="spiro"
       id="path-effect3995"
       is_visible="true" />
    <inkscape:path-effect
       effect="spiro"
       id="path-effect3991"
       is_visible="true" />
    <inkscape:path-effect
       effect="spiro"
       id="path-effect3987"
       is_visible="true" />
    <inkscape:path-effect
       effect="spiro"
       id="path-effect3983"
       is_visible="true" />
    <inkscape:path-effect
       effect="spiro"
       id="path-effect3979"
       is_visible="true" />
    <inkscape:path-effect
       effect="spiro"
       id="path-effect3975"
       is_visible="true" />
    <inkscape:path-effect
       effect="spiro"
       id="path-effect3203"
       is_visible="true" />
  </defs>
  <sodipodi:namedview
     id="base"
     pagecolor="#ffffff"
     bordercolor="#666666"
     borderopacity="1.0"
     inkscape:pageopacity="0.0"
     inkscape:pageshadow="2"
     inkscape:zoom="1.9238411"
     inkscape:cx="283.19793"
     inkscape:cy="500.63683"
     inkscape:document-units="px"
     inkscape:current-layer="layer1"
     showgrid="true"
     inkscape:window-width="1920"
     inkscape:window-height="1017"
     inkscape:window-x="-8"
     inkscape:window-y="-8"
     inkscape:window-maximized="1">
    <inkscape:grid
       type="xygrid"
       id="grid2985"
       empspacing="4"
       visible="true"
       enabled="true"
       snapvisiblegridlinesonly="true"
       spacingx="16px"
       spacingy="16px" />
  </sodipodi:namedview>
  <metadata
     id="metadata7">
    <rdf:RDF>
      <cc:Work
         rdf:about="">
        <dc:format>image/svg+xml</dc:format>
        <dc:type
           rdf:resource="http://purl.org/dc/dcmitype/StillImage" />
        <dc:title></dc:title>
      </cc:Work>
    </rdf:RDF>
  </metadata>
  <g
     inkscape:label="Layer 1"
     inkscape:groupmode="layer"
     id="layer1">
    <rect
       style="fill:none;fill-opacity:1;stroke:#666666"
       id="rect2987"
       width="64"
       height="64"
       x="192"
       y="348.36218" />
    <rect
       style="fill:none;stroke:#666666"
       id="rect2987-1"
       width="64"
       height="64"
       x="256"
       y="348.36218" />
    <rect
       style="fill:none;stroke:#666666"
       id="rect2987-7"
       width="64"
       height="64"
       x="320"
       y="348.36218" />
    <rect
       style="fill:none;stroke:#666666"
       id="rect2987-4"
       width="64"
       height="64"
       x="128"
       y="348.36218" />
    <rect
       style="fill:none;stroke:#666666"
       id="rect2987-0"
       width="64"
       height="64"
       x="384"
       y="348.36218" />
    <rect
       style="fill:none;stroke:#666666"
       id="rect2987-9"
       width="64"
       height="64"
       x="448"
       y="348.36218" />
    <rect
       style="fill:none;stroke:#666666"
       id="rect2987-48"
       width="64"
       height="64"
       x="512"
       y="348.36218" />
    <rect
       style="fill:none;stroke:#666666"
       id="rect2987-8"
       width="64"
       height="64"
       x="192"
       y="412.36218" />
    <rect
       style="fill:none;stroke:#666666"
       id="rect2987-1-2"
       width="64"
       height="64"
       x="256"
       y="412.36218" />
    <rect
       style="fill:none;stroke:#666666"
       id="rect2987-7-4"
       width="64"
       height="64"
       x="320"
       y="412.36218" />
    <rect
       style="fill:none;stroke:#666666"
       id="rect2987-4-5"
       width="64"
       height="64"
       x="128"
       y="412.36218" />
    <rect
       style="fill:none;stroke:#666666"
       id="rect2987-0-5"
       width="64"
       height="64"
       x="384"
       y="412.36218" />
    <rect
       style="fill:none;stroke:#666666"
       id="rect2987-9-1"
       width="64"
       height="64"
       x="448"
       y="412.36218" />
    <rect
       style="fill:none;stroke:#666666"
       id="rect2987-48-7"
       width="64"
       height="64"
       x="512"
       y="412.36218" />
    <rect
       style="fill:none;stroke:#666666"
       id="rect2987-11"
       width="64"
       height="64"
       x="192"
       y="476.36218" />
    <rect
       style="fill:none;stroke:#666666"
       id="rect2987-1-5"
       width="64"
       height="64"
       x="256"
       y="476.36218" />
    <rect
       style="fill:none;stroke:#666666"
       id="rect2987-7-2"
       width="64"
       height="64"
       x="320"
       y="476.36218" />
    <rect
       style="fill:none;stroke:#666666"
       id="rect2987-4-7"
       width="64"
       height="64"
       x="128"
       y="476.36218" />
    <rect
       style="fill:none;stroke:#666666"
       id="rect2987-0-6"
       width="64"
       height="64"
       x="384"
       y="476.36218" />
    <rect
       style="fill:none;stroke:#666666"
       id="rect2987-9-14"
       width="64"
       height="64"
       x="448"
       y="476.36218" />
    <rect
       style="fill:none;stroke:#666666"
       id="rect2987-48-2"
       width="64"
       height="64"
       x="512"
       y="476.36218" />
    <rect
       style="fill:none;stroke:#666666"
       id="rect2987-8-3"
       width="64"
       height="64"
       x="192"
       y="540.36218" />
    <rect
       style="fill:none;stroke:#666666"
       id="rect2987-1-2-2"
       width="64"
       height="64"
       x="256"
       y="540.36218" />
    <rect
       style="fill:none;stroke:#666666"
       id="rect2987-7-4-2"
       width="64"
       height="64"
       x="320"
       y="540.36218" />
    <rect
       style="fill:none;stroke:#666666"
       id="rect2987-4-5-1"
       width="64"
       height="64"
       x="128"
       y="540.36218" />
    <rect
       style="fill:none;stroke:#666666"
       id="rect2987-0-5-6"
       width="64"
       height="64"
       x="384"
       y="540.36218" />
    <rect
       style="fill:none;stroke:#666666"
       id="rect2987-9-1-8"
       width="64"
       height="64"
       x="448"
       y="540.36218" />
    <rect
       style="fill:none;stroke:#666666"
       id="rect2987-48-7-5"
       width="64"
       height="64"
       x="512"
       y="540.36218" />
    <rect
       style="fill:none;stroke:#666666"
       id="rect2987-76"
       width="64"
       height="64"
       x="192"
       y="604.36218" />
    <rect
       style="fill:none;stroke:#666666"
       id="rect2987-1-1"
       width="64"
       height="64"
       x="256"
       y="604.36218" />
    <rect
       style="fill:none;stroke:#666666"
       id="rect2987-7-8"
       width="64"
       height="64"
       x="320"
       y="604.36218" />
    <rect
       style="fill:none;stroke:#666666"
       id="rect2987-4-9"
       width="64"
       height="64"
       x="128"
       y="604.36218" />
    <rect
       style="fill:none;stroke:#666666"
       id="rect2987-0-2"
       width="64"
       height="64"
       x="384"
       y="604.36218" />
    <rect
       style="fill:none;stroke:#666666"
       id="rect2987-9-7"
       width="64"
       height="64"
       x="448"
       y="604.36218" />
    <rect
       style="fill:none;stroke:#666666"
       id="rect2987-48-9"
       width="64"
       height="64"
       x="512"
       y="604.36218" />
    <rect
       style="fill:none;stroke:#666666"
       id="rect2987-8-5"
       width="64"
       height="64"
       x="192"
       y="668.36218" />
    <rect
       style="fill:none;stroke:#666666"
       id="rect2987-1-2-4"
       width="64"
       height="64"
       x="256"
       y="668.36218" />
    <rect
       style="fill:none;stroke:#666666"
       id="rect2987-7-4-3"
       width="64"
       height="64"
       x="320"
       y="668.36218" />
    <rect
       style="fill:none;stroke:#666666"
       id="rect2987-4-5-12"
       width="64"
       height="64"
       x="128"
       y="668.36218" />
    <rect
       style="fill:none;stroke:#666666"
       id="rect2987-0-5-3"
       width="64"
       height="64"
       x="384"
       y="668.36218" />
    <rect
       style="fill:none;stroke:#666666"
       id="rect2987-9-1-3"
       width="64"
       height="64"
       x="448"
       y="668.36218" />
    <rect
       style="fill:none;stroke:#666666"
       id="rect2987-48-7-4"
       width="64"
       height="64"
       x="512"
       y="668.36218" />
    <rect
       style="fill:none;stroke:#666666"
       id="rect2987-113"
       width="64"
       height="64"
       x="192"
       y="732.36218" />
    <rect
       style="fill:none;stroke:#666666"
       id="rect2987-1-8"
       width="64"
       height="64"
       x="256"
       y="732.36218" />
    <rect
       style="fill:none;stroke:#666666"
       id="rect2987-7-7"
       width="64"
       height="64"
       x="320"
       y="732.36218" />
    <rect
       style="fill:none;stroke:#666666"
       id="rect2987-4-4"
       width="64"
       height="64"
       x="128"
       y="732.36218" />
    <rect
       style="fill:none;stroke:#666666"
       id="rect2987-0-27"
       width="64"
       height="64"
       x="384"
       y="732.36218" />
    <rect
       style="fill:none;stroke:#666666"
       id="rect2987-9-79"
       width="64"
       height="64"
       x="448"
       y="732.36218" />
    <rect
       style="fill:none;stroke:#666666"
       id="rect2987-48-3"
       width="64"
       height="64"
       x="512"
       y="732.36218" />
    <path
       style="fill:none;stroke:#000000;stroke-width:4;stroke-linecap:butt;stroke-linejoin:miter;stroke-opacity:1;stroke-miterlimit:4;stroke-dasharray:none"
       d="m 352,540.36218 0,64"
       id="path3201"
       inkscape:path-effect="#path-effect3203"
       inkscape:original-d="m 352,540.36218 c 0,64 0,64 0,64"
       inkscape:connector-curvature="0" />
    <path
       style="fill:none;stroke:#000000;stroke-width:4;stroke-linecap:butt;stroke-linejoin:miter;stroke-opacity:1;stroke-miterlimit:4;stroke-dasharray:none"
       d="m 320,572.36218 64,0"
       id="path3973"
       inkscape:path-effect="#path-effect3975"
       inkscape:original-d="m 320,572.36218 c 64,0 64,0 64,0"
       inkscape:connector-curvature="0" />
    <path
       style="fill:none;stroke:#000000;stroke-width:4;stroke-linecap:butt;stroke-linejoin:miter;stroke-opacity:1;stroke-miterlimit:4;stroke-dasharray:none"
       d="m 352,476.36218 0,64"
       id="path3977"
       inkscape:path-effect="#path-effect3979"
       inkscape:original-d="m 352,476.36218 c 0,64 0,64 0,64"
       inkscape:connector-curvature="0" />
    <path
       style="fill:none;stroke:#000000;stroke-width:1px;stroke-linecap:butt;stroke-linejoin:miter;stroke-opacity:1"
       d="m 352,476.36218 0,-64"
       id="path3985"
       inkscape:path-effect="#path-effect3987"
       inkscape:original-d="m 352,476.36218 c 0,-64 0,-64 0,-64"
       inkscape:connector-curvature="0" />
    <path
       style="fill:none;stroke:#000000;stroke-width:1px;stroke-linecap:butt;stroke-linejoin:miter;stroke-opacity:1"
       d="m 352,444.36218 64,0 0,-64"
       id="path3989"
       inkscape:path-effect="#path-effect3991"
       inkscape:original-d="m 352,444.36218 c 64,0 64,0 64,0 l 0,-64"
       inkscape:connector-curvature="0" />
    <path
       style="fill:none;stroke:#000000;stroke-width:1px;stroke-linecap:butt;stroke-linejoin:miter;stroke-opacity:1"
       d="m 352,380.36218 64,0"
       id="path3993"
       inkscape:path-effect="#path-effect3995"
       inkscape:original-d="m 352,380.36218 64,0"
       inkscape:connector-curvature="0" />
    <path
       style="fill:none;stroke:#000000;stroke-width:1px;stroke-linecap:butt;stroke-linejoin:miter;stroke-opacity:1"
       d="m 352,412.36218 0,-32"
       id="path3997"
       inkscape:path-effect="#path-effect3999"
       inkscape:original-d="m 352,412.36218 0,-32"
       inkscape:connector-curvature="0" />
  </g>
</svg>
