<?xml version="1.0" encoding="UTF-8" standalone="no"?>
<!-- Created with Inkscape (http://www.inkscape.org/) -->

<svg
   xmlns:dc="http://purl.org/dc/elements/1.1/"
   xmlns:cc="http://creativecommons.org/ns#"
   xmlns:rdf="http://www.w3.org/1999/02/22-rdf-syntax-ns#"
   xmlns:svg="http://www.w3.org/2000/svg"
   xmlns="http://www.w3.org/2000/svg"
   xmlns:sodipodi="http://sodipodi.sourceforge.net/DTD/sodipodi-0.dtd"
   xmlns:inkscape="http://www.inkscape.org/namespaces/inkscape"
   width="640"
   height="480"
   viewBox="0 0 169.33333 127"
   version="1.1"
   id="svg8"
   shape-rendering="crispEdges"
   inkscape:version="0.92.4 (unknown)"
   sodipodi:docname="tilesets.svg">
  <defs
     id="defs2" />
  <sodipodi:namedview
     id="base"
     pagecolor="#ffffff"
     bordercolor="#666666"
     borderopacity="1.0"
     inkscape:pageopacity="0.0"
     inkscape:pageshadow="2"
     inkscape:zoom="30.851552"
     inkscape:cx="21.316536"
     inkscape:cy="-11.650077"
     inkscape:document-units="mm"
     inkscape:current-layer="numbers4x6"
     showgrid="true"
     units="px"
     inkscape:showpageshadow="false"
     showborder="false"
     inkscape:window-width="1920"
     inkscape:window-height="1051"
     inkscape:window-x="1920"
     inkscape:window-y="0"
     inkscape:window-maximized="1">
    <inkscape:grid
       type="xygrid"
       id="grid10"
       empspacing="8" />
  </sodipodi:namedview>
  <metadata
     id="metadata5">
    <rdf:RDF>
      <cc:Work
         rdf:about="">
        <dc:format>image/svg+xml</dc:format>
        <dc:type
           rdf:resource="http://purl.org/dc/dcmitype/StillImage" />
        <dc:title></dc:title>
      </cc:Work>
    </rdf:RDF>
  </metadata>
  <g
     inkscape:label="Layer 1"
     inkscape:groupmode="layer"
     id="layer1"
     transform="translate(0,-169.99997)">
    <path
       style="fill:#000000;stroke:none;stroke-width:0.26458332px;stroke-linecap:butt;stroke-linejoin:miter;stroke-opacity:1"
       d="m -2.1166667,294.8833 h 0.2645833 v 0.26458 h -0.2645833 z"
       id="path12-477-5"
       inkscape:connector-curvature="0" />
    <g
       id="numbers4x6">
      <path
         inkscape:export-ydpi="96"
         inkscape:export-xdpi="96"
         id="path12"
         transform="matrix(0.26458333,0,0,0.26458333,0,169.99997)"
         d="M 0 480 L 0 481 L 0 482 L 0 483 L 0 484 L 0 485 L 1 485 L 2 485 L 3 485 L 3 484 L 3 483 L 3 482 L 3 481 L 3 480 L 2 480 L 1 480 L 0 480 z M 1 481 L 2 481 L 2 482 L 2 483 L 2 484 L 1 484 L 1 483 L 1 482 L 1 481 z "
         style="fill:#000000;stroke:none;stroke-width:0.99999994px;stroke-linecap:butt;stroke-linejoin:miter;stroke-opacity:1" />
      <path
         inkscape:export-ydpi="96"
         inkscape:export-xdpi="96"
         id="path12-1"
         transform="matrix(0.26458333,0,0,0.26458333,0,169.99997)"
         d="M 4 480 L 4 481 L 5 481 L 5 482 L 5 483 L 5 484 L 4 484 L 4 485 L 5 485 L 6 485 L 7 485 L 7 484 L 6 484 L 6 483 L 6 482 L 6 481 L 6 480 L 5 480 L 4 480 z "
         style="fill:#000000;stroke:none;stroke-width:0.99999994px;stroke-linecap:butt;stroke-linejoin:miter;stroke-opacity:1" />
      <path
         inkscape:export-ydpi="96"
         inkscape:export-xdpi="96"
         id="path12-20"
         transform="matrix(0.26458333,0,0,0.26458333,0,169.99997)"
         d="M 8 480 L 8 481 L 9 481 L 10 481 L 10 482 L 9 482 L 8 482 L 8 483 L 8 484 L 8 485 L 9 485 L 10 485 L 11 485 L 11 484 L 10 484 L 9 484 L 9 483 L 10 483 L 11 483 L 11 482 L 11 481 L 11 480 L 10 480 L 9 480 L 8 480 z "
         style="fill:#000000;stroke:none;stroke-width:0.99999994px;stroke-linecap:butt;stroke-linejoin:miter;stroke-opacity:1" />
      <path
         inkscape:export-ydpi="96"
         inkscape:export-xdpi="96"
         id="path12-63"
         transform="matrix(0.26458333,0,0,0.26458333,0,169.99997)"
         d="M 12 480 L 12 481 L 13 481 L 14 481 L 14 482 L 13 482 L 13 483 L 14 483 L 14 484 L 13 484 L 12 484 L 12 485 L 13 485 L 14 485 L 15 485 L 15 484 L 15 483 L 15 482 L 15 481 L 15 480 L 14 480 L 13 480 L 12 480 z "
         style="fill:#000000;stroke:none;stroke-width:0.99999994px;stroke-linecap:butt;stroke-linejoin:miter;stroke-opacity:1" />
      <path
         inkscape:export-ydpi="96"
         inkscape:export-xdpi="96"
         id="path12-44"
         transform="matrix(0.26458333,0,0,0.26458333,0,169.99997)"
         d="M 16 480 L 16 481 L 16 482 L 16 483 L 17 483 L 18 483 L 18 484 L 18 485 L 19 485 L 19 484 L 19 483 L 19 482 L 19 481 L 19 480 L 18 480 L 18 481 L 18 482 L 17 482 L 17 481 L 17 480 L 16 480 z "
         style="fill:#000000;stroke:none;stroke-width:0.99999994px;stroke-linecap:butt;stroke-linejoin:miter;stroke-opacity:1" />
      <path
         inkscape:export-ydpi="96"
         inkscape:export-xdpi="96"
         id="path12-64"
         transform="matrix(0.26458333,0,0,0.26458333,0,169.99997)"
         d="M 20 480 L 20 481 L 20 482 L 20 483 L 21 483 L 22 483 L 22 484 L 21 484 L 20 484 L 20 485 L 21 485 L 22 485 L 23 485 L 23 484 L 23 483 L 23 482 L 22 482 L 21 482 L 21 481 L 22 481 L 23 481 L 23 480 L 22 480 L 21 480 L 20 480 z "
         style="fill:#000000;stroke:none;stroke-width:0.99999994px;stroke-linecap:butt;stroke-linejoin:miter;stroke-opacity:1" />
      <path
         inkscape:export-ydpi="96"
         inkscape:export-xdpi="96"
         id="path12-91"
         transform="matrix(0.26458333,0,0,0.26458333,0,169.99997)"
         d="M 24 480 L 24 481 L 24 482 L 24 483 L 24 484 L 24 485 L 25 485 L 26 485 L 27 485 L 27 484 L 27 483 L 27 482 L 26 482 L 25 482 L 25 481 L 26 481 L 27 481 L 27 480 L 26 480 L 25 480 L 24 480 z M 25 483 L 26 483 L 26 484 L 25 484 L 25 483 z "
         style="fill:#000000;stroke:none;stroke-width:0.99999994px;stroke-linecap:butt;stroke-linejoin:miter;stroke-opacity:1" />
      <path
         inkscape:export-ydpi="96"
         inkscape:export-xdpi="96"
         id="path12-85"
         transform="matrix(0.26458333,0,0,0.26458333,0,169.99997)"
         d="M 28 480 L 28 481 L 29 481 L 30 481 L 30 482 L 30 483 L 30 484 L 30 485 L 31 485 L 31 484 L 31 483 L 31 482 L 31 481 L 31 480 L 30 480 L 29 480 L 28 480 z "
         style="fill:#000000;stroke:none;stroke-width:0.99999994px;stroke-linecap:butt;stroke-linejoin:miter;stroke-opacity:1" />
      <path
         inkscape:export-ydpi="96"
         inkscape:export-xdpi="96"
         id="path12-044"
         transform="matrix(0.26458333,0,0,0.26458333,0,169.99997)"
         d="M 32 480 L 32 481 L 32 482 L 32 483 L 32 484 L 32 485 L 33 485 L 34 485 L 35 485 L 35 484 L 35 483 L 35 482 L 35 481 L 35 480 L 34 480 L 33 480 L 32 480 z M 33 481 L 34 481 L 34 482 L 33 482 L 33 481 z M 33 483 L 34 483 L 34 484 L 33 484 L 33 483 z "
         style="fill:#000000;stroke:none;stroke-width:0.99999994px;stroke-linecap:butt;stroke-linejoin:miter;stroke-opacity:1" />
      <path
         inkscape:export-ydpi="96"
         inkscape:export-xdpi="96"
         id="path12-33"
         transform="matrix(0.26458333,0,0,0.26458333,0,169.99997)"
         d="M 36 480 L 36 481 L 36 482 L 36 483 L 37 483 L 38 483 L 38 484 L 37 484 L 36 484 L 36 485 L 37 485 L 38 485 L 39 485 L 39 484 L 39 483 L 39 482 L 39 481 L 39 480 L 38 480 L 37 480 L 36 480 z M 37 481 L 38 481 L 38 482 L 37 482 L 37 481 z "
         style="fill:#000000;stroke:none;stroke-width:0.99999994px;stroke-linecap:butt;stroke-linejoin:miter;stroke-opacity:1" />
      <path
         inkscape:export-ydpi="96"
         inkscape:export-xdpi="96"
         inkscape:connector-curvature="0"
         id="path12-477-5-4"
         d="M -2.6458333e-8,298.58747 H 0.26458327 v 0.26458 H -2.6458333e-8 Z"
         style="fill:#000000;stroke:none;stroke-width:0.26458332px;stroke-linecap:butt;stroke-linejoin:miter;stroke-opacity:1" />
      <path
         inkscape:export-ydpi="96"
         inkscape:export-xdpi="96"
         inkscape:connector-curvature="0"
         id="path12-477-5-8"
         d="m 0.26458331,298.85205 h 0.2645833 v 0.26458 h -0.2645833 z"
         style="fill:#000000;stroke:none;stroke-width:0.26458332px;stroke-linecap:butt;stroke-linejoin:miter;stroke-opacity:1" />
      <path
         inkscape:export-ydpi="96"
         inkscape:export-xdpi="96"
         inkscape:connector-curvature="0"
         id="path12-477-5-1"
         d="m 0.52916664,299.11663 h 0.2645833 v 0.26458 h -0.2645833 z"
         style="fill:#000000;stroke:none;stroke-width:0.26458332px;stroke-linecap:butt;stroke-linejoin:miter;stroke-opacity:1" />
      <path
         inkscape:export-ydpi="96"
         inkscape:export-xdpi="96"
         inkscape:connector-curvature="0"
         id="path12-477-5-2"
         d="m 0.26458331,299.38122 h 0.2645833 v 0.26458 h -0.2645833 z"
         style="fill:#000000;stroke:none;stroke-width:0.26458332px;stroke-linecap:butt;stroke-linejoin:miter;stroke-opacity:1" />
      <path
         inkscape:export-ydpi="96"
         inkscape:export-xdpi="96"
         inkscape:connector-curvature="0"
         id="path12-477-5-89"
         d="M -2.6458333e-8,299.6458 H 0.26458327 v 0.26458 H -2.6458333e-8 Z"
         style="fill:#000000;stroke:none;stroke-width:0.26458332px;stroke-linecap:butt;stroke-linejoin:miter;stroke-opacity:1" />
      <path
         inkscape:export-ydpi="96"
         inkscape:export-xdpi="96"
         inkscape:connector-curvature="0"
         id="path711"
         d="m 0,296.99997 h 10.583333 v 3.175 H 0 Z"
         style="fill:none;stroke:none;stroke-width:0.26458332px;stroke-linecap:butt;stroke-linejoin:miter;stroke-opacity:1" />
    </g>
  </g>
</svg>
