<!-- This Source Code Form is subject to the terms of the Mozilla Public
   - License, v. 2.0. If a copy of the MPL was not distributed with this
   - file, You can obtain one at http://mozilla.org/MPL/2.0/. -->
<svg xmlns="http://www.w3.org/2000/svg" viewBox="0 0 16 16" width="16" height="16" fill-opacity="context-fill-opacity">
   <path d="M2 2a2 2 0 0 0-2 2l0 8a2 2 0 0 0 2 2l12 0a2 2 0 0 0 2-2l0-8a2 2 0 0 0-2-2L2 2zm12.75 10.15-.6.6-12.3 0-.6-.6 0-8.3.6-.6 12.3 0 .6.6 0 8.3z" fill="context-stroke"/>
</svg>
