<clientConfig version="1.1">
	<carddavProvider id="CardDAVEngine">
		<carddavURL>https://webmail.laposte.net/dav/%EMAILADDRESS%/contacts</carddavURL>
		<vCardVersion>3.0</vCardVersion>
	</carddavProvider>
</clientConfig>