<?xml version="1.0" encoding="UTF-8" standalone="no"?>
<svg
   xmlns:dc="http://purl.org/dc/elements/1.1/"
   xmlns:cc="http://creativecommons.org/ns#"
   xmlns:rdf="http://www.w3.org/1999/02/22-rdf-syntax-ns#"
   xmlns:svg="http://www.w3.org/2000/svg"
   xmlns="http://www.w3.org/2000/svg"
   xmlns:sodipodi="http://sodipodi.sourceforge.net/DTD/sodipodi-0.dtd"
   xmlns:inkscape="http://www.inkscape.org/namespaces/inkscape"
   inkscape:version="1.0 (4035a4f, 2020-05-01)"
   sodipodi:docname="flow-1.svg"
   id="svg648"
   version="1.1"
   width="304.09604pt"
   height="166.19377pt"
   viewBox="-152.04802 -158.44603 304.09604 166.19377 ">
  <metadata
     id="metadata654">
    <rdf:RDF>
      <cc:Work
         rdf:about="">
        <dc:format>image/svg+xml</dc:format>
        <dc:type
           rdf:resource="http://purl.org/dc/dcmitype/StillImage" />
        <dc:title></dc:title>
      </cc:Work>
    </rdf:RDF>
  </metadata>
  <defs
     id="defs652" />
  <sodipodi:namedview
     inkscape:current-layer="svg648"
     inkscape:window-maximized="0"
     inkscape:window-y="252"
     inkscape:window-x="0"
     inkscape:cy="110.79585"
     inkscape:cx="202.73069"
     inkscape:zoom="2.7055597"
     showgrid="false"
     id="namedview650"
     inkscape:window-height="900"
     inkscape:window-width="1440"
     inkscape:pageshadow="2"
     inkscape:pageopacity="0"
     guidetolerance="10"
     gridtolerance="10"
     objecttolerance="10"
     borderopacity="1"
     bordercolor="#666666"
     pagecolor="#ffffff" />
  <g
     id="g646"
     transform="translate(0, 7.74774 ) scale(1,-1) translate(0,158.44603 )">
    <g
       id="g644"
       stroke="#000"
       fill="#000">
      <g
         id="g642"
         stroke-width="0.4">
        <g
           id="g16"
           transform="translate(-27.9515,-2.47162)">
          <g
             id="g14"
             fill="#000">
            <text
               id="text12"
               style="stroke:none"
               transform="scale(1,-1) translate(27.9515,0)"
               text-anchor="middle"
               font-size="10"><tspan
                 id="tspan10"
                 font-family="ecrm"
                 font-size="10">Argot Server</tspan></text>
          </g>
        </g>
        <g
           id="g32"
           stroke="#2e3436">
          <g
             id="g30"
             fill="#eeeeec">
            <g
               id="g22"
               stroke="#2e3436">
              <g
                 id="g20"
                 fill="#eeeeec">
                <path
                   id="path18"
                   d=" M 4.71265 -32.8555 C 4.71265 -30.25275 2.60275 -28.14285 0.0 -28.14285 C -2.60275 -28.14285 -4.71265 -30.25275 -4.71265 -32.8555 C -4.71265 -35.45825 -2.60275 -37.56815 0.0 -37.56815 C 2.60275 -37.56815 4.71265 -35.45825 4.71265 -32.8555 Z M 0.0 -32.8555  " />
              </g>
            </g>
            <g
               id="g28"
               transform="translate(0.0,-32.8555)">
              <g
                 id="g26"
                 fill="#000">
                <text
                   id="text24"
                   style="stroke:none"
                   transform="scale(1,-1) translate(0.0,0)"
                   text-anchor="middle"
                   font-size="10"><NIL /></text>
              </g>
            </g>
          </g>
        </g>
        <g
           id="g48"
           stroke="#2e3436">
          <g
             id="g46"
             fill="#eeeeec">
            <g
               id="g38"
               stroke="#2e3436">
              <g
                 id="g36"
                 fill="#eeeeec">
                <path
                   id="path34"
                   d=" M -5.28491 -45.35245 C -5.28491 -42.7497 -7.3948 -40.6398 -9.99756 -40.6398 C -12.60031 -40.6398 -14.7102 -42.7497 -14.7102 -45.35245 C -14.7102 -47.9552 -12.60031 -50.0651 -9.99756 -50.0651 C -7.3948 -50.0651 -5.28491 -47.9552 -5.28491 -45.35245 Z M -9.99756 -45.35245  " />
              </g>
            </g>
            <g
               id="g44"
               transform="translate(-9.99756,-45.35245)">
              <g
                 id="g42"
                 fill="#000">
                <text
                   id="text40"
                   style="stroke:none"
                   transform="scale(1,-1) translate(0.0,0)"
                   text-anchor="middle"
                   font-size="10"><NIL /></text>
              </g>
            </g>
          </g>
        </g>
        <path
           id="path50"
           d=" M -3.06874 -36.69139 L -6.92882 -41.51656  "
           fill="none" />
        <g
           id="g66"
           stroke="#2e3436">
          <g
             id="g64"
             fill="#eeeeec">
            <g
               id="g56"
               stroke="#2e3436">
              <g
                 id="g54"
                 fill="#eeeeec">
                <path
                   id="path52"
                   d=" M 14.7102 -45.35245 C 14.7102 -42.7497 12.60031 -40.6398 9.99756 -40.6398 C 7.3948 -40.6398 5.28491 -42.7497 5.28491 -45.35245 C 5.28491 -47.9552 7.3948 -50.0651 9.99756 -50.0651 C 12.60031 -50.0651 14.7102 -47.9552 14.7102 -45.35245 Z M 9.99756 -45.35245  " />
              </g>
            </g>
            <g
               id="g62"
               transform="translate(9.99756,-45.35245)">
              <g
                 id="g60"
                 fill="#000">
                <text
                   id="text58"
                   style="stroke:none"
                   transform="scale(1,-1) translate(0.0,0)"
                   text-anchor="middle"
                   font-size="10"><NIL /></text>
              </g>
            </g>
          </g>
        </g>
        <path
           id="path68"
           d=" M 3.06874 -36.69139 L 6.92882 -41.51656  "
           fill="none" />
        <g
           id="g84"
           stroke="#2e3436">
          <g
             id="g82"
             fill="#eeeeec">
            <g
               id="g74"
               stroke="#2e3436">
              <g
                 id="g72"
                 fill="#eeeeec">
                <path
                   id="path70"
                   d=" M 4.71265 -57.8494 C 4.71265 -55.24664 2.60275 -53.13675 0.0 -53.13675 C -2.60275 -53.13675 -4.71265 -55.24664 -4.71265 -57.8494 C -4.71265 -60.45215 -2.60275 -62.56204 0.0 -62.56204 C 2.60275 -62.56204 4.71265 -60.45215 4.71265 -57.8494 Z M 0.0 -57.8494  " />
              </g>
            </g>
            <g
               id="g80"
               transform="translate(0.0,-57.8494)">
              <g
                 id="g78"
                 fill="#000">
                <text
                   id="text76"
                   style="stroke:none"
                   transform="scale(1,-1) translate(0.0,0)"
                   text-anchor="middle"
                   font-size="10"><NIL /></text>
              </g>
            </g>
          </g>
        </g>
        <path
           id="path86"
           d=" M 6.92882 -49.18834 L 3.06874 -54.0135  "
           fill="none" />
        <g
           id="g102"
           stroke="#2e3436">
          <g
             id="g100"
             fill="#eeeeec">
            <g
               id="g92"
               stroke="#2e3436">
              <g
                 id="g90"
                 fill="#eeeeec">
                <path
                   id="path88"
                   d=" M -5.28491 -70.34634 C -5.28491 -67.74359 -7.3948 -65.6337 -9.99756 -65.6337 C -12.60031 -65.6337 -14.7102 -67.74359 -14.7102 -70.34634 C -14.7102 -72.9491 -12.60031 -75.05899 -9.99756 -75.05899 C -7.3948 -75.05899 -5.28491 -72.9491 -5.28491 -70.34634 Z M -9.99756 -70.34634  " />
              </g>
            </g>
            <g
               id="g98"
               transform="translate(-9.99756,-70.34634)">
              <g
                 id="g96"
                 fill="#000">
                <text
                   id="text94"
                   style="stroke:none"
                   transform="scale(1,-1) translate(0.0,0)"
                   text-anchor="middle"
                   font-size="10"><NIL /></text>
              </g>
            </g>
          </g>
        </g>
        <path
           id="path104"
           d=" M -3.06874 -61.68529 L -6.92882 -66.51045  "
           fill="none" />
        <g
           id="g120"
           stroke="#2e3436">
          <g
             id="g118"
             fill="#eeeeec">
            <g
               id="g110"
               stroke="#2e3436">
              <g
                 id="g108"
                 fill="#eeeeec">
                <path
                   id="path106"
                   d=" M 14.7102 -70.34634 C 14.7102 -67.74359 12.60031 -65.6337 9.99756 -65.6337 C 7.3948 -65.6337 5.28491 -67.74359 5.28491 -70.34634 C 5.28491 -72.9491 7.3948 -75.05899 9.99756 -75.05899 C 12.60031 -75.05899 14.7102 -72.9491 14.7102 -70.34634 Z M 9.99756 -70.34634  " />
              </g>
            </g>
            <g
               id="g116"
               transform="translate(9.99756,-70.34634)">
              <g
                 id="g114"
                 fill="#000">
                <text
                   id="text112"
                   style="stroke:none"
                   transform="scale(1,-1) translate(0.0,0)"
                   text-anchor="middle"
                   font-size="10"><NIL /></text>
              </g>
            </g>
          </g>
        </g>
        <path
           id="path122"
           d=" M 3.06874 -61.68529 L 6.92882 -66.51045  "
           fill="none" />
        <g
           id="g138"
           stroke="#2e3436">
          <g
             id="g136"
             fill="#eeeeec">
            <g
               id="g128"
               stroke="#2e3436">
              <g
                 id="g126"
                 fill="#eeeeec">
                <path
                   id="path124"
                   d=" M 14.7102 -82.84329 C 14.7102 -80.24054 12.60031 -78.13065 9.99756 -78.13065 C 7.3948 -78.13065 5.28491 -80.24054 5.28491 -82.84329 C 5.28491 -85.44604 7.3948 -87.55594 9.99756 -87.55594 C 12.60031 -87.55594 14.7102 -85.44604 14.7102 -82.84329 Z M 9.99756 -82.84329  " />
              </g>
            </g>
            <g
               id="g134"
               transform="translate(9.99756,-82.84329)">
              <g
                 id="g132"
                 fill="#000">
                <text
                   id="text130"
                   style="stroke:none"
                   transform="scale(1,-1) translate(0.0,0)"
                   text-anchor="middle"
                   font-size="10"><NIL /></text>
              </g>
            </g>
          </g>
        </g>
        <path
           id="path140"
           d=" M 9.99756 -75.25899 L 9.99756 -77.93065  "
           fill="none" />
        <g
           id="g156"
           stroke="#2e3436">
          <g
             id="g154"
             fill="#eeeeec">
            <g
               id="g146"
               stroke="#2e3436">
              <g
                 id="g144"
                 fill="#eeeeec">
                <path
                   id="path142"
                   d=" M 24.70776 -57.8494 C 24.70776 -55.24664 22.59787 -53.13675 19.99512 -53.13675 C 17.39236 -53.13675 15.28247 -55.24664 15.28247 -57.8494 C 15.28247 -60.45215 17.39236 -62.56204 19.99512 -62.56204 C 22.59787 -62.56204 24.70776 -60.45215 24.70776 -57.8494 Z M 19.99512 -57.8494  " />
              </g>
            </g>
            <g
               id="g152"
               transform="translate(19.99512,-57.8494)">
              <g
                 id="g150"
                 fill="#000">
                <text
                   id="text148"
                   style="stroke:none"
                   transform="scale(1,-1) translate(0.0,0)"
                   text-anchor="middle"
                   font-size="10"><NIL /></text>
              </g>
            </g>
          </g>
        </g>
        <path
           id="path158"
           d=" M 13.0663 -49.18834 L 16.92638 -54.0135  "
           fill="none" />
        <path
           id="path160"
           d=" M 45.51831 -57.8494 C 45.51831 -35.4708 27.37738 -17.32986 4.99878 -17.32986 C -17.37982 -17.32986 -35.52075 -35.4708 -35.52075 -57.8494 C -35.52075 -80.228 -17.37982 -98.36893 4.99878 -98.36893 C 27.37738 -98.36893 45.51831 -80.228 45.51831 -57.8494 Z M 4.99878 -57.8494  "
           fill="none" />
        <g
           id="g166"
           transform="translate(-14.9102,-57.8494)">
          <g
             id="g164"
             fill="#000">
            <text
               id="text162"
               style="stroke:none"
               transform="scale(1,-1) translate(19.90898,0)"
               text-anchor="middle"
               font-size="10"><NIL /></text>
          </g>
        </g>
        <g
           id="g174"
           transform="translate(-122.05011,-3.4436)">
          <g
             id="g172"
             fill="#000">
            <text
               id="text170"
               style="stroke:none"
               transform="scale(1,-1) translate(13.52448,0)"
               text-anchor="middle"
               font-size="10"><tspan
                 id="tspan168"
                 font-family="ecrm"
                 font-size="10">Muses</tspan></text>
          </g>
        </g>
        <path
           id="path176"
           d=" M -151.84802 -32.6688 h 86.64478 v 15.49548 h -86.64478 Z  "
           fill="none" />
        <g
           id="g184"
           transform="translate(-148.51587,-27.39267)">
          <g
             id="g182"
             fill="#000">
            <text
               id="text180"
               style="stroke:none"
               transform="scale(1,-1) translate(39.99023,0)"
               text-anchor="middle"
               font-size="10"><tspan
                 id="tspan178"
                 font-family="ecrm"
                 font-size="10">Hypothesis</tspan></text>
          </g>
        </g>
        <path
           id="path186"
           d=" M -151.84802 -56.61786 h 86.64478 v 13.55151 h -86.64478 Z  "
           fill="none" />
        <g
           id="g194"
           transform="translate(-148.51587,-53.2857)">
          <g
             id="g192"
             fill="#000">
            <text
               id="text190"
               style="stroke:none"
               transform="scale(1,-1) translate(39.99023,0)"
               text-anchor="middle"
               font-size="10"><tspan
                 id="tspan188"
                 font-family="ecrm"
                 font-size="10">Refactor</tspan></text>
          </g>
        </g>
        <path
           id="path196"
           d=" M -151.84802 -80.56693 h 86.64478 v 13.55151 h -86.64478 Z  "
           fill="none" />
        <g
           id="g204"
           transform="translate(-148.51587,-77.23477)">
          <g
             id="g202"
             fill="#000">
            <text
               id="text200"
               style="stroke:none"
               transform="scale(1,-1) translate(39.99023,0)"
               text-anchor="middle"
               font-size="10"><tspan
                 id="tspan198"
                 font-family="ecrm"
                 font-size="10">SSR</tspan></text>
          </g>
        </g>
        <path
           id="path206"
           d=" M -151.84802 -106.45996 h 86.64478 v 15.49548 h -86.64478 Z  "
           fill="none" />
        <g
           id="g214"
           transform="translate(-148.51587,-101.18384)">
          <g
             id="g212"
             fill="#000">
            <text
               id="text210"
               style="stroke:none"
               transform="scale(1,-1) translate(39.99023,0)"
               text-anchor="middle"
               font-size="10"><tspan
                 id="tspan208"
                 font-family="ecrm"
                 font-size="10">Trinity</tspan></text>
          </g>
        </g>
        <path
           id="path216"
           d=" M -151.84802 -130.40903 h 86.64478 v 13.55151 h -86.64478 Z  "
           fill="none" />
        <g
           id="g224"
           transform="translate(-148.51587,-127.07687)">
          <g
             id="g222"
             fill="#000">
            <text
               id="text220"
               style="stroke:none"
               transform="scale(1,-1) translate(39.99023,0)"
               text-anchor="middle"
               font-size="10"><tspan
                 id="tspan218"
                 font-family="ecrm"
                 font-size="10">REGEL</tspan></text>
          </g>
        </g>
        <path
           id="path226"
           d=" M -151.84802 -154.3581 h 86.64478 v 13.55151 h -86.64478 Z  "
           fill="none" />
        <g
           id="g234"
           transform="translate(-148.51587,-151.02594)">
          <g
             id="g232"
             fill="#000">
            <text
               id="text230"
               style="stroke:none"
               transform="scale(1,-1) translate(39.99023,0)"
               text-anchor="middle"
               font-size="10"><tspan
                 id="tspan228"
                 font-family="ecrm"
                 font-size="10">GenPatcher</tspan></text>
          </g>
        </g>
        <g
           id="g242"
           transform="translate(95.00116,-3.4436)">
          <g
             id="g240"
             fill="#000">
            <text
               id="text238"
               style="stroke:none"
               transform="scale(1,-1) translate(13.52448,0)"
               text-anchor="middle"
               font-size="10"><tspan
                 id="tspan236"
                 font-family="ecrm"
                 font-size="10">Muses</tspan></text>
          </g>
        </g>
        <path
           id="path244"
           d=" M 65.20325 -32.6688 h 86.64478 v 15.49548 h -86.64478 Z  "
           fill="none" />
        <g
           id="g252"
           transform="translate(68.5354,-27.39267)">
          <g
             id="g250"
             fill="#000">
            <text
               id="text248"
               style="stroke:none"
               transform="scale(1,-1) translate(39.99023,0)"
               text-anchor="middle"
               font-size="10"><tspan
                 id="tspan246"
                 font-family="ecrm"
                 font-size="10">Argot Core</tspan></text>
          </g>
        </g>
        <path
           id="path254"
           d=" M 65.20325 -58.56183 h 86.64478 v 15.49548 h -86.64478 Z  "
           fill="none" />
        <g
           id="g262"
           transform="translate(68.5354,-53.2857)">
          <g
             id="g260"
             fill="#000">
            <text
               id="text258"
               style="stroke:none"
               transform="scale(1,-1) translate(39.99023,0)"
               text-anchor="middle"
               font-size="10"><tspan
                 id="tspan256"
                 font-family="ecrm"
                 font-size="10">Type View</tspan></text>
          </g>
        </g>
        <path
           id="path264"
           d=" M 65.20325 -82.5109 h 86.64478 v 13.55151 h -86.64478 Z  "
           fill="none" />
        <g
           id="g272"
           transform="translate(68.5354,-79.17874)">
          <g
             id="g270"
             fill="#000">
            <text
               id="text268"
               style="stroke:none"
               transform="scale(1,-1) translate(39.99023,0)"
               text-anchor="middle"
               font-size="10"><tspan
                 id="tspan266"
                 font-family="ecrm"
                 font-size="10">Test View</tspan></text>
          </g>
        </g>
        <path
           id="path274"
           d=" M 65.20325 -108.40393 h 86.64478 v 15.49548 h -86.64478 Z  "
           fill="none" />
        <g
           id="g282"
           transform="translate(68.5354,-103.1278)">
          <g
             id="g280"
             fill="#000">
            <text
               id="text278"
               style="stroke:none"
               transform="scale(1,-1) translate(39.99023,0)"
               text-anchor="middle"
               font-size="10"><tspan
                 id="tspan276"
                 font-family="ecrm"
                 font-size="10">TypeWriter</tspan></text>
          </g>
        </g>
        <path
           id="path284"
           d=" M 65.20325 -132.353 h 86.64478 v 13.55151 h -86.64478 Z  "
           fill="none" />
        <g
           id="g292"
           transform="translate(68.5354,-129.02084)">
          <g
             id="g290"
             fill="#000">
            <text
               id="text288"
               style="stroke:none"
               transform="scale(1,-1) translate(39.99023,0)"
               text-anchor="middle"
               font-size="10"><tspan
                 id="tspan286"
                 font-family="ecrm"
                 font-size="10">LambdaNet</tspan></text>
          </g>
        </g>
        <path
           id="path294"
           d=" M 65.20325 -158.24603 h 86.64478 v 15.49548 h -86.64478 Z  "
           fill="none" />
        <g
           id="g302"
           transform="translate(68.5354,-152.96991)">
          <g
             id="g300"
             fill="#000">
            <text
               id="text298"
               style="stroke:none"
               transform="scale(1,-1) translate(39.99023,0)"
               text-anchor="middle"
               font-size="10"><tspan
                 id="tspan296"
                 font-family="ecrm"
                 font-size="10">Boogie</tspan></text>
          </g>
        </g>
        <path
           id="path304"
           d=" M -7.35895 -132.31555 h 24.71545 v 13.55151 h -24.71545 Z  "
           fill="none" />
        <g
           id="g312"
           transform="translate(-4.0268,-128.9834)">
          <g
             id="g310"
             fill="#000">
            <text
               id="text308"
               style="stroke:none"
               transform="scale(1,-1) translate(9.02557,0)"
               text-anchor="middle"
               font-size="10"><tspan
                 id="tspan306"
                 font-family="ecrm"
                 font-size="10">IDE</tspan></text>
          </g>
        </g>
        <g
           id="g344"
           stroke-width="0.8">
          <path
             id="path314"
             d=" M -32.56999 -40.17752 L -64.27939 -25.26154  "
             fill="none" />
          <g
             id="g324"
             transform="matrix(0.90485,-0.42563,0.42563,0.90485,-32.20807,-40.34776)">
            <g
               id="g322"
               stroke-dasharray="none"
               stroke-dashoffset="0.0">
              <g
                 id="g320"
                 stroke-linecap="round">
                <g
                   id="g318"
                   stroke-linejoin="round">
                  <path
                     id="path316"
                     d=" M -2.56 3.12257 C -2.0923 1.24901 -1.05006 0.3643 0.0 0.0 C -1.05006 -0.3643 -2.0923 -1.24901 -2.56 -3.12257  "
                     fill="none" />
                </g>
              </g>
            </g>
          </g>
          <g
             id="g334"
             transform="matrix(-0.90485,0.42563,-0.42563,-0.90485,-64.64131,-25.0913)">
            <g
               id="g332"
               stroke-dasharray="none"
               stroke-dashoffset="0.0">
              <g
                 id="g330"
                 stroke-linecap="round">
                <g
                   id="g328"
                   stroke-linejoin="round">
                  <path
                     id="path326"
                     d=" M -2.56 3.12257 C -2.0923 1.24901 -1.05006 0.3643 0.0 0.0 C -1.05006 -0.3643 -2.0923 -1.24901 -2.56 -3.12257  "
                     fill="none" />
                </g>
              </g>
            </g>
          </g>
          <g
             id="g342"
             transform="matrix(0.90485,-0.42563,0.42563,0.90485,-55.25421,-25.38278)">
            <g
               id="g340"
               fill="#000">
              <text
                 id="text338"
                 style="stroke:none"
                 transform="scale(1,-1) translate(9.30328,0)"
                 text-anchor="middle"
                 font-size="10"><tspan
                   id="tspan336"
                   font-family="ecrm"
                   font-size="10">LSP</tspan></text>
            </g>
          </g>
        </g>
        <g
           id="g368"
           stroke-width="0.8">
          <path
             id="path346"
             d=" M -36.24957 -53.13205 L -64.2085 -49.93301  "
             fill="none" />
          <g
             id="g356"
             transform="matrix(0.99347,-0.11366,0.11366,0.99347,-35.85219,-53.1775)">
            <g
               id="g354"
               stroke-dasharray="none"
               stroke-dashoffset="0.0">
              <g
                 id="g352"
                 stroke-linecap="round">
                <g
                   id="g350"
                   stroke-linejoin="round">
                  <path
                     id="path348"
                     d=" M -2.56 3.12257 C -2.0923 1.24901 -1.05006 0.3643 0.0 0.0 C -1.05006 -0.3643 -2.0923 -1.24901 -2.56 -3.12257  "
                     fill="none" />
                </g>
              </g>
            </g>
          </g>
          <g
             id="g366"
             transform="matrix(-0.99347,0.11365,-0.11365,-0.99347,-64.60588,-49.88756)">
            <g
               id="g364"
               stroke-dasharray="none"
               stroke-dashoffset="0.0">
              <g
                 id="g362"
                 stroke-linecap="round">
                <g
                   id="g360"
                   stroke-linejoin="round">
                  <path
                     id="path358"
                     d=" M -2.56 3.12257 C -2.0923 1.24901 -1.05006 0.3643 0.0 0.0 C -1.05006 -0.3643 -2.0923 -1.24901 -2.56 -3.12257  "
                     fill="none" />
                </g>
              </g>
            </g>
          </g>
        </g>
        <g
           id="g392"
           stroke-width="0.8">
          <path
             id="path370"
             d=" M -35.48297 -67.06798 L -64.22327 -73.61356  "
             fill="none" />
          <g
             id="g380"
             transform="matrix(0.97499,0.22203,-0.22203,0.97499,-35.09299,-66.97919)">
            <g
               id="g378"
               stroke-dasharray="none"
               stroke-dashoffset="0.0">
              <g
                 id="g376"
                 stroke-linecap="round">
                <g
                   id="g374"
                   stroke-linejoin="round">
                  <path
                     id="path372"
                     d=" M -2.56 3.12257 C -2.0923 1.24901 -1.05006 0.3643 0.0 0.0 C -1.05006 -0.3643 -2.0923 -1.24901 -2.56 -3.12257  "
                     fill="none" />
                </g>
              </g>
            </g>
          </g>
          <g
             id="g390"
             transform="matrix(-0.975,-0.22203,0.22203,-0.975,-64.61325,-73.70235)">
            <g
               id="g388"
               stroke-dasharray="none"
               stroke-dashoffset="0.0">
              <g
                 id="g386"
                 stroke-linecap="round">
                <g
                   id="g384"
                   stroke-linejoin="round">
                  <path
                     id="path382"
                     d=" M -2.56 3.12257 C -2.0923 1.24901 -1.05006 0.3643 0.0 0.0 C -1.05006 -0.3643 -2.0923 -1.24901 -2.56 -3.12257  "
                     fill="none" />
                </g>
              </g>
            </g>
          </g>
        </g>
        <g
           id="g416"
           stroke-width="0.8">
          <path
             id="path394"
             d=" M -30.85628 -78.77957 L -64.31241 -98.30894  "
             fill="none" />
          <g
             id="g404"
             transform="matrix(0.86359,0.5041,-0.5041,0.86359,-30.51085,-78.57793)">
            <g
               id="g402"
               stroke-dasharray="none"
               stroke-dashoffset="0.0">
              <g
                 id="g400"
                 stroke-linecap="round">
                <g
                   id="g398"
                   stroke-linejoin="round">
                  <path
                     id="path396"
                     d=" M -2.56 3.12257 C -2.0923 1.24901 -1.05006 0.3643 0.0 0.0 C -1.05006 -0.3643 -2.0923 -1.24901 -2.56 -3.12257  "
                     fill="none" />
                </g>
              </g>
            </g>
          </g>
          <g
             id="g414"
             transform="matrix(-0.86357,-0.5041,0.5041,-0.86357,-64.65782,-98.51059)">
            <g
               id="g412"
               stroke-dasharray="none"
               stroke-dashoffset="0.0">
              <g
                 id="g410"
                 stroke-linecap="round">
                <g
                   id="g408"
                   stroke-linejoin="round">
                  <path
                     id="path406"
                     d=" M -2.56 3.12257 C -2.0923 1.24901 -1.05006 0.3643 0.0 0.0 C -1.05006 -0.3643 -2.0923 -1.24901 -2.56 -3.12257  "
                     fill="none" />
                </g>
              </g>
            </g>
          </g>
        </g>
        <g
           id="g440"
           stroke-width="0.8">
          <path
             id="path418"
             d=" M -25.25642 -86.28127 L -64.4203 -123.08546  "
             fill="none" />
          <g
             id="g428"
             transform="matrix(0.7287,0.68478,-0.68478,0.7287,-24.96495,-86.00737)">
            <g
               id="g426"
               stroke-dasharray="none"
               stroke-dashoffset="0.0">
              <g
                 id="g424"
                 stroke-linecap="round">
                <g
                   id="g422"
                   stroke-linejoin="round">
                  <path
                     id="path420"
                     d=" M -2.56 3.12257 C -2.0923 1.24901 -1.05006 0.3643 0.0 0.0 C -1.05006 -0.3643 -2.0923 -1.24901 -2.56 -3.12257  "
                     fill="none" />
                </g>
              </g>
            </g>
          </g>
          <g
             id="g438"
             transform="matrix(-0.7287,-0.68478,0.68478,-0.7287,-64.71178,-123.35936)">
            <g
               id="g436"
               stroke-dasharray="none"
               stroke-dashoffset="0.0">
              <g
                 id="g434"
                 stroke-linecap="round">
                <g
                   id="g432"
                   stroke-linejoin="round">
                  <path
                     id="path430"
                     d=" M -2.56 3.12257 C -2.0923 1.24901 -1.05006 0.3643 0.0 0.0 C -1.05006 -0.3643 -2.0923 -1.24901 -2.56 -3.12257  "
                     fill="none" />
                </g>
              </g>
            </g>
          </g>
        </g>
        <g
           id="g464"
           stroke-width="0.8">
          <path
             id="path442"
             d=" M -20.53847 -90.5849 L -64.51122 -146.9516  "
             fill="none" />
          <g
             id="g452"
             transform="matrix(0.61507,0.78844,-0.78844,0.61507,-20.29245,-90.26953)">
            <g
               id="g450"
               stroke-dasharray="none"
               stroke-dashoffset="0.0">
              <g
                 id="g448"
                 stroke-linecap="round">
                <g
                   id="g446"
                   stroke-linejoin="round">
                  <path
                     id="path444"
                     d=" M -2.56 3.12257 C -2.0923 1.24901 -1.05006 0.3643 0.0 0.0 C -1.05006 -0.3643 -2.0923 -1.24901 -2.56 -3.12257  "
                     fill="none" />
                </g>
              </g>
            </g>
          </g>
          <g
             id="g462"
             transform="matrix(-0.61507,-0.78844,0.78844,-0.61507,-64.75723,-147.26697)">
            <g
               id="g460"
               stroke-dasharray="none"
               stroke-dashoffset="0.0">
              <g
                 id="g458"
                 stroke-linecap="round">
                <g
                   id="g456"
                   stroke-linejoin="round">
                  <path
                     id="path454"
                     d=" M -2.56 3.12257 C -2.0923 1.24901 -1.05006 0.3643 0.0 0.0 C -1.05006 -0.3643 -2.0923 -1.24901 -2.56 -3.12257  "
                     fill="none" />
                </g>
              </g>
            </g>
          </g>
        </g>
        <g
           id="g496"
           stroke-width="0.8">
          <path
             id="path466"
             d=" M 41.39613 -37.87527 L 64.30196 -25.30586  "
             fill="none" />
          <g
             id="g476"
             transform="matrix(-0.87665,-0.48103,0.48103,-0.87665,41.04549,-38.06767)">
            <g
               id="g474"
               stroke-dasharray="none"
               stroke-dashoffset="0.0">
              <g
                 id="g472"
                 stroke-linecap="round">
                <g
                   id="g470"
                   stroke-linejoin="round">
                  <path
                     id="path468"
                     d=" M -2.56 3.12257 C -2.0923 1.24901 -1.05006 0.3643 0.0 0.0 C -1.05006 -0.3643 -2.0923 -1.24901 -2.56 -3.12257  "
                     fill="none" />
                </g>
              </g>
            </g>
          </g>
          <g
             id="g486"
             transform="matrix(0.87665,0.48103,-0.48103,0.87665,64.6526,-25.11346)">
            <g
               id="g484"
               stroke-dasharray="none"
               stroke-dashoffset="0.0">
              <g
                 id="g482"
                 stroke-linecap="round">
                <g
                   id="g480"
                   stroke-linejoin="round">
                  <path
                     id="path478"
                     d=" M -2.56 3.12257 C -2.0923 1.24901 -1.05006 0.3643 0.0 0.0 C -1.05006 -0.3643 -2.0923 -1.24901 -2.56 -3.12257  "
                     fill="none" />
                </g>
              </g>
            </g>
          </g>
          <g
             id="g494"
             transform="matrix(0.87665,0.48103,-0.48103,0.87665,42.89807,-32.79399)">
            <g
               id="g492"
               fill="#000">
              <text
                 id="text490"
                 style="stroke:none"
                 transform="scale(1,-1) translate(9.30328,0)"
                 text-anchor="middle"
                 font-size="10"><tspan
                   id="tspan488"
                   font-family="ecrm"
                   font-size="10">LSP</tspan></text>
            </g>
          </g>
        </g>
        <g
           id="g520"
           stroke-width="0.8">
          <path
             id="path498"
             d=" M 46.23381 -53.0149 L 64.20876 -50.90723  "
             fill="none" />
          <g
             id="g508"
             transform="matrix(-0.99315,-0.11644,0.11644,-0.99315,45.83658,-53.06145)">
            <g
               id="g506"
               stroke-dasharray="none"
               stroke-dashoffset="0.0">
              <g
                 id="g504"
                 stroke-linecap="round">
                <g
                   id="g502"
                   stroke-linejoin="round">
                  <path
                     id="path500"
                     d=" M -2.56 3.12257 C -2.0923 1.24901 -1.05006 0.3643 0.0 0.0 C -1.05006 -0.3643 -2.0923 -1.24901 -2.56 -3.12257  "
                     fill="none" />
                </g>
              </g>
            </g>
          </g>
          <g
             id="g518"
             transform="matrix(0.99315,0.11644,-0.11644,0.99315,64.60599,-50.86067)">
            <g
               id="g516"
               stroke-dasharray="none"
               stroke-dashoffset="0.0">
              <g
                 id="g514"
                 stroke-linecap="round">
                <g
                   id="g512"
                   stroke-linejoin="round">
                  <path
                     id="path510"
                     d=" M -2.56 3.12257 C -2.0923 1.24901 -1.05006 0.3643 0.0 0.0 C -1.05006 -0.3643 -2.0923 -1.24901 -2.56 -3.12257  "
                     fill="none" />
                </g>
              </g>
            </g>
          </g>
        </g>
        <g
           id="g544"
           stroke-width="0.8">
          <path
             id="path522"
             d=" M 44.78557 -69.70917 L 64.23665 -75.50667  "
             fill="none" />
          <g
             id="g532"
             transform="matrix(-0.95828,0.2856,-0.2856,-0.95828,44.40227,-69.59492)">
            <g
               id="g530"
               stroke-dasharray="none"
               stroke-dashoffset="0.0">
              <g
                 id="g528"
                 stroke-linecap="round">
                <g
                   id="g526"
                   stroke-linejoin="round">
                  <path
                     id="path524"
                     d=" M -2.56 3.12257 C -2.0923 1.24901 -1.05006 0.3643 0.0 0.0 C -1.05006 -0.3643 -2.0923 -1.24901 -2.56 -3.12257  "
                     fill="none" />
                </g>
              </g>
            </g>
          </g>
          <g
             id="g542"
             transform="matrix(0.95828,-0.2856,0.2856,0.95828,64.61995,-75.62091)">
            <g
               id="g540"
               stroke-dasharray="none"
               stroke-dashoffset="0.0">
              <g
                 id="g538"
                 stroke-linecap="round">
                <g
                   id="g536"
                   stroke-linejoin="round">
                  <path
                     id="path534"
                     d=" M -2.56 3.12257 C -2.0923 1.24901 -1.05006 0.3643 0.0 0.0 C -1.05006 -0.3643 -2.0923 -1.24901 -2.56 -3.12257  "
                     fill="none" />
                </g>
              </g>
            </g>
          </g>
        </g>
        <g
           id="g568"
           stroke-width="0.8">
          <path
             id="path546"
             d=" M 38.79672 -81.96117 L 64.35204 -100.19164  "
             fill="none" />
          <g
             id="g556"
             transform="matrix(-0.81403,0.5807,-0.5807,-0.81403,38.47113,-81.72888)">
            <g
               id="g554"
               stroke-dasharray="none"
               stroke-dashoffset="0.0">
              <g
                 id="g552"
                 stroke-linecap="round">
                <g
                   id="g550"
                   stroke-linejoin="round">
                  <path
                     id="path548"
                     d=" M -2.56 3.12257 C -2.0923 1.24901 -1.05006 0.3643 0.0 0.0 C -1.05006 -0.3643 -2.0923 -1.24901 -2.56 -3.12257  "
                     fill="none" />
                </g>
              </g>
            </g>
          </g>
          <g
             id="g566"
             transform="matrix(0.81404,-0.5807,0.5807,0.81404,64.67764,-100.42392)">
            <g
               id="g564"
               stroke-dasharray="none"
               stroke-dashoffset="0.0">
              <g
                 id="g562"
                 stroke-linecap="round">
                <g
                   id="g560"
                   stroke-linejoin="round">
                  <path
                     id="path558"
                     d=" M -2.56 3.12257 C -2.0923 1.24901 -1.05006 0.3643 0.0 0.0 C -1.05006 -0.3643 -2.0923 -1.24901 -2.56 -3.12257  "
                     fill="none" />
                </g>
              </g>
            </g>
          </g>
        </g>
        <g
           id="g592"
           stroke-width="0.8">
          <path
             id="path570"
             d=" M 32.53041 -88.9244 L 64.47278 -124.9785  "
             fill="none" />
          <g
             id="g580"
             transform="matrix(-0.6631,0.74844,-0.74844,-0.6631,32.26517,-88.62503)">
            <g
               id="g578"
               stroke-dasharray="none"
               stroke-dashoffset="0.0">
              <g
                 id="g576"
                 stroke-linecap="round">
                <g
                   id="g574"
                   stroke-linejoin="round">
                  <path
                     id="path572"
                     d=" M -2.56 3.12257 C -2.0923 1.24901 -1.05006 0.3643 0.0 0.0 C -1.05006 -0.3643 -2.0923 -1.24901 -2.56 -3.12257  "
                     fill="none" />
                </g>
              </g>
            </g>
          </g>
          <g
             id="g590"
             transform="matrix(0.6631,-0.74844,0.74844,0.6631,64.73802,-125.27786)">
            <g
               id="g588"
               stroke-dasharray="none"
               stroke-dashoffset="0.0">
              <g
                 id="g586"
                 stroke-linecap="round">
                <g
                   id="g584"
                   stroke-linejoin="round">
                  <path
                     id="path582"
                     d=" M -2.56 3.12257 C -2.0923 1.24901 -1.05006 0.3643 0.0 0.0 C -1.05006 -0.3643 -2.0923 -1.24901 -2.56 -3.12257  "
                     fill="none" />
                </g>
              </g>
            </g>
          </g>
        </g>
        <g
           id="g616"
           stroke-width="0.8">
          <path
             id="path594"
             d=" M 27.56854 -92.69775 L 64.56839 -149.82684  "
             fill="none" />
          <g
             id="g604"
             transform="matrix(-0.5436,0.83932,-0.83932,-0.5436,27.35112,-92.36203)">
            <g
               id="g602"
               stroke-dasharray="none"
               stroke-dashoffset="0.0">
              <g
                 id="g600"
                 stroke-linecap="round">
                <g
                   id="g598"
                   stroke-linejoin="round">
                  <path
                     id="path596"
                     d=" M -2.56 3.12257 C -2.0923 1.24901 -1.05006 0.3643 0.0 0.0 C -1.05006 -0.3643 -2.0923 -1.24901 -2.56 -3.12257  "
                     fill="none" />
                </g>
              </g>
            </g>
          </g>
          <g
             id="g614"
             transform="matrix(0.5436,-0.83932,0.83932,0.5436,64.78581,-150.16257)">
            <g
               id="g612"
               stroke-dasharray="none"
               stroke-dashoffset="0.0">
              <g
                 id="g610"
                 stroke-linecap="round">
                <g
                   id="g608"
                   stroke-linejoin="round">
                  <path
                     id="path606"
                     d=" M -2.56 3.12257 C -2.0923 1.24901 -1.05006 0.3643 0.0 0.0 C -1.05006 -0.3643 -2.0923 -1.24901 -2.56 -3.12257  "
                     fill="none" />
                </g>
              </g>
            </g>
          </g>
        </g>
        <g
           id="g640"
           stroke-width="0.8">
          <path
             id="path618"
             d=" M 4.99878 -99.36891 L 4.99878 -117.76405  "
             fill="none" />
          <g
             id="g628"
             transform="matrix(0.0,1.0,-1.0,0.0,4.99878,-98.96892)">
            <g
               id="g626"
               stroke-dasharray="none"
               stroke-dashoffset="0.0">
              <g
                 id="g624"
                 stroke-linecap="round">
                <g
                   id="g622"
                   stroke-linejoin="round">
                  <path
                     id="path620"
                     d=" M -2.56 3.12257 C -2.0923 1.24901 -1.05006 0.3643 0.0 0.0 C -1.05006 -0.3643 -2.0923 -1.24901 -2.56 -3.12257  "
                     fill="none" />
                </g>
              </g>
            </g>
          </g>
          <g
             id="g638"
             transform="matrix(0.0,-1.0,1.0,0.0,4.99878,-118.16405)">
            <g
               id="g636"
               stroke-dasharray="none"
               stroke-dashoffset="0.0">
              <g
                 id="g634"
                 stroke-linecap="round">
                <g
                   id="g632"
                   stroke-linejoin="round">
                  <path
                     id="path630"
                     d=" M -2.56 3.12257 C -2.0923 1.24901 -1.05006 0.3643 0.0 0.0 C -1.05006 -0.3643 -2.0923 -1.24901 -2.56 -3.12257  "
                     fill="none" />
                </g>
              </g>
            </g>
          </g>
        </g>
      </g>
    </g>
  </g>
  <circle
     r="0.10384867"
     cy="-93.579605"
     cx="4.0195003"
     style="fill:#800080;stroke:#000000;stroke-width:0.75"
     id="path674" />
  <text
     id="text688"
     y="-81.936913"
     x="67.777107"
     style="font-style:normal;font-weight:normal;font-size:22px;line-height:1.25;font-family:sans-serif;fill:#000000;fill-opacity:1;stroke:none;stroke-width:0.75"
     xml:space="preserve"><tspan
       style="font-size:22px;fill:#800080;stroke-width:0.75"
       y="-81.936913"
       x="67.777107"
       id="tspan686"
       sodipodi:role="line">1</tspan></text>
  <text
     xml:space="preserve"
     style="font-style:normal;font-weight:normal;font-size:22px;line-height:1.25;font-family:sans-serif;fill:#000000;fill-opacity:1;stroke:none;stroke-width:0.75"
     x="-80.359467"
     y="-7.3828187"
     id="text688-0"><tspan
       sodipodi:role="line"
       id="tspan686-4"
       x="-80.359467"
       y="-7.3828187"
       style="font-size:22px;fill:#800080;stroke-width:0.75">3</tspan></text>
  <text
     xml:space="preserve"
     style="font-style:normal;font-weight:normal;font-size:22px;line-height:1.25;font-family:sans-serif;fill:#000000;fill-opacity:1;stroke:none;stroke-width:0.75"
     x="-80.913879"
     y="-133.51199"
     id="text688-05"><tspan
       sodipodi:role="line"
       id="tspan686-70"
       x="-80.913879"
       y="-133.51199"
       style="font-size:22px;fill:#800080;stroke-width:0.75">2</tspan></text>
  <path
     d="m 71.98514,-75.279828 c -3.332063,0.33711 -6.666278,-0.126337 -9.983985,-0.387187 -7.340438,-0.577125 0.600787,0.205567 -8.338643,-0.747487 -2.03493,-0.350401 -4.076985,-0.661696 -6.10479,-1.051208 -3.535777,-0.679163 -8.24598,-1.788473 -11.764717,-2.595848 -4.214798,-0.96708 -8.447003,-1.919114 -12.639855,-2.978077 -2.108873,-0.532619 -4.205625,-1.112122 -6.30843,-1.668184 C 11.26118,-86.202845 5.68124,-87.715385 0.0862325,-89.167221 -8.003425,-91.266386 -5.49217,-90.508 -13.914483,-92.811362 c -2.258377,-0.617627 -4.507312,-1.26926 -6.760965,-1.903891 -7.35009,-2.221228 -14.791327,-4.29759 -21.858367,-7.342877 -3.7761,-1.62718 -5.085255,-2.42168 -8.665583,-4.33678 -4.802962,-2.80616 -9.286785,-6.21549 -13.061242,-10.31716 -0.42438,-0.46117 -0.8172,-0.95041 -1.2258,-1.42562 -1.277378,-1.58645 -1.916573,-3.24401 -1.79736,-5.29632 0.0174,-0.30014 0.08202,-0.59568 0.123037,-0.89351 0.09295,-0.26666 0.160905,-0.54339 0.27885,-0.79998 0.241598,-0.52557 0.535058,-0.93192 0.968948,-1.31412 0.207435,-0.18272 0.914227,-0.61969 0.67329,-0.48419 -3.7188,2.09148 -3.34083,1.88538 -1.80306,1.237 2.185035,-0.72323 4.512255,-0.75887 6.790957,-0.82237 3.032468,-0.0543 6.069593,-0.12481 9.088643,0.23248 1.070362,0.12668 2.132377,0.31602 3.198562,0.47404 2.330453,0.45261 3.957458,0.68836 6.232373,1.47331 2.92278,1.00851 5.690385,2.54368 8.21742,4.31201 0.677985,0.47443 1.31397,1.00621 1.970955,1.50932 0.96969,0.86065 1.996207,1.68889 2.80212,2.7184 1.948492,2.4891 2.89362,6.02254 3.800325,8.99498 0.78819,3.25442 1.821555,6.47035 2.337502,9.786881 0.349545,2.246871 0.305663,3.107333 0.390293,5.447366 0.04057,3.228338 -0.283028,6.445709 -0.712448,9.640783 -0.156195,1.162155 -0.282847,2.330197 -0.50889,3.48081 -0.76671,3.902678 -1.30584,5.271255 -2.497312,9.128783 -1.389323,4.194224 -3.265523,8.191642 -5.104035,12.199035 -1.62255,3.536647 -1.712918,3.987892 -3.71871,7.52277 -0.842003,1.483875 -1.759448,2.923657 -2.639168,4.385489 -3.647227,5.707486 -8.215125,10.725391 -12.269685,16.128668 -0.809437,1.078702 -1.572547,2.191447 -2.369122,3.279675 -0.757853,1.035315 -1.529385,2.06055 -2.29407,3.090825 -1.83702,2.443042 -3.690893,4.88985 -5.766585,7.139107 -1.19859,1.298828 -2.504655,2.467088 -3.86076,3.59484 -1.196723,0.940148 -0.609953,0.4941 -1.757715,1.341548 0,0 3.688582,-1.467488 3.688582,-1.467488 v 0 c 1.106153,-0.847792 0.543233,-0.402495 1.68621,-1.339102 0.995693,-0.87393 1.254923,-1.071765 2.233425,-2.070015 2.577863,-2.62986 4.759545,-5.615333 6.946478,-8.56767 0.754215,-1.027455 1.516035,-2.049368 2.262645,-3.08235 0.776595,-1.074465 1.51782,-2.174475 2.306865,-3.239835 3.99963,-5.400285 8.436795,-10.475895 12.126705,-16.10595 2.150392,-3.495548 3.128385,-4.91049 4.9383,-8.489678 0.590767,-1.168282 1.11105,-2.371042 1.645177,-3.566287 1.779578,-3.982245 3.418275,-8.03064 4.88214,-12.139538 1.017278,-3.218745 1.974255,-5.99283 2.707658,-9.285127 0.500422,-2.246438 0.686347,-4.247301 0.891307,-6.51635 0.100958,-1.117644 0.206685,-2.235266 0.272918,-3.355505 0.06607,-1.117367 0.08257,-2.237113 0.123862,-3.355669 -0.04117,-2.421686 0.03728,-3.232878 -0.330847,-5.551547 -0.126638,-0.797697 -0.32418,-1.582609 -0.501383,-2.370619 -0.559875,-2.48974 -1.18653,-4.96701 -1.911952,-7.41378 -0.741315,-2.44367 -1.492598,-5.27685 -2.668545,-7.5488 -0.940073,-1.81623 -2.39649,-3.17414 -4.00701,-4.39119 -0.68127,-0.49839 -1.34472,-1.02209 -2.04381,-1.49516 -2.590838,-1.75317 -5.39517,-3.2917 -8.345348,-4.35208 -2.571622,-0.92432 -3.607665,-1.01994 -6.23724,-1.52196 -2.241547,-0.37983 -3.6543,-0.66414 -5.879722,-0.88004 -2.04582,-0.19847 -4.10148,-0.0676 -6.151875,-0.094 -2.284395,0.0534 -4.60794,0.0668 -6.826838,0.67548 -2.23215,0.82238 -1.312965,0.42984 -5.051392,2.71771 -0.42297,0.25885 -0.897465,0.8083 -1.154228,1.22571 -0.41094,0.66803 -0.41865,0.90495 -0.624832,1.65395 -0.0282,0.31277 -0.07872,0.62433 -0.0847,0.93832 -0.02017,1.06022 0.152183,2.2593 0.562868,3.24137 0.394882,0.94428 0.868425,1.4066 1.513042,2.21403 4.349858,4.54536 9.237525,8.56997 14.793675,11.5687 3.33768,1.75475 5.245178,2.84358 8.74815,4.32738 7.160145,3.032939 14.725733,4.985172 22.167383,7.170534 12.47451,3.379991 24.882675,7.009588 37.44378,10.064296 12.11208,3.16632 24.275482,6.138637 36.570675,8.516685 1.538295,0.21843 3.072255,0.469942 4.614885,0.65529 1.140968,0.137085 2.28894,0.207825 3.43341,0.311692 3.238612,0.293918 6.479392,0.654218 9.734715,0.677243 0,0 3.22209,-2.408378 3.22209,-2.408378 z"
     id="path758"
     style="fill:#800080;stroke:#800080;stroke-width:0.75" />
</svg>
