[client-request] (id:1) Tue Oct  6 20:55:29 2020:
(:jsonrpc "2.0" :id 1 :method "initialize" :params
	  (:processId nil :rootPath "/tmp/" :rootUri "file:///tmp/" :initializationOptions nil :capabilities
		      (:workspace
		       (:applyEdit t :executeCommand
				   (:dynamicRegistration :json-false)
				   :workspaceEdit
				   (:documentChanges :json-false)
				   :didChangeWatchedFiles
				   (:dynamicRegistration t)
				   :symbol
				   (:dynamicRegistration :json-false)
				   :configuration t)
		       :textDocument
		       (:synchronization
			(:dynamicRegistration :json-false :willSave t :willSaveWaitUntil t :didSave t)
			:completion
			(:dynamicRegistration :json-false :completionItem
					      (:snippetSupport :json-false)
					      :contextSupport t)
			:hover
			(:dynamicRegistration :json-false :contentFormat
					      ["plaintext"])
			:signatureHelp
			(:dynamicRegistration :json-false :signatureInformation
					      (:parameterInformation
					       (:labelOffsetSupport t)))
			:references
			(:dynamicRegistration :json-false)
			:definition
			(:dynamicRegistration :json-false)
			:declaration
			(:dynamicRegistration :json-false)
			:implementation
			(:dynamicRegistration :json-false)
			:typeDefinition
			(:dynamicRegistration :json-false)
			:documentSymbol
			(:dynamicRegistration :json-false :hierarchicalDocumentSymbolSupport t :symbolKind
					      (:valueSet
					       [1 2 3 4 5 6 7 8 9 10 11 12 13 14 15 16 17 18 19 20 21 22 23 24 25 26]))
			:documentHighlight
			(:dynamicRegistration :json-false)
			:codeAction
			(:dynamicRegistration :json-false :codeActionLiteralSupport
					      (:codeActionKind
					       (:valueSet
						["quickfix" "refactor" "refactor.extract" "refactor.inline" "refactor.rewrite" "source" "source.organizeImports"])))
			:formatting
			(:dynamicRegistration :json-false)
			:rangeFormatting
			(:dynamicRegistration :json-false)
			:rename
			(:dynamicRegistration :json-false)
			:publishDiagnostics
			(:relatedInformation :json-false))
		       :experimental nil)))
[server-reply] (id:1) Tue Oct  6 20:55:29 2020:
(:id 1 :jsonrpc "2.0" :result
     (:capabilities
      (:textDocumentSync 2 :hoverProvider :json-false :definitionProvider :json-false :referencesProvider :json-false :documentHighlightProvider :json-false :documentSymbolProvider :json-false :workspaceSymbolProvider :json-false :codeActionProvider t :documentFormattingProvider :json-false :documentRangeFormattingProvider :json-false :renameProvider :json-false :executeCommandProvider
			 (:commands
			  [])
			 :workspace
			 (:workspaceFolders
			  (:supported t :changeNotifications t)))))
[client-notification] Tue Oct  6 20:55:29 2020:
(:jsonrpc "2.0" :method "initialized" :params #s(hash-table size 65 test eql rehash-size 1.5 rehash-threshold 0.8125 data
							    ()))
[client-notification] Tue Oct  6 20:55:29 2020:
(:jsonrpc "2.0" :method "textDocument/didOpen" :params
	  (:textDocument
	   (:uri "file:///tmp/2075-asdf.py" :version 0 :languageId "python" :text "")))
[client-notification] Tue Oct  6 20:55:29 2020:
(:jsonrpc "2.0" :method "workspace/didChangeConfiguration" :params
	  (:settings nil))
[client-notification] Tue Oct  6 20:55:39 2020:
(:jsonrpc "2.0" :method "textDocument/didChange" :params
	  (:textDocument
	   (:uri "file:///tmp/2075-asdf.py" :version 3)
	   :contentChanges
	   [(:range
	     (:start
	      (:line 0 :character 0)
	      :end
	      (:line 0 :character 0))
	     :rangeLength 0 :text "from typing import List\n\ndef replace_ones(l: List[int], v: int) -> List[int]:\n    \"\"\"\n    replace all elements that are 1 with v\n    note: this code is correct\n    \"\"\"\n    return [v if i == 1 else i for i in l]\n\n\ndef delete_ones(l: List[int]) -> List[int]:\n    \"\"\"\n    delete all elements that are 1\n    note: this code is buggy\n    \"\"\"\n    for i in range(len(l)):\n        if l[i] == 1:\n            del l[i]\n    return l")
	    (:range
	     (:start
	      (:line 0 :character 0)
	      :end
	      (:line 18 :character 12))
	     :rangeLength 420 :text "from typing import List\n\ndef replace_ones(l: List[int], v: int) -> List[int]:\n    \"\"\"\n    replace all elements that are 1 with v\n    note: this code is correct\n    \"\"\"\n    return [v if i == 1 else i for i in l]\n\n\ndef delete_ones(l: List[int]) -> List[int]:\n    \"\"\"\n    delete all elements that are 1\n    note: this code is buggy\n    \"\"\"\n    for i in range(len(l)):\n        if l[i] == 1:\n            del l[i]\n    return l")
	    (:range
	     (:start
	      (:line 18 :character 11)
	      :end
	      (:line 18 :character 12))
	     :rangeLength 1 :text "l")]))
[client-request] (id:2) Tue Oct  6 20:56:15 2020:
(:jsonrpc "2.0" :id 2 :method "textDocument/codeAction" :params
	  (:textDocument
	   (:uri "file:///tmp/2075-asdf.py")
	   :range
	   (:start
	    (:line 1 :character 0)
	    :end
	    (:line 12 :character 1))
	   :context
	   (:diagnostics
	    [])))
[server-reply] (id:2) Tue Oct  6 20:56:16 2020:
(:id 2 :jsonrpc "2.0" :result
     [(:title "Hypothesis Test (all)" :kind nil :edit
	      (:changes nil :documentChanges
			[(:textDocument
			  (:uri "file:///tmp/2075-asdf.py" :version 3)
			  :edits
			  [(:range
			    (:start
			     (:line 19 :character 0)
			     :end
			     (:line 19 :character 0))
			    :newText "\n\n@given(l=st.lists(st.integers()))\n@example(l=[1, 0])\ndef test_delete_ones(l):\n    delete_ones(l)\n")
			   (:range
			    (:start
			     (:line 8 :character 0)
			     :end
			     (:line 8 :character 0))
			    :newText "\n\n@given(l=st.lists(st.integers()), v=st.integers())\ndef test_replace_ones(l, v):\n    replace_ones(l, v)\n")
			   (:range
			    (:start
			     (:line 0 :character 0)
			     :end
			     (:line 0 :character 0))
			    :newText "from hypothesis import given, example\n")
			   (:range
			    (:start
			     (:line 0 :character 0)
			     :end
			     (:line 0 :character 0))
			    :newText "from hypothesis.extra.dpcontracts import fulfill\n")
			   (:range
			    (:start
			     (:line 0 :character 0)
			     :end
			     (:line 0 :character 0))
			    :newText "import hypothesis.strategies as st\n")
			   (:range
			    (:start
			     (:line 0 :character 0)
			     :end
			     (:line 0 :character 0))
			    :newText "\n")])]))
      (:title "Hypothesis Test @replace_ones" :kind nil :edit
	      (:changes nil :documentChanges
			[(:textDocument
			  (:uri "file:///tmp/2075-asdf.py" :version 3)
			  :edits
			  [(:range
			    (:start
			     (:line 8 :character 0)
			     :end
			     (:line 8 :character 0))
			    :newText "\n\n@given(l=st.lists(st.integers()), v=st.integers())\ndef test_replace_ones(l, v):\n    replace_ones(l, v)\n")
			   (:range
			    (:start
			     (:line 0 :character 0)
			     :end
			     (:line 0 :character 0))
			    :newText "from hypothesis import given, example\n")
			   (:range
			    (:start
			     (:line 0 :character 0)
			     :end
			     (:line 0 :character 0))
			    :newText "from hypothesis.extra.dpcontracts import fulfill\n")
			   (:range
			    (:start
			     (:line 0 :character 0)
			     :end
			     (:line 0 :character 0))
			    :newText "import hypothesis.strategies as st\n")
			   (:range
			    (:start
			     (:line 0 :character 0)
			     :end
			     (:line 0 :character 0))
			    :newText "\n")])]))
      (:title "Hypothesis Test @delete_ones" :kind nil :edit
	      (:changes nil :documentChanges
			[(:textDocument
			  (:uri "file:///tmp/2075-asdf.py" :version 3)
			  :edits
			  [(:range
			    (:start
			     (:line 19 :character 0)
			     :end
			     (:line 19 :character 0))
			    :newText "\n\n@given(l=st.lists(st.integers()))\n@example(l=[1, 0])\ndef test_delete_ones(l):\n    delete_ones(l)\n")
			   (:range
			    (:start
			     (:line 0 :character 0)
			     :end
			     (:line 0 :character 0))
			    :newText "from hypothesis import given, example\n")
			   (:range
			    (:start
			     (:line 0 :character 0)
			     :end
			     (:line 0 :character 0))
			    :newText "from hypothesis.extra.dpcontracts import fulfill\n")
			   (:range
			    (:start
			     (:line 0 :character 0)
			     :end
			     (:line 0 :character 0))
			    :newText "import hypothesis.strategies as st\n")
			   (:range
			    (:start
			     (:line 0 :character 0)
			     :end
			     (:line 0 :character 0))
			    :newText "\n")])]))])
[client-notification] Tue Oct  6 20:56:26 2020:
(:jsonrpc "2.0" :method "textDocument/didChange" :params
	  (:textDocument
	   (:uri "file:///tmp/2075-asdf.py" :version 9)
	   :contentChanges
	   [(:range
	     (:start
	      (:line 0 :character 0)
	      :end
	      (:line 0 :character 0))
	     :rangeLength 0 :text "\n")
	    (:range
	     (:start
	      (:line 0 :character 0)
	      :end
	      (:line 0 :character 0))
	     :rangeLength 0 :text "import hypothesis.strategies as st\n")
	    (:range
	     (:start
	      (:line 0 :character 0)
	      :end
	      (:line 0 :character 0))
	     :rangeLength 0 :text "from hypothesis.extra.dpcontracts import fulfill\n")
	    (:range
	     (:start
	      (:line 0 :character 0)
	      :end
	      (:line 0 :character 0))
	     :rangeLength 0 :text "from hypothesis import given, example\n")
	    (:range
	     (:start
	      (:line 12 :character 0)
	      :end
	      (:line 12 :character 0))
	     :rangeLength 0 :text "\n\n@given(l=st.lists(st.integers()), v=st.integers())\ndef test_replace_ones(l, v):\n    replace_ones(l, v)\n")
	    (:range
	     (:start
	      (:line 27 :character 12)
	      :end
	      (:line 27 :character 12))
	     :rangeLength 0 :text "\n\n@given(l=st.lists(st.integers()))\n@example(l=[1, 0])\ndef test_delete_ones(l):\n    delete_ones(l)\n")]))
[client-notification] Tue Oct  6 20:56:31 2020:
(:jsonrpc "2.0" :method "textDocument/didChange" :params
	  (:textDocument
	   (:uri "file:///tmp/2075-asdf.py" :version 10)
	   :contentChanges
	   [(:range
	     (:start
	      (:line 24 :character 0)
	      :end
	      (:line 28 :character 0))
	     :rangeLength 84 :text "")]))
[client-notification] Tue Oct  6 20:56:32 2020:
(:jsonrpc "2.0" :method "textDocument/didChange" :params
	  (:textDocument
	   (:uri "file:///tmp/2075-asdf.py" :version 11)
	   :contentChanges
	   [(:range
	     (:start
	      (:line 24 :character 0)
	      :end
	      (:line 24 :character 0))
	     :rangeLength 0 :text "    ")]))
[client-notification] Tue Oct  6 20:56:38 2020:
(:jsonrpc "2.0" :method "textDocument/didChange" :params
	  (:textDocument
	   (:uri "file:///tmp/2075-asdf.py" :version 14)
	   :contentChanges
	   [(:range
	     (:start
	      (:line 24 :character 4)
	      :end
	      (:line 24 :character 4))
	     :rangeLength 0 :text "return [i for i in l if i != 1]")
	    (:range
	     (:start
	      (:line 24 :character 4)
	      :end
	      (:line 24 :character 35))
	     :rangeLength 31 :text "return [i for i in l if i != 1]")
	    (:range
	     (:start
	      (:line 24 :character 34)
	      :end
	      (:line 24 :character 35))
	     :rangeLength 1 :text "]")]))
[client-notification] Tue Oct  6 20:56:40 2020:
(:jsonrpc "2.0" :method "textDocument/didChange" :params
	  (:textDocument
	   (:uri "file:///tmp/2075-asdf.py" :version 16)
	   :contentChanges
	   [(:range
	     (:start
	      (:line 24 :character 35)
	      :end
	      (:line 24 :character 35))
	     :rangeLength 0 :text "\n")
	    (:range
	     (:start
	      (:line 25 :character 0)
	      :end
	      (:line 25 :character 0))
	     :rangeLength 0 :text "\n")]))
[client-request] (id:3) Tue Oct  6 20:56:59 2020:
(:jsonrpc "2.0" :id 3 :method "textDocument/codeAction" :params
	  (:textDocument
	   (:uri "file:///tmp/2075-asdf.py")
	   :range
	   (:start
	    (:line 24 :character 4)
	    :end
	    (:line 24 :character 6))
	   :context
	   (:diagnostics
	    [])))
[server-reply] (id:3) Tue Oct  6 20:56:59 2020:
(:id 3 :jsonrpc "2.0" :result
     [(:title "Remove corrected examples @test_delete_ones" :edit
	      (:documentChanges
			[(:textDocument
			  (:uri "file:///tmp/2075-asdf.py" :version 16)
			  :edits
			  [(:range
			    (:start
			     (:line 28 :character 0)
			     :end
			     (:line 29 :character 0))
			    :newText "")])]))])
[client-notification] Tue Oct  6 20:57:05 2020:
(:jsonrpc "2.0" :method "textDocument/didChange" :params
	  (:textDocument
	   (:uri "file:///tmp/2075-asdf.py" :version 17)
	   :contentChanges
	   [(:range
	     (:start
	      (:line 28 :character 0)
	      :end
	      (:line 29 :character 0))
	     :rangeLength 19 :text "")]))
