0 22478
1 15385
2 9801
3 5773
4 3627
5 2423
6 1681
7 1242
8 888
9 664
10 496
11 366
12 320
13 246
14 204
15 162
16 113
17 113
18 78
19 60
20 62
21 52
22 39
23 20
24 29
25 25
26 19
27 15
28 15
29 9
30 12
31 10
32 9
33 8
34 2
35 3
36 6
37 2
38 2
39 2
40 3
41 3
42 4
43 3
44 0
45 1
46 2
47 4
48 0
49 3
50 2
51 1
52 1
53 0
54 1
55 0
56 1
57 0
58 1
59 0
60 2
61 1
62 1
63 0
64 0
65 0
66 0
67 0
68 0
69 0
70 0
71 1
