{
    "cmd.help.aliases": "\uac00\uba85",
    "cmd.help.availableParameters": "\uc0ac\uc6a9\uac00\ub2a5\ud55c \ub9e4\uac1c\ubcc0\uc218",
    "cmd.help.availableVariables": "\uc0ac\uc6a9\uac00\ub2a5\ud55c \ubcc0\uc218",
    "cmd.help.commandHelp": "\uba85\ub839\uc5b4\uc5d0 \ub300\ud55c \uc790\uc138\ud55c \ub0b4\uc6a9\uc744 \ud655\uc778\ud558\ub824\uba74 `{0}help <Command Name>`\uc744 \uc774\uc6a9\ud558\uc2ed\uc2dc\uc624 (\uc608\uc2dc `{0}help joinmessage`).",
    "cmd.help.commandNotFound": "\uc774\ub7f0! \uadf8 \uba85\ub839\uc5b4\ub294 \uc874\uc7ac\ud558\uc9c0 \uc54a\uc2b5\ub2c8\ub2e4.",
    "cmd.help.commands": "\uba85\ub839\uc5b4",
    "cmd.help.description": "\uc124\uba85",
    "cmd.help.links": "\ub2e4\ub978 \uc720\uc6a9\ud55c \uc790\ub8cc",
    "cmd.help.links.donate": "\ud6c4\uc6d0",
    "cmd.help.links.permissions": "\ud384\ubbf8\uc158 \uc548\ub0b4",
    "cmd.help.links.supportServer": "\uc9c0\uc6d0 \uc11c\ubc84",
    "cmd.help.links.website": "\uc815\ubcf4 \uc6f9\uc0ac\uc774\ud2b8",
    "cmd.help.prefix.alternative": "\uadf8 \ub300\uc2e0\uc5d0 **{0}yoshi** \ub97c \uc811\ub450\uc0ac\ub85c \uc0ac\uc6a9\ud560 \uc218 \uc788\uc2b5\ub2c8\ub2e4\n(\uc608\uc2dc: {0}help \ub300\uc2e0\uc5d0 **{0}yoshihelp** )",
    "cmd.help.prefix.change": "\uba85\ub839\uc5b4\uc758 \uc811\ub450\uc0ac\ub294 `{0}prefix` \uba85\ub839\uc5b4\ub97c \uc0ac\uc6a9\ud558\uba74 \ubcc0\uacbd\ud560 \uc218 \uc788\uc2b5\ub2c8\ub2e4.",
    "cmd.help.prefix.example": "\uc608\uc2dc : **{0}avatar**",
    "cmd.help.prefix.info": "\ubaa8\ub4e0 \uba85\ub839\uc5b4\ub4e4\uc740 **{0}**\uc758 \uc811\ub450\uc0ac\ub97c \uc0ac\uc6a9\ud569\ub2c8\ub2e4.",
    "cmd.language.languageChanged": "\uc5b8\uc5b4\uac00 {0}(\uc73c)\ub85c \ubcc0\uacbd\ub418\uc5c8\uc2b5\ub2c8\ub2e4!",
    "commandDescription.addcommand": "\ud604\uc7ac \ucc44\ub110 \ub610\ub294 \uc11c\ubc84\uc5d0 \uc2e4\ud589 \uac00\ub2a5\ud55c \ud14d\uc2a4\ud2b8 \uba85\ub839\uc5b4\ub97c \ucd94\uac00\ud569\ub2c8\ub2e4.",
    "commandDescription.anime": "Kitsu.io \uc5d0\uc11c \uc5d0\ub2c8\ubbf8\ub97c \uac80\uc0c9\ud558\uc138\uc694."
}