{
    "8ball.neutral.1": "Resposta nebuloso tenta de novo.",
    "8ball.neutral.2": "Me pergunte depois.",
    "8ball.neutral.3": "Melhor n\u00e3o te contar agora.",
    "8ball.neutral.4": "N\u00e3o posso prever agora.",
    "8ball.neutral.5": "Concentre-se e pergunte de novo.",
    "8ball.no.1": "N\u00e3o conte nisso.",
    "8ball.no.2": "Minha resposta \u00e9 n\u00e3o.",
    "8ball.no.3": "Minhas fontes dizem que n\u00e3o.",
    "8ball.no.4": "Perspectiva n\u00e3o t\u00e3o boa.",
    "8ball.no.5": "Bem improv\u00e1vel.",
    "8ball.no.6": "As chances n\u00e3o s\u00e3o das melhores.",
    "8ball.yes.1": "Com certeza.",
    "8ball.yes.10": "Sim.",
    "8ball.yes.11": "Sinais dizem que sim.",
    "8ball.yes.12": "Absolutamente.",
    "8ball.yes.2": "Decididamente.",
    "8ball.yes.3": "Sem d\u00favida alguma.",
    "8ball.yes.4": "Sim, definitivamente.",
    "8ball.yes.5": "Pode confiar.",
    "8ball.yes.6": "Pode contar que sim.",
    "8ball.yes.7": "No meu ver, sim.",
    "8ball.yes.8": "Provavelmente.",
    "8ball.yes.9": "Parece bom.",
    "adminLog.guildJoin": "Entrou na guilda \"{0}\" (ID {1}, Dono: {2})",
    "adminLog.guildQuit": "Saiu da guilda \"{0}\" (ID {1}, Dono: {2})",
    "chests.plural": "Ba\u00fas",
    "chests.singular": "Ba\u00fa",
    "cmd.50x2.invalidMode": "Esse modo n\u00e3o \u00e9 v\u00e1lido! Modos v\u00e1lidos s\u00e3o **server** e **global**. **server** usa o dinheiro do server especifico, enquanto **global** usa seu dinheiro global.",
    "cmd.50x2.lose": "Voc\u00ea **PERDEU**! Voc\u00ea rolou um **{0}**, apostando **${1}** e agora possui **${2}**!",
    "cmd.50x2.notEnoughCash": "Voc\u00ea n\u00e3o possui dinheiro suficiente!",
    "cmd.50x2.usage.amount": "Quantidade",
    "cmd.50x2.win": "Voc\u00ea **GANHOU**! Voc\u00ea rolou um **{0}**, apostando **${1}** e agora possui **${2}**!",
    "cmd.8ball.questionTooLong": "Desculpa, mas a pergunta deve ser de no m\u00e1ximo 250 caracteres.",
    "cmd.8ball.usage.question": "Pergunta",
    "cmd.addcommand.discord.added": "Comando `{0}` adicionado com sucesso com o texto `{1}` .",
    "cmd.addcommand.discord.alreadyExists": "J\u00e1 existe um comando chamado `{0}`.",
    "cmd.addcommand.usage.commandName": "Nome do Comando",
    "cmd.addcommand.usage.commandText": "Texto do Comando",
    "cmd.anime.endDate": "Data de termino",
    "cmd.anime.episodes": "Epis\u00f3dios",
    "cmd.anime.fetchFailed": "Falha ao buscar dados!",
    "cmd.anime.fetching": "Buscando dados...",
    "cmd.anime.notFound": "Desculpa, mas eu n\u00e3o achei nenhum anime com esse nome.",
    "cmd.anime.resultsFound": "Encontrei **{0}** resultados para **{1}**. Por favor selecione:",
    "cmd.anime.score": "Pontua\u00e7\u00e3o",
    "cmd.anime.startDate": "Data de inicio",
    "cmd.anime.status": "Status",
    "cmd.anime.synopsis": "Sinopse",
    "cmd.anime.type": "Tipo",
    "cmd.anime.usage.animeName": "Nome do Anime",
    "cmd.anime.viewOnKitsu": "Ver em Kitsu.io",
    "cmd.anime.viewOnMAL": "Olhar no MyAnimeList",
    "cmd.assignablerole.add.added": "`{0}` \u00e9 agora uma fun\u00e7\u00e3o auto-atribu\u00edvel. Membros podem ter esta fun\u00e7\u00e3o com o comando `{1}role {0}`.",
    "cmd.assignablerole.add.alreadyDefined": "Esta fun\u00e7\u00e3o j\u00e1 \u00e9 uma fun\u00e7\u00e3o auto-atribu\u00edvel.",
    "cmd.assignablerole.add.cannotInteract": "Voc\u00ea n\u00e3o tem permiss\u00e3o para fazer essa fun\u00e7\u00e3o ser auto-atribu\u00edvel.",
    "cmd.assignablerole.add.info": "Adicionar fun\u00e7\u00e3o para fun\u00e7\u00f5es auto-atribu\u00edveis",
    "cmd.assignablerole.headline": "Fun\u00e7\u00f5es auto-atribu\u00edveis",
    "cmd.assignablerole.list.headline": "Fun\u00e7\u00f5es auto-atribu\u00edveis (mostrando max. {0} fun\u00e7\u00f5es, no momento {1} fun\u00e7\u00f5es atribu\u00edveis)",
    "cmd.assignablerole.list.info": "Liste todas as fun\u00e7\u00f5es auto-atribu\u00edveis",
    "cmd.assignablerole.list.noRolesFound": "Nenhuma fun\u00e7\u00e3o atribu\u00edvel foi definida no momento.",
    "cmd.assignablerole.remove.info": "Remover fun\u00e7\u00e3o de fun\u00e7\u00f5es auto-atribu\u00edveis",
    "cmd.assignablerole.remove.notDefinedAsRole": "Esta fun\u00e7\u00e3o n\u00e3o \u00e9 uma fun\u00e7\u00e3o auto-atribu\u00edvel.",
    "cmd.assignablerole.remove.removed": "`{0}` n\u00e3o \u00e9 mais uma fun\u00e7\u00e3o auto-atribu\u00edvel.",
    "cmd.autorole.cannotInteract": "Voc\u00ea n\u00e3o esta permitido de fazer est\u00e1 fun\u00e7\u00e3o uma fun\u00e7\u00e3o auto-atribu\u00edvel.",
    "cmd.autorole.cleared": "A fun\u00e7\u00e3o auto-atribu\u00edvel foi removida.",
    "cmd.autorole.defined": "A fun\u00e7\u00e3o auto-atribu\u00edvel foi definido para `{0}`!",
    "cmd.autorole.defined.showOld": "A fun\u00e7\u00e3o auto-atribu\u00edvel foi atualizada de `{0}` para `{1}`!",
    "cmd.autorole.noRoleDefined": "Atualmente n\u00e3o h\u00e1 fun\u00e7\u00f5es auto-atribu\u00edveis definidas.",
    "cmd.autorole.parameter.give.info": "(true\/false) Dar esta fun\u00e7\u00e3o para todos os membros do servidor, exceto bots?",
    "cmd.autorole.parameter.give.invalidValue": "O parametro `give` deve ser boleano!",
    "cmd.autorole.usage.role": "Fun\u00e7\u00e3o",
    "cmd.avatar.showFull": "Clique aqui para um link direto!",
    "cmd.awoo.single": "{0} mandou um auuuu!",
    "cmd.awoo.tagged": "{0} uivou para {1}!",
    "cmd.bad.single": "{0} quer ser punido!",
    "cmd.bad.tagged": "Cuidado, {1}! {0} quer te punir!",
    "cmd.baka.single": "{0} \u00e9 um baka!",
    "cmd.baka.tagged": "{0} acha que {1} \u00e9 um(a) baka!",
    "cmd.ban.cannotBanOwner": "Desculpa, n\u00e3o posso banir esse usu\u00e1rio pois ele \u00e9 o dono do servidor.",
    "cmd.ban.cannotBanSelf": "Voc\u00ea n\u00e3o pode se banir.",
    "cmd.ban.cannotBanThatUser": "Voc\u00ea n\u00e3o pode banir este usu\u00e1rio!",
    "cmd.ban.cannotBanYoshino": "Por que voc\u00ea me baniria?",
    "cmd.ban.delDays.invalidInteger": "Por favor, coloque um n\u00famero v\u00e1lido para o par\u00e2metro `delDays`.",
    "cmd.ban.delDaysTooLow": "`delDays` deve ser pelo menos `1`.",
    "cmd.ban.error": "Um erro ocorreu. Por favor veja se eu tenho as corretas permiss\u00f5es.",
    "cmd.ban.noMember": "Esse usu\u00e1rio n\u00e3o est\u00e1 nesse servidor.",
    "cmd.ban.parameter.delDays.info": "Deleta a mensagem do usu\u00e1rio dos \u00faltimos x dias",
    "cmd.ban.parameter.reason.info": "Raz\u00e3o do banimento",
    "cmd.ban.privateMsg": "Voc\u00ea foi banido do servidor **{0}**.",
    "cmd.ban.privateMsg.reason": "Voc\u00ea foi banido do servidor **{0}**.\nMotivo: **{1}**",
    "cmd.ban.success": "Um nova regra de banimento foi adicionada com sucesso.",
    "cmd.ban.usage.delDays": "Dias",
    "cmd.ban.usage.reason": "Raz\u00e3o\/Motivo",
    "cmd.bigtext.usage.text": "Texto",
    "cmd.blush.single": "Que fofo, {0} t\u00e1 com vergonha!",
    "cmd.blush.tagged": "Wow, {1}! Voc\u00ea deixou {0} com vergonha!",
    "cmd.buychest.done.plural": "Voc\u00ea comprou **{0}** ba\u00fas com sucesso no custo de {1}. Agora voc\u00ea possui **{2}** restantes.",
    "cmd.buychest.done.singular": "Voc\u00ea comprou **{0}** ba\u00fas com sucesso no custo de {1}. Agora voc\u00ea possui **{2}** restantes.",
    "cmd.buychest.invalidAmount": "Por favor coloque um n\u00famero entre {0} e {1}!",
    "cmd.buychest.notEnoughMoney": "Voc\u00ea n\u00e3o possui dinheiro suficiente para comprar todos esses ba\u00fas. Custaria **${0}**, mas voc\u00ea possui apenas **${1}**!",
    "cmd.buychest.usage.amount": "Quantidade",
    "cmd.chucknorris.fetchFailed": "Falha ao buscar uma piada aleat\u00f3ria do Chuck Norris!",
    "cmd.chucknorris.fetching": "Buscando uma piada aleat\u00f3ria do Chuck Norris...",
    "cmd.coinflip.flipped": "A moeda caiu em **{0}**!",
    "cmd.coinflip.flipping": "Mas \u00e9 claro! Jogando uma moeda para voc\u00ea...",
    "cmd.coinflip.heads": "Cara",
    "cmd.coinflip.tails": "Coroa",
    "cmd.confused.single": "{0} t\u00e1 confuso...",
    "cmd.confused.tagged": "Oh n\u00e3o, {1}! Voc\u00ea \u00e9 confuso {0}!",
    "cmd.convert.globalTooFull": "O seu balan\u00e7o global est\u00e1 cheio!",
    "cmd.convert.invalidCombination": "Desculpe, mas voc\u00ea especificou uma combina\u00e7\u00e3o inv\u00e1lida. Certifique-se de usar dois valores diferentes.",
    "cmd.convert.invalidFrom": "Valor invalido **from**! Este \u00e9 o modo pelo qual o dinheiro ser\u00e1 retirado. Valores validos s\u00e3o **server** e **global**.",
    "cmd.convert.invalidTo": "Valor invalido **to**! Este \u00e9 o modo pelo qual o dinheiro ser\u00e1 transferido. Valores validos s\u00e3o **server** e **global**.",
    "cmd.convert.notEnoughGlobalMoney": "Voc\u00ea n\u00e3o possui dinheiro global suficiente!",
    "cmd.convert.notEnoughServerMoney": "Voc\u00ea n\u00e3o tem dinheiro espec\u00edfico para o servidor!",
    "cmd.convert.serverTooFull": "O seu balan\u00e7o para o servidor espec\u00edfico est\u00e1 cheio!",
    "cmd.convert.transferred.globalToServer": "Voc\u00ea transferiu **${0}** com sucesso do seu balan\u00e7o global para o seu balan\u00e7o para servidor espec\u00edfico. Voc\u00ea agora possu\u00ed **${1}** no seu balan\u00e7o para servidor espec\u00edfico e ${2} no seu balan\u00e7o global.",
    "cmd.convert.transferred.serverToGlobal": "Voc\u00ea transferiu **${0}** com sucesso do seu balan\u00e7o para servidor espec\u00edfico para o seu balan\u00e7o global. Voc\u00ea agora possu\u00ed ${1} no seu balan\u00e7o para servidor espec\u00edfico e **${2}** no seu balan\u00e7o global.",
    "cmd.convert.usage.amount": "Quantidade",
    "cmd.convert.usage.from": "De",
    "cmd.convert.usage.to": "Para",
    "cmd.cuddle.single": "{0} quer um abra\u00e7o!",
    "cmd.cuddle.tagged": "{0} t\u00e1 abra\u00e7ando {1}!",
    "cmd.daily.claimed": "Voc\u00ea reivindicou sua recompensa di\u00e1ria de **{0}$**! Voc\u00ea tem agora **{1}$**!",
    "cmd.daily.inCooldown": "Voc\u00ea s\u00f3 pode reivindicar sua recompensa di\u00e1ria a cada 24 horas!",
    "cmd.daily.voteInfo": "Voc\u00ea sabia que pode ganhar um b\u00f4nus extra a cada 12 horas votando para Yoshino?",
    "cmd.dance.single": "{0} t\u00e1 dan\u00e7ando! Olha essa ginga!",
    "cmd.dance.tagged": "{0} e {1} est\u00e3o dan\u00e7ando!",
    "cmd.deletecommand.discord.deleted": "Comando `{0}` deletado com sucesso com o texto `{1}` .",
    "cmd.deletecommand.discord.notFound": "N\u00e3o existe comando chamado `{0}` .",
    "cmd.deletecommand.usage.commandName": "Nome do Comando",
    "cmd.deposit.amountTooLow": "Voc\u00ea n\u00e3o pode depositar menos de $100.",
    "cmd.deposit.cashEmpty": "Voc\u00ea n\u00e3o possui dinheiro com voc\u00ea no momento.",
    "cmd.deposit.complete": "Voc\u00ea depositou **${0}** com sucesso na sua conta banc\u00e1ria. Voc\u00ea possui agora **${1}** restante na sua conta banc\u00e1ria.",
    "cmd.deposit.limitReached": "Voc\u00ea n\u00e3o pode ter mais de **$10 Milh\u00f5es** na sua conta banc\u00e1ria.",
    "cmd.deposit.usage.amount": "Quantidade",
    "cmd.door.closed": "A porta do Cody esta **FECHADA** no momento.",
    "cmd.door.open": "A porta do Cody esta **ABERTA** no momento.",
    "cmd.emojify.usage.text": "Texto",
    "cmd.emotelist.headline": "Emotes ({0} emotes encontrados)",
    "cmd.emotelist.noEmotesFound": "Ainda n\u00e3o h\u00e1 emotes registrados neste servidor.",
    "cmd.fakemessage.cantFakeSelf": "Voc\u00ea n\u00e3o pode falsificar suas pr\u00f3prias mensagens.",
    "cmd.fakemessage.noMember": "Este usu\u00e1rio n\u00e3o \u00e9 um membro deste servidor.",
    "cmd.fakemessage.usage.text": "Texto",
    "cmd.followage.following": "{0} come\u00e7ou a seguir {1}.",
    "cmd.followage.notfollowing": "{0} n\u00e3o est\u00e1 seguindo!",
    "cmd.followmessage.lookup": "\"{0}\" [use {1} limpe para remover]",
    "cmd.followmessage.none": "N\u00e3o h\u00e1 mensagem para seguidores selecionada para este canal.",
    "cmd.followmessage.removed": "A mensagem a seguir foi removida.",
    "cmd.followmessage.set": "A mensagem a seguir foi alterada para \"{0}\".",
    "cmd.fortnite.fetching": "Buscando dados...",
    "cmd.fortnite.headline": "Estat\u00edsticas de tempo vivo",
    "cmd.fortnite.invalidPlatform": "Plataforma inv\u00e1lida!",
    "cmd.fortnite.kd": "M\u00e9dia de K\/D",
    "cmd.fortnite.kills": "Mortos",
    "cmd.fortnite.killsPerMin": "Kills por Minuto",
    "cmd.fortnite.matchesPlayed": "Partidas jogadas",
    "cmd.fortnite.playtime": "Tempo jogado",
    "cmd.fortnite.rateLimited": "Taxa limitada! Por favor espere um pouco antes de usar este comando novamente.",
    "cmd.fortnite.score": "Pontua\u00e7\u00e3o",
    "cmd.fortnite.survivalTime": "Tem de Sobreviv\u00eancia \u00f8",
    "cmd.fortnite.text": "Estat\u00edsticas no Fortnite para **{0}** em **{1}**",
    "cmd.fortnite.top12s": "Top 12",
    "cmd.fortnite.top25s": "Top 25",
    "cmd.fortnite.top3s": "Top 3",
    "cmd.fortnite.top5s": "Top 5",
    "cmd.fortnite.top6s": "Top 6",
    "cmd.fortnite.usage.platform": "Plataforma",
    "cmd.fortnite.usage.username": "Nome de usu\u00e1rio Epic Games",
    "cmd.fortnite.winPercentage": "Vit\u00f3ria %",
    "cmd.fortnite.wins": "Vit\u00f3rias",
    "cmd.giveexp.amountUnspecified": "O par\u00e2metro `amount` deve ser definido.",
    "cmd.giveexp.belowMinimum": "`amount` deve ser no minimo igual a 1.",
    "cmd.giveexp.invalidInteger": "`amount` deve ser um n\u00famero inteiro v\u00e1lido.",
    "cmd.giveexp.levelingDisabled": "Aumento de n\u00edvel foi desativado neste servidor.",
    "cmd.giveexp.mustNotBeBot": "O alvo n\u00e3o pode ser um bot.",
    "cmd.giveexp.nobodyMentioned": "Por favor mencione o usu\u00e1rio alvo.",
    "cmd.giveexp.success": "O XP foi entregue.",
    "cmd.google.headlineText": "Resultados encontrados para {0} ({1}):",
    "cmd.google.noResultsFound": "Nenhum resultado foi encontrado nesta consulta de pesquisa.",
    "cmd.google.usage.query": "Consulta de pesquisa",
    "cmd.help.aliases": "Pseud\u00f4nimo",
    "cmd.help.availableParameters": "Par\u00e2metros Dispon\u00edveis",
    "cmd.help.availableVariables": "Vari\u00e1veis Dispon\u00edveis",
    "cmd.help.chat": "Chat",
    "cmd.help.commandHelp": "Use `{0}help <Nome do Comando>` para obter mais informa\u00e7\u00f5es sobre um comando (por exemplo `{0}help joinmessage`).",
    "cmd.help.commandNotFound": "Oops! Este comando n\u00e3o foi encontrado.",
    "cmd.help.commands": "Comandos",
    "cmd.help.currency": "Moeda",
    "cmd.help.custom": "Customizado",
    "cmd.help.description": "Descri\u00e7\u00e3o",
    "cmd.help.fun": "Engra\u00e7ado",
    "cmd.help.guild": "Servidor",
    "cmd.help.images": "Imagens",
    "cmd.help.introduction": "Ol\u00e1! Meu nome \u00e9 Yoshino!",
    "cmd.help.introduction.text": "Aqui voc\u00ea pode ter uma lista completa de todos os comandos que eu conhe\u00e7o! Clique [aqui] (https:\/\/yoshino.gigadrivegroup.com\/commands) para uma lista mais detalhada.\n",
    "cmd.help.links": "Outras coisas \u00fateis",
    "cmd.help.links.donate": "Doar",
    "cmd.help.links.permissions": "Guia de permiss\u00f5es",
    "cmd.help.links.supportServer": "Servidor de Suporte",
    "cmd.help.links.website": "Informa\u00e7\u00f5es do site",
    "cmd.help.music": "M\u00fasica",
    "cmd.help.prefix.alternative": "Anternativamente voc\u00ea pode usar **{0}yoshi** como prefixo.\n(Por exemplo **{0}yoshihelp** ao env\u00e9s de {0}help)",
    "cmd.help.prefix.change": "O prefixo do comando pode ser alterado usando o comando `{0} prefix`.",
    "cmd.help.prefix.example": "Exemplo: **{0}avatar**",
    "cmd.help.prefix.info": "Todos os comandos s\u00e3o usados com o prefixo **{0}**.",
    "cmd.help.util": "\u00datil",
    "cmd.hug.single": "{0} quer um abra\u00e7o!",
    "cmd.hug.tagged": "{0} abra\u00e7ou {1}!",
    "cmd.idk.single": "{0} t\u00e1 nem ai \u00af\\_(\u30c4)_\/\u00af",
    "cmd.idk.tagged": "{0} t\u00e1 damdo os ombros para {1}! \u00af\\_(\u30c4)_\/\u00af",
    "cmd.info.creator": "Criador",
    "cmd.info.instanceType": "Tipo de Inst\u00e2ncia",
    "cmd.info.latency": "Lat\u00eancia",
    "cmd.info.library": "Biblioteca",
    "cmd.info.runningMusicBots": "Executando Inst\u00e2ncias de M\u00fasica",
    "cmd.info.servers": "Servidores",
    "cmd.info.shard": "Estilha\u00e7o",
    "cmd.info.uptime": "Uptime",
    "cmd.info.users": "Usu\u00e1rios",
    "cmd.info.version": "Vers\u00e3o",
    "cmd.info.website": "Site",
    "cmd.insult.single": "{0} sentiu-se insultado...",
    "cmd.insult.tagged": "Cuidado, {1}! {0} t\u00e1 muito louco!",
    "cmd.inventory.headline.common": "Itens comuns de {0}",
    "cmd.inventory.headline.epic": "Itens \u00e9picos de {0}",
    "cmd.inventory.headline.legendary": "Itens lend\u00e1rios de {0}",
    "cmd.inventory.headline.mythic": "Itens m\u00edticos de {0}",
    "cmd.inventory.headline.none": "Itens variados de {0}",
    "cmd.inventory.headline.rare": "Itens raros de {0}",
    "cmd.inventory.noItemsFound": "Este usu\u00e1rio n\u00e3o possui nenhum item nesta categoria.",
    "cmd.inventory.sendingInDM": "Certo! Estou enviando o inventario de {0} como uma mensagem direta!",
    "cmd.invite.click": "Clique Aqui",
    "cmd.invite.headline": "Convidando Yoshino",
    "cmd.invite.invHeadline": "Convite",
    "cmd.invite.supportHeadline": "Servidor de Suporte",
    "cmd.invite.text": "Para convidar Yoshino \u00e0 um servidor voc\u00ea precisar\u00e1 da permiss\u00e3o do \"Adiministrador\".",
    "cmd.joinmessage.cleared": "Eu limpei as mensagens de entrada desse servidor!",
    "cmd.joinmessage.cleared.showOld": "Eu limpei as mensagens de entrada desse servidor de `{0}`!",
    "cmd.joinmessage.furtherHelp": "Por favor, use `{0}clear` para limpar as mensagens de entrada.",
    "cmd.joinmessage.parameter.user": "Nome de usu\u00e1rio do membro que entrou",
    "cmd.joinmessage.parameter.userMention": "Nome de usu\u00e1rio do membro participante como menc\u00e3o",
    "cmd.joinmessage.set": "Eu troquei a mensagem de entrada desse servidor para `{0}`!",
    "cmd.joinmessage.set.showOld": "Eu troquei a mensagem de entrada do servidor de `{0}` para `{1}`!",
    "cmd.joinmessage.usage.message": "Mensagem",
    "cmd.kick.cannotKickOwner": "Desculpe, mas n\u00e3o posso kickar este usu\u00e1rio, pois ele \u00e9 o dono do servidor.",
    "cmd.kick.cannotKickSelf": "Voc\u00ea n\u00e3o pode se kickar.",
    "cmd.kick.cannotKickThatUser": "Voc\u00ea n\u00e3o pode kickar este usu\u00e1rio!",
    "cmd.kick.cannotKickYoshino": "Porque voc\u00ea iria me kickar?",
    "cmd.kick.error": "Um erro ocorreu. Por favor veja se eu tenho as corretas permiss\u00f5es.",
    "cmd.kick.noMember": "Este usu\u00e1rio n\u00e3o esta no servidor.",
    "cmd.kick.parameter.reason.info": "Motivo",
    "cmd.kick.privateMsg": "Voc\u00ea foi kickado do servidor **{0}**.",
    "cmd.kick.privateMsg.reason": "Voc\u00ea foi kickado do servidor **{0}**.\nMotivo: **{1}**.",
    "cmd.kick.success": "O usu\u00e1rio foi kickado com sucesso.",
    "cmd.kick.usage.reason": "Motivo",
    "cmd.language.languageChanged": "O idioma foi alterado para {0}!",
    "cmd.leaderboard.empty": "O quadro de l\u00edderes ainda n\u00e3o foi calculado, por favor tente mais tarde!",
    "cmd.leaderboard.headline": "Quadro de l\u00edderes para **{0}**",
    "cmd.leaderboard.levelingDisabled": "Aumento de n\u00edvel foi desativado neste servidor.",
    "cmd.leave.leaving": "Agora eu estou saindo do servidor. Para me adicionar novamente, visite meu website.",
    "cmd.lewd.single": "{0} t\u00e1 sendo SAFRADO!",
    "cmd.lewd.tagged": "{0} acha que {1} \u00e9 MUITO safrado!",
    "cmd.lick.single": "{0} est\u00e3o se lambendo. Voc\u00ea tem que ficar limpo!",
    "cmd.lick.tagged": "{0} t\u00e1 lambendo {1}!",
    "cmd.manga.chapters": "Cap\u00edtulos",
    "cmd.manga.endDate": "Data de t\u00e9rmino",
    "cmd.manga.fetchFailed": "Falha ao buscar dados!",
    "cmd.manga.fetching": "Buscando dados...",
    "cmd.manga.notFound": "Desculpa, mas eu n\u00e3o achei nenhum manga com esse nome.",
    "cmd.manga.score": "Pontua\u00e7\u00e3o",
    "cmd.manga.startDate": "Data de lan\u00e7amento",
    "cmd.manga.status": "Status",
    "cmd.manga.synopsis": "Sinopse",
    "cmd.manga.type": "Tipo",
    "cmd.manga.usage.mangaName": "Nome do Manga",
    "cmd.manga.viewOnMAL": "Olhar no MyAnimeList",
    "cmd.manga.volumes": "Volumes",
    "cmd.modlogchannel.channelNotFound": "Este canal n\u00e3o pode ser encontrado.",
    "cmd.modlogchannel.cleared": "O canal de registro de modera\u00e7\u00e3o foi limpo.",
    "cmd.modlogchannel.set": "Eu troquei o canal de registros de modera\u00e7\u00e3o para `{0}`!",
    "cmd.modlogchannel.set.showOld": "Eu troquei o canal de registros de modera\u00e7\u00e3o de `{0}` para `{1}`!",
    "cmd.modlogchannel.usage.channel": "Canal",
    "cmd.movie.director": "Diretor",
    "cmd.movie.fetchFailed": "Falha ao buscar dados!",
    "cmd.movie.fetching": "Buscando dados...",
    "cmd.movie.imdbRating": "Avalia\u00e7\u00e3o IMDb",
    "cmd.movie.notFound": "Desculpa, mas eu n\u00e3o pude encontrar nenhum filme com este nome.",
    "cmd.movie.released": "Lan\u00e7amento",
    "cmd.movie.resultsFound": "Encontrei **{0}** resultados para **{1}**. Por favor selecione:",
    "cmd.movie.runtime": "Dura\u00e7\u00e3o",
    "cmd.movie.runtime.display": "{0} minutos",
    "cmd.movie.synopsis": "Sinopse",
    "cmd.movie.usage.movieName": "Nome do Filme",
    "cmd.movie.viewOnSimkl": "Ver no Simkl.com",
    "cmd.music.addingPlaylist": "Certo! Estou adicionando v\u00e1rias m\u00fasicas \u00e0 fila!\nVoc\u00ea pode conferi-la com `{0}queue`.",
    "cmd.music.addingTrack": "Certo! Estou adicionando `{0}` \u00e0 fila!\nVoc\u00ea pode conferi-la com `{1}queue`.",
    "cmd.music.clear.info": "Limpar a fila atual.",
    "cmd.music.cleared": "A fila foi limpa.",
    "cmd.music.delete.info": "Deleta uma playlist salva.",
    "cmd.music.join.info": "Fazer Yoshino entrar no seu canal de voz atual.",
    "cmd.music.join.joined": "Me conectei a `{0}` com sucesso!",
    "cmd.music.join.limitReached": "Desculpa, mas parece que o canal est\u00e1 cheio!",
    "cmd.music.join.pleaseJoin": "Por favor entre em um canal de voz.",
    "cmd.music.leave.info": "Fazer com que Yoshino sa\u00eda da canal de voz em que ela se encontra.",
    "cmd.music.leave.left": "Eu deixei o canal de voz com sucesso.",
    "cmd.music.leave.notInChannel": "No momento n\u00e3o estou conectado a um canal de voz.",
    "cmd.music.load.info": "Carrega uma playlist salva para a fila.",
    "cmd.music.loop.activated": "Loop ativado!",
    "cmd.music.loop.deactivated": "Loop desativado!",
    "cmd.music.loop.info": "Ativar modo loop na fila.",
    "cmd.music.nameUnavaibale": "Voc\u00ea j\u00e1 tem uma playlist com este nome.",
    "cmd.music.noTracksFound": "Desculpe, mas eu n\u00e3o achei nada do tipo.",
    "cmd.music.nowplaying.author": "Autor",
    "cmd.music.nowplaying.headline": "Tocando no momento",
    "cmd.music.nowplaying.info": "Mostrar a m\u00fasica atualmente sendo tocada.",
    "cmd.music.nowplaying.length": "Dura\u00e7\u00e3o",
    "cmd.music.nowplaying.name": "Nome",
    "cmd.music.nowplaying.noTrack": "No momento n\u00e3o h\u00e1 m\u00fasicas sendo tocadas.",
    "cmd.music.play.info": "Tocar uma m\u00fasica\/Adicion\u00e1-la a fila.",
    "cmd.music.play.joinFirst": "Por favor use `{0}music join` para me conectar a um canal primeiro.",
    "cmd.music.play.usage.urlOrQuery": "URL ou Consulta de Pesquisa",
    "cmd.music.playlist.queueLimitReached": "Nem todas as m\u00fasicas puderam ser adicionadas a fila pois ela chegou a seu limite! Cheque `{0}patreon` para descobrir como aumenta-la.",
    "cmd.music.playlistDeleted": "A playlist foi deletada.",
    "cmd.music.playlistLoaded": "A playlist foi carregada na fila atual!",
    "cmd.music.playlistLoading": "Certo, a playlist **{0}** esta sendo carregada! Isso pode levar um tempo...",
    "cmd.music.playlistNotFound": "Essa playlist n\u00e3o pode ser encontrada.",
    "cmd.music.playlists.headline": "Aqui est\u00e3o suas playlists salvas! Clique em uma playlist para mais informa\u00e7\u00f5es. Voc\u00ea pode carregar uma playlist com o comando `{0}playlist load`.",
    "cmd.music.playlists.info": "Ver suas playlists salvas.",
    "cmd.music.playlists.noPlaylists": "Voc\u00ea n\u00e3o tem nenhuma playlist salva! Use o comando `{0}playlist save` para salvar a fila atual como uma playlist.",
    "cmd.music.playlists.sending": "Certo! Eu estou te enviando sua playlist como uma mensagem privada.",
    "cmd.music.queue.commandInfo": "Lista a fila.",
    "cmd.music.queue.currentSong": "Tocando no momento: **{0}** [Dura\u00e7\u00e3o: **{1}**]",
    "cmd.music.queue.currentSong.none": "N\u00e3o h\u00e1 m\u00fasicas tocando no momento.",
    "cmd.music.queue.currentSong.stream": "Tocando no momento: **{0}**",
    "cmd.music.queue.empty": "No momento, a fila est\u00e1 vazia.",
    "cmd.music.queue.headline": "Fila de M\u00fasicas do Bot (mostrando max. {0} m\u00fasicas, no momento {1} na fila)",
    "cmd.music.queue.info": "Por favor, tenha em mente que o bot de m\u00fasica est\u00e1 em fase de testes e bugs podem ocorrer! Al\u00e9m disso, no momento apenas um servidor est\u00e1 dispon\u00edvel, troque seu servidor de voz para Europa Central.",
    "cmd.music.queue.nowPlaying": "Tocando Agora",
    "cmd.music.queueLimitReached": "Voc\u00ea chegou ao limite m\u00e1ximo de m\u00fasicas na fila. Cheque `{0}patreon` descobrir como aumenta-la.",
    "cmd.music.reachedSavedPlaylistsLimit": "Voc\u00ea alcan\u00e7ou a limite m\u00e1ximo de playlist salvas. Cheque `{0}patreon`para descobrir como aumentar o limite da sua playlist.",
    "cmd.music.remove.info": "Remove um item da fila.",
    "cmd.music.remove.removed": "`{0}` removido da fila.",
    "cmd.music.restart.info": "Toca a m\u00fasica atual novamente.",
    "cmd.music.restart.restarting": "Certo! Estou reiniciando `{0}`!",
    "cmd.music.save.created": "A playlist foi criada!\n\nUse o comando `{0}playlist load {1}` para carrega-la.",
    "cmd.music.save.errorWhileCreating": "N\u00e3o foi poss\u00edvel criar a playlist! Por favor tenha em mente que voc\u00ea n\u00e3o pode nomear duas playists com o mesmo nome.",
    "cmd.music.save.info": "Salvar fila atual como uma playlist.",
    "cmd.music.save.nameTooLong": "O nome da playlst especificada \u00e9 grande demais.",
    "cmd.music.search": "{0} Resultados para: **{1}**",
    "cmd.music.shuffle.done": "A fila foi embaralhada.",
    "cmd.music.skip.info": "Pular m\u00fasica atual.",
    "cmd.music.skipping": "Pulando para a pr\u00f3xima m\u00fasica.",
    "cmd.music.usage.playlistId": "ID da playlist",
    "cmd.music.usage.playlistName": "Nome da Playlist",
    "cmd.music.volume.info": "Mudar o Volume (Apenas patr\u00f5es).",
    "cmd.music.volume.updated": "O volume foi alterado para **{0}**.",
    "cmd.music.volume.usage.volume": "Volume",
    "cmd.nom.single": "{0} t\u00e1 mastigando sua comida!",
    "cmd.nom.tagged": "{0} come com {1}!",
    "cmd.notificationschannel.cleared": "O canal de notifica\u00e7\u00f5es foi limpo.",
    "cmd.notificationschannel.set": "Eu troquei o canal de notifica\u00e7\u00f5es para `{0}`!",
    "cmd.notificationschannel.set.showOld": "Eu troquei o canal de notifica\u00e7\u00f5es de `{0}` para `{1}`!",
    "cmd.nyan.single": "{0} quer uma cat girl!",
    "cmd.nyan.tagged": "{0} te mandou uma cat girl fofa, {1}!",
    "cmd.onlyAvailableToPatron": "Este comando est\u00e1 dispon\u00edvel apenas para Patr\u00f5es de n\u00edvel **{0}** ou maior.\n\n\n\nPara descobrir como conseguir um N\u00edvel Patreon maior, visite <{1}>.",
    "cmd.openchest.invalidAmount": "Por favor coloque uma quantidade v\u00e1lida (um n\u00famero entre 1 e 10).",
    "cmd.openchest.result.plural": "Resultados",
    "cmd.openchest.result.singular": "Resultado",
    "cmd.osu.accuracy": "Precis\u00e3o",
    "cmd.osu.country": "Pa\u00eds",
    "cmd.osu.countryRanking": "Ranque no Pa\u00eds",
    "cmd.osu.id": "ID",
    "cmd.osu.level": "N\u00edvel",
    "cmd.osu.name": "Nome de usu\u00e1rio",
    "cmd.osu.plays": "Jogadas",
    "cmd.osu.rankedScore": "Pontua\u00e7\u00e3o Ranqueada",
    "cmd.osu.text": "Estat\u00edsticas de **{0}** no osu!",
    "cmd.osu.totalScore": "Pontua\u00e7\u00e3o Total",
    "cmd.owo.single": "OwO",
    "cmd.owo.tagged": "{1}, OwO o que \u00e9 isso?",
    "cmd.pat.single": "{0} t\u00e1 fazendo carinho neles mesmos!",
    "cmd.pat.tagged": "{0} t\u00e1 fazendo carinho em {1}!",
    "cmd.patreon.add.added": "O N\u00edvel Patreon foi ativado neste servidor. As mudan\u00e7as podem demorar at\u00e9 5 minutos para tomar efeito total.",
    "cmd.patreon.add.info": "Ativar o n\u00edvel Patreon neste servidor",
    "cmd.patreon.add.notAPatron": "Voc\u00ea n\u00e3o \u00e9 um Patr\u00e3o. Cheque `{0}patreon` para descobrir como se tornar um Patr\u00e3o.",
    "cmd.patreon.add.ownerInfo": "Seu servidor **{0}** foi melhorado para N\u00edvel Patreon **{1}** pelo usu\u00e1rio **{2}**.\n\n\n\nPor favor, note que caso este usuario saia do servidor, o N\u00edvel Patreon ser\u00e1 desativado no seu servidor. Para saber mais sobre Niveis Patreon, visite <{3}>.",
    "cmd.patreon.add.patreonLevelDoesNotAllowUpgrade": "Seu n\u00edvel Patreon n\u00e3o te possibilita melhorar nenhuma guilda. Visite <{0}> para mudar para um N\u00edvel Patreon maior.",
    "cmd.patreon.add.patronAlreadyActive": "Um N\u00edvel Patreon j\u00e1 est\u00e1 ativo neste servidor.",
    "cmd.patreon.add.reachedMaximum": "Voc\u00ea alcan\u00e7ou o n\u00edvel m\u00e1ximo de melhora do seu servidor. Visite <{0}> para mudar para um N\u00edvel Patreon maior e melhorar mais servidores.",
    "cmd.patreon.donateInfo": "Doando para meu Patreon, voc\u00ea pode melhorar seu servidor para um n\u00edvel Patreon, te dando algumas coisas a mais como aumentar o limite da fila de m\u00fasica e hosts melhores.\n\n\nPara saber mais v\u00e1 para: <{0}>",
    "cmd.patreon.list.headline": "Servidores Patr\u00f5es ({0} encontrados)",
    "cmd.patreon.list.info": "Liste todos os servidores em que voc\u00ea deu um n\u00edvel Patreon",
    "cmd.patreon.list.noPatroningGuilds": "Voc\u00ea n\u00e3o possui nenhum servidor com n\u00edvel Patreon ativado no momento.",
    "cmd.patreon.remove.info": "Desativar n\u00edvel Patreon neste servidor",
    "cmd.patreon.remove.noPatronActive": "Este servidor n\u00e3o possu\u00ed n\u00edvel Patreon ativado.",
    "cmd.patreon.remove.notAPatron": "Voc\u00ea n\u00e3o \u00e9 um Patr\u00e3o. Cheque `{0}patreon` para descobrir como tornar-se um Patr\u00e3o.",
    "cmd.patreon.remove.otherPatron": "O n\u00edvel Patreon de outra pessoa est\u00e1 ativado no momento, portanto voc\u00ea n\u00e3o pode desativ\u00e1-lo.",
    "cmd.patreon.remove.ownerInfo": "O usu\u00e1rio **{0}** desativou o N\u00edvel Patreon no seu servidor **{1}**.",
    "cmd.patreon.remove.removed": "O n\u00edvel Patreon deste servidor foi desativado. Poder\u00e1 levar at\u00e9 5 para que todas as mudan\u00e7as aconte\u00e7am.",
    "cmd.permissions.allow.info": "Concede um n\u00f3 de permiss\u00e3o (requer exatamente um par\u00e2metro!).",
    "cmd.permissions.changed.channel": "`{0}` esta agora definido para **{1}** para o canal `{2}`.",
    "cmd.permissions.changed.role": "`{0}` est\u00e1 agora definido para **{1}** para todos os n\u00fameros da fun\u00e7\u00e3o `{2}`.",
    "cmd.permissions.changed.server": "`{0}` est\u00e1 agora definido para **{1}** para o servidor inteiro.",
    "cmd.permissions.default.info": "Padroniza um n\u00f3 de permiss\u00e3o (requer exatamente um par\u00e2metro!).",
    "cmd.permissions.deny.info": "Nega um n\u00f3 de permiss\u00e3o (requer exatamente um par\u00e2metro!).",
    "cmd.permissions.headline": "Ajuda com permiss\u00f5es",
    "cmd.permissions.helpInfo": "Se voc\u00ea tem alguma pergunta em rela\u00e7\u00e3o a permiss\u00f5es, entre na p\u00e1gina de ajuda ou nosso servidor de suporte (Links **{0}help**).",
    "cmd.permissions.list.info": "Lista todos os n\u00f3s de permiss\u00e3o.",
    "cmd.permissions.parameter.channel.info": "Seleciona um canal espec\u00edfico (usa o canal atual caso n\u00e3o especificado)",
    "cmd.permissions.parameter.guild.info": "Seleciona um servidor inteiro",
    "cmd.permissions.parameter.role.info": "Seleciona uma fun\u00e7\u00e3o espec\u00edfica",
    "cmd.permissions.permissionNotFound": "Esta permiss\u00e3o n\u00e3o p\u00f4de ser encontrada! Use `{0} list` para conseguir todos os n\u00f3s de permiss\u00e3o.",
    "cmd.permissions.roleNotFound": "Esta fun\u00e7\u00e3o n\u00e3o foi encontrada! Por favor coloque o nome **exato** da fun\u00e7\u00e3o.",
    "cmd.permissions.show.guild": "Mostrando permiss\u00f5es para n\u00edvel **Guilda**.",
    "cmd.permissions.show.headline": "Permiss\u00f5es",
    "cmd.permissions.show.info": "Mostra permiss\u00f5es (requer exatamente um par\u00e2metro!).",
    "cmd.permissions.type.allowed": "PERMITIDO",
    "cmd.permissions.type.allowedDefault": "PERMITIDO POR PADR\u00c3O",
    "cmd.permissions.type.denied": "NEGADO",
    "cmd.permissions.type.deniedDefault": "NEGADO POR PADR\u00c3O",
    "cmd.ping.latency": "Lat\u00eancia: `{0}`",
    "cmd.poke.single": "{0} foi cutucado!",
    "cmd.poke.tagged": "{0} t\u00e1 cutucando {1}!",
    "cmd.poll.alreadyActive": "j\u00e1 existe uma vota\u00e7\u00e3o ativa neste canal.",
    "cmd.poll.createdBy": "Vota\u00e7\u00e3o por {0}",
    "cmd.poll.creating": "Certo, estou criando uma vota\u00e7\u00e3o no canal {0}!",
    "cmd.poll.footer": "Vota\u00e7\u00e3o termina",
    "cmd.poll.footer.past": "Vota\u00e7\u00e3o terminou",
    "cmd.poll.invalidQuestionAnswerString": "Por favor especifique a pergunta e pelo menos 2 respostas. Lembre de separa-las com `;`.",
    "cmd.poll.parameter.channel.info": "O canal que deve realizar a vota\u00e7\u00e3o",
    "cmd.poll.parameter.time.info": "Dura\u00e7\u00e3o da vota\u00e7\u00e3o em minutos",
    "cmd.poll.pollEndedHeadline": "VOTA\u00c7\u00c3O ENCERRADA!",
    "cmd.poll.pollHeadline": "VOTA\u00c7\u00c3O",
    "cmd.poll.possibleAnswers": "Respostas poss\u00edveis",
    "cmd.poll.questionTooLong": "A quest\u00e3o especificada \u00e9 grande demais.",
    "cmd.poll.result": "Resultado",
    "cmd.poll.time.invalidInteger": "Por favor coloque um n\u00famero v\u00e1lido no par\u00e2metro `time`.",
    "cmd.poll.usage.questionAnswerString": "Pergunta;Resposta 1;Resposta 2;(...)",
    "cmd.poll.votes.plural": "Votos",
    "cmd.poll.votes.singular": "Voto",
    "cmd.pout.single": "{0} t\u00e1 fazendo biquinho!",
    "cmd.pout.tagged": "{0} t\u00e1 fazendo biquinho para {1}, por que ser\u00e1?",
    "cmd.prefix.discord.changed": "O prefixo do comando foi alterado para `{0}`!",
    "cmd.prefix.discord.info": "O prefixo atual do comando \u00e9 `{0}`.\nVoc\u00ea pode altera-lo executando o comando `{0}prefix <Novo Prefixo>`\n\nAlternativamente, voc\u00ea sempre poder\u00e1 usar `!yoshi` como prefixo.",
    "cmd.pubg.invalidPlatformRegion": "`{0}` n\u00e3o \u00e9 uma combina\u00e7\u00e3o v\u00e1lida de plataforma-regi\u00e3o.",
    "cmd.pubg.invalidUsername": "Nome de usu\u00e1rio\/ID inv\u00e1lido",
    "cmd.pubg.playerNotFound": "Este jogador n\u00e3o pode ser encontrado\nPor favor, tenha certeza de que voc\u00ea escreveu corretamente (Verifique as letras mai\u00fasculas e min\u00fasculas).",
    "cmd.pubg.rateLimited": "Taxa Limitada! Por favor espere um pouco antes de usar este comando novamente.",
    "cmd.pubg.usage.platform": "Plataforma",
    "cmd.pubg.usage.region": "Regi\u00e3o",
    "cmd.pubg.usage.username": "Nome de usu\u00e1rio no PUBG",
    "cmd.purge.finished.plural": "I purguei as mensagens {0} com sucesso!",
    "cmd.purge.finished.singular": "Eu purguei a mensagem {0} com sucesso!",
    "cmd.purge.minMax": "Por favor, coloque um n\u00famero entre {0} e {1}.",
    "cmd.purge.started": "Deletando mensagens. Isso pode levar um tempo...",
    "cmd.purge.usage.amount": "Quantidade",
    "cmd.quitmessage.cleared": "Eu limpei as mensagens de sa\u00edda desse servidor!",
    "cmd.quitmessage.cleared.showOld": "Eu limpei as mensagens de sa\u00edda desse servidor de `{0}`!",
    "cmd.quitmessage.furtherHelp": "Por favor, use `{0} clear` para limpar as mensagens de sa\u00edda.",
    "cmd.quitmessage.set": "Eu troquei a mensagem de sa\u00edda desse servidor para `{0}`!",
    "cmd.quitmessage.set.showOld": "Eu troquei a mensagem de sa\u00edda desse servidor de `{0}` para `{1}`!",
    "cmd.quitmessage.usage.message": "Mensagem",
    "cmd.raffle.alreadyParticipating": "Voc\u00ea j\u00e1 esta participando no sorteio deste chat.",
    "cmd.raffle.ended.creatorInfo.noWinners": "Seu sorteio criado no canal {0} acabou, mas nenhum ganhador pode ser determinado...",
    "cmd.raffle.ended.creatorInfo.winners.multiple": "Seu sorteio criado no chat de {0} acabou e os vencedores foram {1}.",
    "cmd.raffle.ended.creatorInfo.winners.single": "Seu sorteio criado no chat de {0} acabou e o vencedor foi {1}.",
    "cmd.raffle.ended.noWinners": "O sorteio terminou, mas nenhum ganhador pode ser determinado...",
    "cmd.raffle.ended.winners.multiple": "{0} ganharam o sorteio! Parab\u00e9ns!",
    "cmd.raffle.ended.winners.single": "{0} ganhou o sorteio! Parab\u00e9ns!",
    "cmd.raffle.noActiveRaffle": "N\u00e3o h\u00e1 nenhum sorteio ativo neste chat no momento.",
    "cmd.raffle.noActiveRaffle.howToStart": "N\u00e3o h\u00e1 nenhum sorteio ativo neste chat no momento. Use {0}startraffle para come\u00e7ar um sorteio.",
    "cmd.raffle.nowParticipating": "Voc\u00ea esta participando do sorteio! Boa sorte!",
    "cmd.rl.fetching": "Buscando dados...",
    "cmd.rl.invalidPlatform": "`{0}` n\u00e3o \u00e9 uma plataforma v\u00e1lida!",
    "cmd.rl.playerNotFound": "Este jogador n\u00e3o pode ser encontrado.",
    "cmd.rl.usage.platform": "Plataforma",
    "cmd.rl.usage.username": "Steam ID\/Steam URL\/XBOX Tag\/Nome de usu\u00e1rio na PSN",
    "cmd.rocketleague.text": "Estat\u00edsticas no Rocket League para **{0}** em **{1}**",
    "cmd.role.given": "Foi dado a voc\u00ea a fun\u00e7\u00e3o `{0}`.",
    "cmd.role.taken": "A fun\u00e7\u00e3o `{0}` foi retirada de voc\u00ea.",
    "cmd.rps.invalidPick": "Desculpa, n\u00e3o entendi o que voc\u00ea escolheu.",
    "cmd.rps.paper": "Papel",
    "cmd.rps.result.lose": "\nSua escolha: **{0}**\nMinha escolha: **{1}**\n\nVoc\u00ea **PERDEU**! Mais sorte na pr\u00f3xima!",
    "cmd.rps.result.tie": "\nSua escolha: **{0}**\nMinha escolha: **{1}**\n\n\u00c9 um **EMPATE**!",
    "cmd.rps.result.win": "\nSua escolha: **{0}**\nMinha escolha: **{1}**\n\nVoc\u00ea **GANHOU**! Parab\u00e9ns!",
    "cmd.rps.rock": "Pedra",
    "cmd.rps.scissors": "Tesoura",
    "cmd.seek.invalidTimestamp": "Por favor insira um tempo valido.",
    "cmd.seek.notSeekable": "A faixa atualmente em reprodu\u00e7\u00e3o n\u00e3o \u00e9 pesquis\u00e1vel.",
    "cmd.seek.seeking": "Certo, estou pulando para **{0}**.",
    "cmd.seek.usage.timestamp": "Tempo",
    "cmd.serverinfo.categories": "Categorias",
    "cmd.serverinfo.channels": "Canais",
    "cmd.serverinfo.created": "Criado",
    "cmd.serverinfo.id": "ID",
    "cmd.serverinfo.members": "Membros",
    "cmd.serverinfo.members.bots": "bots",
    "cmd.serverinfo.members.humans": "humanos",
    "cmd.serverinfo.owner": "Dono",
    "cmd.serverinfo.patron": "Patr\u00e3o",
    "cmd.serverinfo.region": "Regi\u00e3o",
    "cmd.serverinfo.roles": "Fun\u00e7\u00f5es",
    "cmd.slap.single": "Parece que {0} est\u00e3o se batendo...",
    "cmd.slap.tagged": "Wow! {0} deu um tapa em {1}!",
    "cmd.sleepy.single": "{0} parece estar com sono...",
    "cmd.sleepy.tagged": "{0} est\u00e1 sendo dorminhoco com {1}!",
    "cmd.smug.single": "{0} \u00e9 presun\u00e7oso(a)!",
    "cmd.smug.tagged": "Olhe, {1}! {0} \u00e9 presun\u00e7oso (a)!",
    "cmd.stare.single": "{0} t\u00e1 encarando...",
    "cmd.stare.tagged": "{0} t\u00e1 encarando {1}!",
    "cmd.startraffle.alreadyRaffleActive": "J\u00e1 existe um sorteio ativo neste chat.",
    "cmd.startraffle.invalidTime": "Por favor coloque um n\u00famero entre {0} e {1} para a dura\u00e7\u00e3o do sorteio.",
    "cmd.startraffle.invalidWinners": "Por favor coloque um n\u00famero entre {0} e {1} para a quantidade de vencedores do sorteio.",
    "cmd.startraffle.started": "Eu comecei um sorteio neste chat por {0} minutos que ter\u00e1 {1} vencedores.",
    "cmd.startraffle.usage.time": "Tempo em Minutos",
    "cmd.startraffle.usage.winners": "Quantidade de vencedores",
    "cmd.submessage.lookup": "\"{0}\" [use {1} limpe para remover]",
    "cmd.submessage.none": "N\u00e3o h\u00e1 mensagem de inscri\u00e7\u00e3o selecionada para este canal no momento.",
    "cmd.submessage.removed": "A mensagem de inscri\u00e7\u00e3o foi removida.",
    "cmd.submessage.set": "A mensagem de inscri\u00e7\u00e3o foi selecionada para `{0}`.",
    "cmd.sumfuk.single": "{0} quer transar!",
    "cmd.sumfuk.tagged": "{0} quer saber se voc\u00ea quer transar, {1}!",
    "cmd.thumbsup.single": "{0} acha que eles tem uma boa ideia...",
    "cmd.thumbsup.tagged": "Ei, {0}! {1} gostou da sua ideia!",
    "cmd.togglecommand.discord.disabled": "`{0}` est\u00e1 agora **desativado**.",
    "cmd.togglecommand.discord.enabled": "{0} est\u00e1 agora **ativado**.",
    "cmd.togglecommand.mayNotBeToggled": "Esse comando pode n\u00e3o estar ativado. Visite https:\/\/yoshino.gigadrivegroup.com\/commands para ver uma lista de comandos ativ\u00e1veis.",
    "cmd.togglecommand.usage.commandName": "Nome do Comando",
    "cmd.toggleleveling.disabled": "Aumento de nivel foi desativado. Usuarios n\u00e3o podem mais coletar XP.",
    "cmd.toggleleveling.enabled": "Aumento de n\u00edvel foi ativado! Usu\u00e1rios podem coletar XP novamente.",
    "cmd.topvoters.headline": "Visite <https:\/\/discordbots.org\/bot\/Yoshino\/vote> para votar para Yoshino.",
    "cmd.topvoters.votes.plural": "Votos",
    "cmd.topvoters.votes.singular": "Voto",
    "cmd.triggered.single": "{0} est\u00e1 pistola!",
    "cmd.triggered.tagged": "Oh n\u00e3o, {1}! {0} est\u00e1 pistola por sua causa!",
    "cmd.uptime.live": "{0} come\u00e7ou a streamar {1}!",
    "cmd.uptime.offline": "{0} esta offline no momento!",
    "cmd.urban.author": "Autor",
    "cmd.urban.definition": "Defini\u00e7\u00e3o",
    "cmd.urban.example": "Exemplo",
    "cmd.urban.fetching": "Buscando dados...",
    "cmd.urban.headline": ":book: Encontrado **{0}** resultados para **{1}**.",
    "cmd.urban.rating": "Avalia\u00e7\u00e3o",
    "cmd.urban.usage.query": "Consulta de pesquisa",
    "cmd.userinfo.bank": "Banco",
    "cmd.userinfo.cash": "Dinheiro",
    "cmd.userinfo.cashGlobal": "Saldo (Global)",
    "cmd.userinfo.cashServer": "Saldo (Este servidor)",
    "cmd.userinfo.id": "ID",
    "cmd.userinfo.joined.discord": "Entrou (Discord)",
    "cmd.userinfo.joined.thisServer": "Entrou (neste servidor)",
    "cmd.userinfo.levelHeadline": "N\u00edvel & XP",
    "cmd.userinfo.nickname": "Apelido",
    "cmd.userinfo.noMember": "Desculpa, mas {0} n\u00e3o \u00e9 um membro deste servidor.",
    "cmd.userinfo.roles": "Fun\u00e7\u00f5es",
    "cmd.userinfo.status": "Status",
    "cmd.waa.single": "{0} t\u00e1 tisti... :(",
    "cmd.waa.tagged": "Olha, {1}! Voc\u00ea deixou {0} tisti :(",
    "cmd.wasted.single": "{0} foi **DESTRU\u00cdDO**!",
    "cmd.wasted.tagged": "{1} foi **DESTR\u00cdDO** por {0}!",
    "cmd.withdraw.amountTooLow": "Voc\u00ea n\u00e3o pode retirar menos de 100$.",
    "cmd.withdraw.bankEmpty": "Sua conta banc\u00e1ria est\u00e1 vazia.",
    "cmd.withdraw.complete": "Voc\u00ea retirou **${0}** com sucesso da sua conta banc\u00e1ria. Voc\u00ea tem agora **${1}** restante na sua conta banc\u00e1ria.",
    "cmd.withdraw.limitReached": "Voc\u00ea n\u00e3o pode ter mais de **$10 Milh\u00f5es**.",
    "cmd.withdraw.usage.amount": "Quantidade",
    "commandDescription.50x2": "Apostar 50x2, se voc\u00ea rolar um numero maior do que 50 voc\u00ea ganhara o dobro do que apostou, do contr\u00e1rio voc\u00ea ir\u00e1 perder o que apostou!",
    "commandDescription.8ball": "Responde uma pergunta com sim ou n\u00e3o.",
    "commandDescription.addcommand": "Adiciona um comando de texto execut\u00e1vel no canal ou servidor atual.",
    "commandDescription.anime": "Procure por um anime em Kitsu.io.",
    "commandDescription.assignablerole": "Ajustar fun\u00e7\u00f5es auto-atribu\u00edveis.",
    "commandDescription.autorole": "Define uma fun\u00e7\u00e3o que ser\u00e1 dada a todos os novos membros deste servidor.",
    "commandDescription.avatar": "Mostra o avatar de um usu\u00e1rio.",
    "commandDescription.awoo": "Mostra uma rea\u00e7\u00e3o \"awoo\" de anime.",
    "commandDescription.bad": "Mostra uma rea\u00e7\u00e3o \"ruim\" de anime.",
    "commandDescription.baka": "Mostra uma imagem de rea\u00e7\u00e3o \"baka\".",
    "commandDescription.ban": "Banir um usu\u00e1rio permanentemente do servidor.",
    "commandDescription.bigtext": "Converte todo texto em texto com letras grandes de emoji.",
    "commandDescription.blush": "Mostra uma rea\u00e7\u00e3o \"envergonhado\" de anime.",
    "commandDescription.buychest": "Compra ba\u00fas por dinheiro.",
    "commandDescription.cat": "Mostra uma imagem aleat\u00f3ria de um gato.",
    "commandDescription.chucknorris": "Postar uma piada aleat\u00f3ria do Chuck Norris.",
    "commandDescription.clear": "Limpa a fila atual",
    "commandDescription.coffee": "Mostra uma foto aleat\u00f3ria de caf\u00e9.",
    "commandDescription.coinflip": "Jogar uma moeda, resultando em Cara ou Coroa.",
    "commandDescription.confused": "Mostra uma rea\u00e7\u00e3o \"confuso\" de anime.",
    "commandDescription.convert": "Mova dinheiro entre seus servidores espec\u00edficos e balan\u00e7o global.",
    "commandDescription.cuddle": "Mostra uma rea\u00e7\u00e3o \"mimar\" de anime.",
    "commandDescription.daily": "Coleta sua recompensa di\u00e1ria.",
    "commandDescription.dance": "Mostra uma rea\u00e7\u00e3o \"dan\u00e7ar\" de anime.",
    "commandDescription.deletecommand": "Deleta um comando de texto execut\u00e1vel do canal ou servidor atual.",
    "commandDescription.deposit": "Deposita seu dinheiro no banco.",
    "commandDescription.dog": "Mostra uma imagem aleat\u00f3ria de um cachorro.",
    "commandDescription.door": "Checa se a porta do codingneko esta aberta.",
    "commandDescription.emojify": "Transforma texto em emojis correspondentes.",
    "commandDescription.emotes": "Mostra emotes j\u00e1 registrados no servidor atual.",
    "commandDescription.fakemessage": "Mostra uma mensagem como se fosse escrita por outra pessoa.",
    "commandDescription.fortnite": "Mostra estat\u00edsticas no Fortnite.",
    "commandDescription.google": "Procurar na internet com Google.",
    "commandDescription.help": "Mostra uma lista de comandos.",
    "commandDescription.hentai": "Mostra uma imagem hentai.",
    "commandDescription.hug": "Mostra uma rea\u00e7\u00e3o \"abra\u00e7ar\" de anime.",
    "commandDescription.idk": "Mostra uma rea\u00e7\u00e3o \"sei l\u00e1\" de anime.",
    "commandDescription.info": "Mostra informa\u00e7\u00f5es sobre Yoshino.",
    "commandDescription.insult": "Mostra um rea\u00e7\u00e3o \"insultar\" de anime.",
    "commandDescription.inventory": "Checar o seu (ou de outra pessoa) inventario de itens.",
    "commandDescription.invite": "Manda um link de convite para Yoshino para entrar em um servidor e no servidor de suporte da Yoshino.",
    "commandDescription.kick": "Retirar um usu\u00e1rio do servidor.",
    "commandDescription.kotori": "Mostra uma imagem aleat\u00f3ria da Kotori de Date A Live.",
    "commandDescription.kurumi": "Mostra uma imagem aleat\u00f3ria da Kurumi de Date A Live.",
    "commandDescription.language": "Trocar o idioma em que Yoshino dever\u00e1 falar.",
    "commandDescription.leaderboard": "Mostra o top 200 usu\u00e1rios deste servidor, ordenado pelo n\u00edvel e experi\u00eancia.",
    "commandDescription.lenny": "Postar aquela carinha.",
    "commandDescription.lennyd": "Postar aquela carinha, mas deletar sua mensagem.",
    "commandDescription.lewd": "Mostra uma rea\u00e7\u00e3o \"safada\" de anime.",
    "commandDescription.lick": "Mostra uma rea\u00e7\u00e3o \"lamber\" de anime.",
    "commandDescription.loop": "Ativa modo loop na fila",
    "commandDescription.mana": "Mostra uma imagem aleat\u00f3ria da Mana de Date A Live.",
    "commandDescription.manga": "Procurar por um manga em Kitsu.io.",
    "commandDescription.meme": "Mostra um meme aleat\u00f3rio.",
    "commandDescription.miku": "Mostra uma imagem aleat\u00f3ria da Miku de Date A Live.",
    "commandDescription.movie": "Mostra informa\u00e7\u00f5es sobre um filme.",
    "commandDescription.music": "Gerenciar implementa\u00e7\u00e3o de m\u00fasica na Yoshino.",
    "commandDescription.natsumi": "Mostra uma imagem aleat\u00f3ria da Natsumi de Date A Live.",
    "commandDescription.nom": "Mostra uma rea\u00e7\u00e3o \"mastigando\" de anime.",
    "commandDescription.nowplaying": "Mostra a m\u00fasica atualmente sendo tocada",
    "commandDescription.nyan": "Mostra uma rea\u00e7\u00e3o \"nyan\" de anime.",
    "commandDescription.oof": "Mostra uma imagem \"oof\" aleat\u00f3ria.",
    "commandDescription.openchest": "Abrir um ba\u00fa.",
    "commandDescription.origami": "Mostra uma imagem aleat\u00f3ria da Origami de Date A Live.",
    "commandDescription.osu": "Checa as estat\u00edsticas de um usu\u00e1rio no osu!.",
    "commandDescription.owo": "Mostra uma rea\u00e7\u00e3o \"owo\" de anime.",
    "commandDescription.pat": "Mostra uma rea\u00e7\u00e3o \"carinho\" de anime.",
    "commandDescription.patreon": "Gerenciar seu N\u00edvel Patreon.",
    "commandDescription.permissions": "Permiss\u00e3o de configura\u00e7\u00e3o para o servidor, canal ou fun\u00e7\u00e3o inteiro.",
    "commandDescription.ping": "Mostra a lat\u00eancia em milissegundos.",
    "commandDescription.play": "Toca uma m\u00fasica\/adiciona uma m\u00fasica \u00e0 fila",
    "commandDescription.playlist": "Gerencia suas playlists salvas",
    "commandDescription.poke": "Mostra uma rea\u00e7\u00e3o \"cutucar\" de anime.",
    "commandDescription.poll": "Come\u00e7a uma vota\u00e7\u00e3o em um canal.",
    "commandDescription.pout": "Mostra uma rea\u00e7\u00e3o \"biquinho\" de anime.",
    "commandDescription.prefix": "Mudar o prefixo do comando da Yoshino.",
    "commandDescription.pubg": "Mostra as suas estat\u00edsticas ou de outra pessoa em PlayerUnknown's Battlegrounds.",
    "commandDescription.purge": "Deleta a \u00faltima x mensagem no canal atual.",
    "commandDescription.queue": "Lista a fila",
    "commandDescription.reconnect": "Fazer Yoshino (re)conectar ao canal de voz atual.",
    "commandDescription.remove": "Remove um item da fila",
    "commandDescription.restart": "Toca a m\u00fasica atual novamente",
    "commandDescription.rocketleague": "Mostra estat\u00edsticas no Rocket League.",
    "commandDescription.role": "D\u00e1 ou pega uma fun\u00e7\u00e3o de\/para voc\u00ea.",
    "commandDescription.rps": "Jogar Pedra, Papel ou Tesoura com Yoshino.",
    "commandDescription.seek": "Pula para um determinado tempo da m\u00fasica atual.",
    "commandDescription.serverinfo": "Mostra informa\u00e7\u00f5es sobre o servidor atual.",
    "commandDescription.setjoinmessage": "Define a mensagem de entrada do servidor atual.",
    "commandDescription.setmodlogchannel": "Configura o canal para enviar registos de modera\u00e7\u00e3o.",
    "commandDescription.setnotificationschannel": "Configura o canal a enviar mensagens de entrada e saida de usu\u00e1rios.",
    "commandDescription.setquitmessage": "Configura a mensagem de saida do servidor atual.",
    "commandDescription.shuffle": "Embaralhar a fila de m\u00fasicas atuais (n\u00e3o afeta a m\u00fasica sendo tocada no momento).",
    "commandDescription.skip": "Pula a m\u00fasica atual",
    "commandDescription.slap": "Mostra uma rea\u00e7\u00e3o \"tapa\" de anime.",
    "commandDescription.sleepy": "Mostra uma rea\u00e7\u00e3o \"dorminhoco\" de anime.",
    "commandDescription.smug": "Mostra uma rea\u00e7\u00e3o \"presun\u00e7oso\" de anime.",
    "commandDescription.stare": "Mostra uma rea\u00e7\u00e3o \"encarando\" de anime.",
    "commandDescription.stop": "Para o bot de m\u00fasica",
    "commandDescription.sumfuk": "Mostra uma rea\u00e7\u00e3o \"quertrepa\" de anime.",
    "commandDescription.tableflip": "Virar a mesa.",
    "commandDescription.thighs": "Mostra coxas de anime.",
    "commandDescription.thumbsup": "Mostra uma rea\u00e7\u00e3o \"joinha\" de anime.",
    "commandDescription.togglecommand": "Ativa\/Desativa certo comando (nem todos os comandos s\u00e3o desativaveis).",
    "commandDescription.toggleLeveling": "Ativa ou desativa aumento de n\u00edvel neste servidor.",
    "commandDescription.tohka": "Mostra uma imagem aleat\u00f3ria da Tohka de Date A Live.",
    "commandDescription.topvoters": "Mostra os top voters para Yoshino.",
    "commandDescription.triggered": "Mostra uma rea\u00e7\u00e3o \"pistola\" de anime.",
    "commandDescription.urban": "Procura uma defini\u00e7\u00e3o no urbandictionary,com.",
    "commandDescription.userinfo": "Mostra informa\u00e7\u00f5es sobre um usu\u00e1rio espec\u00edfico.",
    "commandDescription.volume": "Altera o volume (Apenas patr\u00f5es)",
    "commandDescription.waa": "Mostra uma rea\u00e7\u00e3o \"waa\" de anime.",
    "commandDescription.wasted": "Mostra uma rea\u00e7\u00e3o \"sefudeu\" de anime.",
    "commandDescription.withdraw": "Retira dinheiro da sua conta banc\u00e1ria.",
    "commandDescription.yamai": "Mostra uma imagem aleat\u00f3ria da Yamai de Date A Live.",
    "commandDescription.yoshino": "Mostra uma imagem aleat\u00f3ria da Yoshino de Date A Live.",
    "discord.commandInCooldown": "Oops! No momento esse comando est\u00e1 em recarga!",
    "discord.commandRequiresNSFWChanenl": "Este comando s\u00f3 pode ser executado em canais marcados como NSFW. Caso voce tenha acabado de criar este canal, tenha certeza de ir para as configura\u00e7\u00f5es do canal e aperte salvar abaixo!",
    "discord.disabledChangelogs": "Voc\u00ea n\u00e3o receber\u00e1 mudan\u00e7as de registro. Para abilitar mudan\u00e7as de registro novamente, me envie uma mensagem com **!togglechangelogs**.",
    "discord.enabledChangelogs": "Voc\u00ea agora receber\u00e1 mudan\u00e7as de registro. Para desabilitar, me envie uma mensagem com **!togglechangelogs**.",
    "discord.gameStatus.listening": "Ouvindo",
    "discord.gameStatus.playing": "Jogando",
    "discord.gameStatus.streaming": "Stremando",
    "discord.gameStatus.watching": "Assistindo",
    "discord.itemRarity.common.name": "Comuns",
    "discord.itemRarity.epic.name": "\u00c9pico",
    "discord.itemRarity.legendary.name": "Lend\u00e1rio",
    "discord.itemRarity.mythic.name": "M\u00edtico",
    "discord.itemRarity.none.name": "Variados",
    "discord.itemRarity.rare.name": "Raros",
    "discord.joinInfo.description": "Eu espero ser \u00fatil para voc\u00ea! Para conseguir uma lista de meus comandos, digite **{0}help**. Se voc\u00ea precisa de ajuda me configurando ou encontrar problemas, cheque meu [website](https:\/\/yoshino.gigadrivegroup.com) ou o meu [support server](https:\/\/yoshino.gigadrivegroup.com\/community).\n\nE tamb\u00e9m, caso goste de mim, por favor considere checar meu [Patreon]({1}) para ajudar a manter-me ativa!",
    "discord.joinInfo.title": "Ol\u00e1! Meu nome \u00e9 Yoshino! Obrigada por me convidar!",
    "discord.missingEmbedPermission": "Oops, parece que eu preciso da permiss\u00e3o de \"Links Embutidos\", ent\u00e3o n\u00e3o posso continuar com esta a\u00e7\u00e3o.",
    "discord.missingPermission": "Oops! Parece que voc\u00ea precisa da permiss\u00e3o `{0}`!",
    "discord.noNotificationsChannelDefined": "Cuidado! Eu ainda n\u00e3o sei para onde enviar as notifica\u00e7\u00f5es de entrada\/sa\u00edda, por favor defina um canal com `{0}setnotificationschannel`",
    "discord.onlineStatus.dnd": "N\u00e3o Atrapalhe",
    "discord.onlineStatus.idle": "Inativo",
    "discord.onlineStatus.offline": "Offline",
    "discord.onlineStatus.online": "Online",
    "discord.onlyOwnerMayExecute": "Oops! Apenas o dono do servidor pode executar esse comando!",
    "discord.permission.addReactions": "Adicionar Rea\u00e7\u00e3o",
    "discord.permission.administrator": "Administrador",
    "discord.permission.attachFiles": "Anexar Arquivo",
    "discord.permission.banMembers": "Banir Membros",
    "discord.permission.changeNickname": "Mudar Apelido",
    "discord.permission.connect": "Conectar",
    "discord.permission.createInstantInvite": "Criar Convite Instant\u00e2neo",
    "discord.permission.deafenMembers": "Usu\u00e1rios surdos",
    "discord.permission.embedLinks": "Links Incorporados",
    "discord.permission.kickMembers": "Kickar Membros",
    "discord.permission.manageChannels": "Gerenciar Canais",
    "discord.permission.manageEmojis": "Gerenciar Emojis",
    "discord.permission.manageMessages": "Gerenciar Mensagens",
    "discord.permission.manageNicknames": "Gerenciar Apelidos",
    "discord.permission.manageRoles": "Gerenciar Fun\u00e7\u00f5es",
    "discord.permission.manageServer": "Gerenciar Servidor",
    "discord.permission.manageWebhooks": "Gerenciar Webhooks",
    "discord.permission.mentionEveryone": "Mencionar \u00e0 todos",
    "discord.permission.moveMembers": "Mover Membros",
    "discord.permission.muteMembers": "Silenciar Membros",
    "discord.permission.readHistory": "Ler Hist\u00f3rico",
    "discord.permission.readTextChannelsSeeVoiceChannels": "Ler Canais de Texto & Ver Canais de Voz",
    "discord.permission.sendMessages": "Enviar Mensagens",
    "discord.permission.sendTTSMessages": "Enviar Mensagens de Text to Speach",
    "discord.permission.speak": "Falar",
    "discord.permission.useExternalEmojis": "Usar Emojis Externos",
    "discord.permission.useVoiceActivity": "Usar Atividade de Voz",
    "discord.permission.viewAuditLogs": "Ver Registros de Auditoria",
    "discord.roleNameOrID": "Nome da Fun\u00e7\u00e3o ou ID",
    "discord.roleNotFound": "Esta fun\u00e7\u00e3o n\u00e3o pode ser encontrado.",
    "discord.usageInfo.mention": "Desculpa, mas voc\u00ea usou o comando de forma errada! O modo certo seria `{0}`",
    "discord.usageInfo.noMention": "O modo correto de uso \u00e9: `{0}`",
    "discord.yoshinoCantInteract": "Desculpa, mas este servidor n\u00e3o me permite interagir com esse usu\u00e1rio desta maneira!",
    "discord.yoshinoMissingPermission": "Oops! Parece que o servidor n\u00e3o me permite fazer isso. Diga ao administrador para me dar a permiss\u00e3o `{0}`.",
    "errorOccurred": "Um erro ocorreu.",
    "errorOccurred.text": "Um erro ocorreu: {0}",
    "invalidInteger": "Por favor digite um n\u00famero v\u00e1lido.",
    "levelUp.description": "Parab\u00e9ns, {0}! Voc\u00ea chegou ao n\u00edvel {1}!\n\nUse {2} perfil para mais informa\u00e7\u00f5es.",
    "levelUp.headline": "Aumentou de N\u00edvel!",
    "levelUp.reward": "Reconpensa",
    "modLog.amount": "Quantidade",
    "modLog.ban.headline": "Membro Banido",
    "modLog.channel": "Canal",
    "modLog.kick.headline": "Membro Kickado",
    "modLog.moderator": "Moderador",
    "modLog.purge.headline": "Limpar Mensagens",
    "modLog.reason": "Motivo",
    "modLog.target": "Alvo",
    "modLog.unban.headline": "Membro Desbanido",
    "nameList.lastSeperator": "e",
    "usage.mention": "@Mencionar",
    "yoshino.headline": "Yoshino - uma bot r\u00e1pida e confi\u00e1vel para Twitch, Discord e YouTube!"
}