{
    "8ball.neutral.1": "No estoy segura de que responder, int\u00e9ntalo de nuevo.",
    "8ball.neutral.2": "Vuelve a preguntar m\u00e1s tarde.",
    "8ball.neutral.3": "Mejor no te lo digo ahora.",
    "8ball.neutral.4": "Ahora mismo no puedo responderte.",
    "8ball.neutral.5": "Conc\u00e9ntrate e int\u00e9ntalo de nuevo.",
    "8ball.no.1": "No cuentes con ello.",
    "8ball.no.2": "Mi respuesta es no.",
    "8ball.no.3": "Mis fuentes dicen que no.",
    "8ball.no.4": "El pron\u00f3stico no es bueno.",
    "8ball.no.5": "Lo dudo bastante.",
    "8ball.no.6": "No tienes muchas posibilidades.",
    "8ball.yes.1": "Eso es cierto.",
    "8ball.yes.10": "Si.",
    "8ball.yes.11": "Todo apunta a que si.",
    "8ball.yes.12": "Absolutamente.",
    "8ball.yes.2": "Se ha decidido as\u00ed.",
    "8ball.yes.3": "Sin ninguna duda.",
    "8ball.yes.4": "S\u00ed, definitivamente.",
    "8ball.yes.5": "Puedes confiar en ello.",
    "8ball.yes.6": "Puedes contar con ello.",
    "8ball.yes.7": "Desde mi punto de vista, si.",
    "8ball.yes.8": "Probablemente.",
    "8ball.yes.9": "Parece bien.",
    "actionLog.ban.headline": "{0} ha sido baneado por {1}",
    "actionLog.ban.name": "Miembro baneado",
    "actionLog.ban.reason": "Raz\u00f3n",
    "actionLog.ban.target": "Objetivo",
    "actionLog.channel_created.channel": "Canal",
    "actionLog.channel_created.headline": "Canal creado",
    "actionLog.channel_created.name": "Canal creado",
    "actionLog.channel_created.type": "Tipo",
    "actionLog.channel_created.type.text": "Texto",
    "actionLog.channel_created.type.voice": "Voz",
    "actionLog.channel_deleted.channel": "Canal",
    "actionLog.channel_deleted.headline": "Canal eliminado",
    "actionLog.channel_deleted.name": "Canal eliminado",
    "actionLog.channel_deleted.type": "Tipo",
    "actionLog.channel_deleted.type.text": "Texto",
    "actionLog.channel_deleted.type.voice": "Voz",
    "cmd.8ball.usage.question": "Pregunta",
    "cmd.addcommand.discord.added": "Se ha a\u00f1adido el comando `{0}` con el texto `{1}` satisfactoriamente.",
    "cmd.addcommand.discord.alreadyExists": "Ya existe un comando llamado `{0}`.",
    "cmd.addcommand.usage.commandName": "Nombre del comando",
    "cmd.addcommand.usage.commandText": "Texto del comando",
    "cmd.anime.endDate": "Fecha final",
    "cmd.anime.episodes": "Episodios",
    "cmd.anime.fetchFailed": "\u00a1No se pudieron encontrar datos!",
    "cmd.anime.fetching": "Buscando datos...",
    "cmd.anime.notFound": "Lo siento, pero no pude encontrar ning\u00fan anime con ese nombre.",
    "cmd.anime.resultsFound": "He encontrado **{0}** resultados para **{1}**. Por favor selecciona:",
    "cmd.anime.score": "Puntuaci\u00f3n",
    "cmd.anime.startDate": "Fecha de inicio",
    "cmd.anime.status": "Estado",
    "cmd.anime.synopsis": "Sinopsis",
    "cmd.anime.type": "Tipo",
    "cmd.anime.usage.animeName": "Nombre del Anime",
    "cmd.anime.viewOnMAL": "Ver en MyAnimeList",
    "cmd.avatar.showFull": "\u00a1Haga clic aqu\u00ed para un enlace directo!",
    "cmd.awoo.single": "\u00a1{0} awooea!",
    "cmd.awoo.tagged": "\u00a1{0} awooea a {1}!",
    "cmd.bad.single": "\u00a1{0} quiere ser castigado!",
    "cmd.bad.tagged": "\u00a1Cuidado, {1}! \u00a1\u00a1{0} quiere castigarte!!",
    "cmd.ban.cannotBanOwner": "Lo siento, pero no puedo banear a ese usuario, ya que es el due\u00f1o del servidor.",
    "cmd.ban.cannotBanSelf": "No te puedes banear a ti mismo.",
    "cmd.ban.cannotBanYoshino": "\u00bfPor qu\u00e9 me banear\u00edas?",
    "cmd.ban.delDays.invalidInteger": "Por favor, introduza un n\u00famero v\u00e1lido para el par\u00e1metro `delDays`.",
    "cmd.ban.delDaysTooLow": "`delDays` debe ser al menos `1`.",
    "cmd.ban.noMember": "Ese usuario no se encuentr\u00e1 en este servidor.",
    "cmd.ban.usage.delDays": "D\u00edas",
    "cmd.ban.usage.reason": "Raz\u00f3n",
    "cmd.bigtext.usage.text": "Texto",
    "cmd.blush.single": "\u00a1Qu\u00e9 mono, {0} est\u00e1 sonroj\u00e1ndose!",
    "cmd.blush.tagged": "\u00a1Guau, {1}! \u00a1Hiciste que {0} se sonrojara!",
    "cmd.chucknorris.fetchFailed": "\u00a1No se pudo encontrar una broma aleatoria sobre Chuck Norris!",
    "cmd.chucknorris.fetching": "Buscando una broma aleatoria sobre Chuck Norris...",
    "cmd.coinflip.flipped": "\u00a1La moneda es **{0}**!",
    "cmd.coinflip.flipping": "\u00a1Vale! Tirando una moneda...",
    "cmd.coinflip.heads": "Cara",
    "cmd.coinflip.tails": "Cruz",
    "cmd.confused.single": "{0} est\u00e1 confundido...",
    "cmd.confused.tagged": "\u00a1Oh no, {1}! \u00a1Est\u00e1s confundiendo a {0}!",
    "cmd.cuddle.single": "\u00a1{0} quiere achuchones!",
    "cmd.cuddle.tagged": "\u00a1{0} est\u00e1 achuchando a {1}!",
    "cmd.dance.single": "\u00a1{0} est\u00e1 bailando! \u00a1Mira sus movimientos!",
    "cmd.dance.tagged": "\u00a1{0} y {1} est\u00e1n bailando!",
    "cmd.deletecommand.discord.deleted": "Se ha conseguido borrar el comando `{0}` con el texto `{1}` satisfactoriamente.",
    "cmd.deletecommand.discord.notFound": "No existe ning\u00fan comando llamado `{0}`.",
    "cmd.deletecommand.usage.commandName": "Nombre del comando",
    "cmd.fakemessage.usage.text": "Texto",
    "cmd.followage.following": "{0} ha empezado a seguir a {1}.",
    "cmd.followage.notfollowing": "\u00a1{0} no est\u00e1 siguiendo!",
    "cmd.followmessage.lookup": "\"{0}\" [utiliza {1} clear para borrar]",
    "cmd.followmessage.none": "Actualmente no hay ning\u00fan mensaje de seguimiento para este canal.",
    "cmd.followmessage.removed": "El mensaje de seguimiento ha sido eliminado.",
    "cmd.followmessage.set": "El mensaje de seguimiento se ha cambiado a \"{0}\".",
    "cmd.fortnite.matchesPlayed": "Partidos jugados",
    "cmd.fortnite.playtime": "Tiempo jugado",
    "cmd.fortnite.usage.platform": "Plataforma",
    "cmd.fortnite.usage.username": "Nombre de usuario de Epic Games",
    "cmd.help.aliases": "Alias",
    "cmd.help.availableParameters": "Par\u00e1metros disponibles",
    "cmd.help.availableVariables": "Variables disponibles",
    "cmd.help.commandHelp": "Use `{0} help <Nombre del comando>` para obtener m\u00e1s informaci\u00f3n sobre un comando (por ejemplo, `{0} help joinmessage`).",
    "cmd.help.commandNotFound": "\u00a1Ups! No se pudo encontrar ese comando.",
    "cmd.help.commands": "Comandos",
    "cmd.help.custom": "Personalizado",
    "cmd.help.description": "Descripci\u00f3n",
    "cmd.help.images": "Im\u00e1genes",
    "cmd.help.introduction": "\u00a1Hola! \u00a1Mi nombre es Yoshino!",
    "cmd.help.introduction.text": "\u00a1Aqui tienes una lista completa de todos los comandos que conozco! Haz clic [aqui](https:\/\/yoshino.gigadrivegroup.com\/commands) para una lista mas detallada.\n",
    "cmd.help.links": "Otras cosas \u00fatiles",
    "cmd.help.links.donate": "Donar",
    "cmd.help.links.permissions": "Gu\u00eda de permisos",
    "cmd.help.links.supportServer": "Servidor de soporte",
    "cmd.help.links.website": "Sitio web de informaci\u00f3n",
    "cmd.help.music": "M\u00fasica",
    "cmd.help.prefix.alternative": "Alternativamente, puedes usar ** {0} yoshi ** como prefijo\n(por ejemplo, ** {0} yoshihelp ** en lugar de {0}help)",
    "cmd.help.prefix.change": "El prefijo del comando es modificable mediante el uso del comando `{0} prefix`.",
    "cmd.help.prefix.example": "Ejemplo: **{0}avatar**",
    "cmd.help.prefix.info": "Todos los comandos son usados con un prefijo **{0}**.",
    "cmd.hug.single": "\u00a1{0} quiere un abrazo!",
    "cmd.hug.tagged": "\u00a1{0} abraza a {1}!",
    "cmd.idk.single": "{0} est\u00e1 encogido\/a de hombros \u00af\\_(\u30c4)_\/\u00af",
    "cmd.idk.tagged": "\u00a1{0} est\u00e1 encogido\/a de hombros hacia {1}! \u00af\\_(\u30c4)_\/\u00af",
    "cmd.info.creator": "Creador",
    "cmd.info.instanceType": "Tipo de instancia",
    "cmd.info.latency": "Estado latente",
    "cmd.info.library": "Librer\u00eda",
    "cmd.info.runningMusicBots": "Instancias de m\u00fasica en uso",
    "cmd.info.servers": "Servidores",
    "cmd.info.shard": "Fragmento",
    "cmd.info.uptime": "Tiempo de actividad",
    "cmd.info.users": "Usuarios",
    "cmd.info.version": "Versi\u00f3n",
    "cmd.info.website": "Sitio web",
    "cmd.insult.single": "{0} se siente insultado...",
    "cmd.insult.tagged": "\u00a1Cuidado, {1}! \u00a1{0} est\u00e1 siendo cruel!",
    "cmd.invite.invHeadline": "Invitaci\u00f3n",
    "cmd.joinmessage.cleared": "\u00a1He borrado el mensaje de bienvenida de este servidor!",
    "cmd.joinmessage.cleared.showOld": "\u00a1He borrado el memsaje de bienvenida `{0}` de este servidor!",
    "cmd.joinmessage.furtherHelp": "Por favor utiliza `{0} clear` para borrar el mensaje de bienvenida.",
    "cmd.joinmessage.set": "\u00a1He cambiado el mensaje de bienvenida a `{0}`!",
    "cmd.joinmessage.set.showOld": "\u00a1He cambiado el mensaje de bienvenida de `{0}` a `{1}`!",
    "cmd.joinmessage.usage.message": "Mensaje",
    "cmd.language.languageChanged": "\u00a1El idioma ha sido cambiado a {0}!",
    "cmd.lewd.single": "\u00a1{0} est\u00e1 siendo PERVERTIDO!",
    "cmd.lewd.tagged": "\u00a1{0} piensa que {1} es MUY pervertido!",
    "cmd.lick.single": "{0} se est\u00e1 lamiendo. \u00a1Hay que estar limpio!",
    "cmd.lick.tagged": "\u00a1{0} est\u00e1 lamiendo a {1}!",
    "cmd.manga.chapters": "Cap\u00edtulos",
    "cmd.manga.endDate": "Fecha final",
    "cmd.manga.fetchFailed": "\u00a1No se pudieron encontrar datos!",
    "cmd.manga.fetching": "Buscando datos...",
    "cmd.manga.notFound": "Lo siento, pero no pude encontrar ning\u00fan manga con ese nombre.",
    "cmd.manga.score": "Puntuaci\u00f3n",
    "cmd.manga.startDate": "Fecha de inicio",
    "cmd.manga.status": "Estado",
    "cmd.manga.synopsis": "Sinopsis",
    "cmd.manga.type": "Tipo",
    "cmd.manga.usage.mangaName": "Nombre del Manga",
    "cmd.manga.viewOnMAL": "Ver en MyAnimeList",
    "cmd.manga.volumes": "Vol\u00famenes",
    "cmd.modlogchannel.set": "\u00a1He cambiado el canal del log de moderaci\u00f3n a `{0}`!",
    "cmd.modlogchannel.set.showOld": "\u00a1He cambiado el canal del registro de moderaci\u00f3n de `{0}` a `{1}`!",
    "cmd.music.addingPlaylist": "\u00a1De acuerdo! \u00a1Estoy a\u00f1adiendo varias canciones a la cola de reproducci\u00f3n!\nPuedes comprobar la cola de reproducci\u00f3n con `{0}queue`.",
    "cmd.music.addingTrack": "\u00a1De acuerdo! \u00a1Estoy a\u00f1adiendo `{0}` a la cola de reproducci\u00f3n! \nPuedes comprobar la cola de reproducci\u00f3n con `{1}queue`.",
    "cmd.music.clear.info": "Borra todo el contenido de la cola de reproducci\u00f3n.",
    "cmd.music.cleared": "La cola de reproducci\u00f3n se ha borrado.",
    "cmd.music.join.info": "Haz que Yoshino se una a tu canal de voz.",
    "cmd.music.join.joined": "\u00a1He conseguido conectarme a `{0}` satisfactoriamente!",
    "cmd.music.join.pleaseJoin": "Por favor \u00fanete a un canal de voz.",
    "cmd.music.leave.info": "Haz que Yoshino salga del canal de voz en el que est\u00e1 actualmente.",
    "cmd.music.leave.left": "He salido del canal de voz satisfactoriamente.",
    "cmd.music.leave.notInChannel": "Actualmente no estoy conectada a un canal de voz.",
    "cmd.music.noTracksFound": "Lo siento, pero no pude encontrar nada.",
    "cmd.music.nowplaying.author": "Autor",
    "cmd.music.nowplaying.headline": "Reproduciendo",
    "cmd.music.nowplaying.info": "Muestra la canci\u00f3n que se est\u00e1 reproduciendo actualmente.",
    "cmd.music.nowplaying.length": "Duraci\u00f3n",
    "cmd.music.nowplaying.name": "Nombre",
    "cmd.music.nowplaying.noTrack": "Actualmente no hay ninguna canci\u00f3n en reproducci\u00f3n.",
    "cmd.music.play.info": "Reproduce una canci\u00f3n\/La agrega a la cola de reproducci\u00f3n.",
    "cmd.music.play.joinFirst": "Es necesario que utilices previamente `{0}music join` para conectarme a un canal de voz.",
    "cmd.music.queue.commandInfo": "Muestra la cola de reproducci\u00f3n.",
    "cmd.music.queue.empty": "Actualmente la cola de reproducci\u00f3n est\u00e1 vac\u00eda.",
    "cmd.music.queue.headline": "Cola de reproducci\u00f3n (mostrando hasta {0} canciones, actualmente {1} en la cola de reproducci\u00f3n)",
    "cmd.music.queue.info": "Por favor, \u00a1considera que el bot de musica est\u00e1 actualmente en fase de pruebas y que pueden ocurrir errores! Adem\u00e1s, \u00fanicamente existe un servidor disponible. Para conseguir la mejor calidad de sonido disponible, cambia la regi\u00f3n del servidor a EU Central.",
    "cmd.music.remove.info": "Elimina una canci\u00f3n de la cola de reproducci\u00f3n.",
    "cmd.music.remove.removed": "Eliminado `{0}` de la cola de reproducci\u00f3n.",
    "cmd.music.skip.info": "Reproduce la siguiente canci\u00f3n en la cola de reproducci\u00f3n.",
    "cmd.music.skipping": "Reproduciendo la siguiente canci\u00f3n en la cola de reproducci\u00f3n.",
    "cmd.music.usage.playlistName": "Nombre de la lista de reproducci\u00f3n",
    "cmd.nom.single": "\u00a1{0} est\u00e1 comiendo su comida!",
    "cmd.nom.tagged": "\u00a1{0} come con {1}!",
    "cmd.notificationschannel.set": "\u00a1He cambiado el canal de notificaciones a `{1}`!",
    "cmd.notificationschannel.set.showOld": "\u00a1He cambiado el canal de notificaciones de `{0}` a `{1}`!",
    "cmd.nyan.single": "\u00a1{0} quiere una chica gata!",
    "cmd.nyan.tagged": "\u00a1{0} te ha enviado una adorable chica gata, {1}!",
    "cmd.openchest.result.plural": "Resultados",
    "cmd.openchest.result.singular": "Resultado",
    "cmd.osu.accuracy": "Precisi\u00f3n",
    "cmd.osu.country": "Pa\u00eds",
    "cmd.osu.name": "Nombre de usuario",
    "cmd.owo.single": "OwO",
    "cmd.owo.tagged": "{1}, \u00bfOwO qu\u00e9 es esto?",
    "cmd.pat.single": "\u00a1{0} est\u00e1 acarici\u00e1ndose a s\u00ed mismo\/a!",
    "cmd.pat.tagged": "\u00a1{0} est\u00e1 acariciando a {1}!",
    "cmd.permissions.allow.info": "Permite un nodo de permiso (\u00a1Requiere un \u00fanico par\u00e1metro!).",
    "cmd.permissions.changed.channel": "`{0}` se ha ajustado a **{1}** en el canal `{2}`.",
    "cmd.permissions.changed.role": "`{0}` se ha ajustado a **{1}** para todos los miembros del rol `{2}`.",
    "cmd.permissions.changed.server": "`{0}` se ha ajustado a **{1}** en todo el servidor.",
    "cmd.permissions.default.info": "Haz que un nodo de permiso est\u00e9 activado por predeterminado (\u00a1Requiere un \u00fanico par\u00e1metro!).",
    "cmd.permissions.deny.info": "Denega un nodo de permiso (\u00a1Requiere un \u00fanico par\u00e1metro!).",
    "cmd.permissions.headline": "Ayuda para los permisos",
    "cmd.permissions.helpInfo": "Si tiene alguna pregunta sobre los permisos, visita nuestra web de ayuda o nuestro servidor de Discord (enlaces en **{0}help**).",
    "cmd.permissions.list.info": "Muestra todos los nodos de permiso.",
    "cmd.permissions.parameter.channel.info": "Se dirige a un canal en concreto (\u00a1utiliza el canal actual si no se especifica ninguno!)",
    "cmd.permissions.parameter.guild.info": "Se dirige al servidor entero",
    "cmd.permissions.parameter.role.info": "Se dirige a un rol espec\u00edfico",
    "cmd.permissions.permissionNotFound": "\u00a1No se pudo encontrar ese permiso! Usa `{0} list` para obtener una lista de los nodos de permiso.",
    "cmd.permissions.roleNotFound": "\u00a1No se pudo encontrar ese rol! Por favor introduzca el nombre del rol **correctamente**.",
    "cmd.permissions.show.headline": "Permisos",
    "cmd.permissions.show.info": "Muestra los permisos (\u00a1Requiere un \u00fanico par\u00e1metro!).",
    "cmd.permissions.type.allowed": "PERMITIDO",
    "cmd.permissions.type.allowedDefault": "PERMITIDO POR PREDETERMINADO",
    "cmd.permissions.type.denied": "DENEGADO",
    "cmd.permissions.type.deniedDefault": "DENEGADO POR PREDETERMINADO",
    "cmd.ping.latency": "Ping: `{0}`",
    "cmd.poke.single": "\u00a1{0} ha sido pegado\/a!",
    "cmd.poke.tagged": "\u00a1{0} est\u00e1 pegando a {1}!",
    "cmd.poll.createdBy": "Encuesta creada por {0}",
    "cmd.poll.footer": "La encuesta termina",
    "cmd.poll.pollEndedHeadline": "\u00a1ENCUESTA TERMINADA!",
    "cmd.poll.pollHeadline": "ENCUESTA",
    "cmd.poll.result": "Resultado",
    "cmd.poll.votes.plural": "Votos",
    "cmd.pout.single": "\u00a1{0} est\u00e1 haciendo pucheros!",
    "cmd.pout.tagged": "{0} est\u00e1 haci\u00e9ndole pucheros a {1}, \u00bfpor qu\u00e9 ser\u00e1?",
    "cmd.prefix.discord.changed": "\u00a1El prefijo del comando ha sido cambiado a `{0}`!",
    "cmd.prefix.discord.info": "El prefijo de comando actual es `{0}`.\nPuedes cambiar el prefijo actual con el comando `{0}prefijo <Nuevo Prefijo>.\n\nAlternativamemte, siempre puedes usar `!yoshi` como un prefijo.",
    "cmd.pubg.usage.platform": "Plataforma",
    "cmd.pubg.usage.region": "Regi\u00f3n",
    "cmd.pubg.usage.username": "Nombre de usuario de PUBG",
    "cmd.purge.finished.plural": "\u00a1He conseguido purgar {0} mensajes!",
    "cmd.purge.finished.singular": "\u00a1He conseguido purgar {0} mensajes satisfactoriamente!",
    "cmd.purge.minMax": "Por favor introduzca un n\u00famero entre {0} y {1}.",
    "cmd.purge.started": "Borrando mensajes... Esto tal vez tarde un rato...",
    "cmd.purge.usage.amount": "Cantidad",
    "cmd.quitmessage.cleared": "\u00a1He eliminado el mensaje de salida de este servidor!",
    "cmd.quitmessage.cleared.showOld": "\u00a1He eliminado el mensaje de salida `{0}` de este servidor!",
    "cmd.quitmessage.furtherHelp": "Por favor utiliza `{0} clear` para eliminar el mensaje de salida.",
    "cmd.quitmessage.set": "\u00a1He cambiado el mensaje de salida de este servidor a `{0}`!",
    "cmd.quitmessage.set.showOld": "\u00a1He cambiado el mensaje de salida de este servidor de `{0}` a `{1}`!",
    "cmd.quitmessage.usage.message": "Mensaje",
    "cmd.rl.playerNotFound": "Ese jugador no pudo ser encontrado.",
    "cmd.rl.usage.platform": "Plataforma",
    "cmd.rps.invalidPick": "Lo siento, pero no entiendo la opci\u00f3n que has elegido.",
    "cmd.rps.paper": "Papel",
    "cmd.rps.result.lose": "\nHas elegido: **{0}**\nHe elegido: **{1}**\n\n\u00a1Has **PERDIDO**! \u00a1Buena suerte la pr\u00f3xima vez!",
    "cmd.rps.result.tie": "\nHas elegido: **{0}**\nHe elegido: **{0}**\n\n\u00a1Es un **EMPATE**!",
    "cmd.rps.result.win": "\nHas elegido: **{0}**\nHe elegido:**{0}**\n\n\u00a1Has *GANADO**! \u00a1Felicidades!",
    "cmd.rps.rock": "Piedra",
    "cmd.rps.scissors": "Tijeras",
    "cmd.serverinfo.categories": "Categor\u00edas",
    "cmd.serverinfo.channels": "Canales",
    "cmd.serverinfo.created": "Creado",
    "cmd.serverinfo.id": "ID",
    "cmd.serverinfo.members": "Miembros",
    "cmd.serverinfo.owner": "Due\u00f1o",
    "cmd.serverinfo.region": "Regi\u00f3n",
    "cmd.serverinfo.roles": "Roles",
    "cmd.slap.single": "Parece que {0} se est\u00e1 pegando una bofetada a si mismo...",
    "cmd.slap.tagged": "\u00a1Wow! \u00a1{0} ha pegado una bofetada a {1}!",
    "cmd.sleepy.single": "{0} parece estar somnoliento\u2026",
    "cmd.sleepy.tagged": "\u00a1{0} est\u00e1 somnoliento con {1}!",
    "cmd.smug.single": "\u00a1{0} est\u00e1 sobrado\/a!",
    "cmd.smug.tagged": "\u00a1Mira, {1}! \u00a1{0} es un presumido!",
    "cmd.stare.single": "{0} est\u00e1 acechando\u2026",
    "cmd.stare.tagged": "\u00a1{0} est\u00e1 acechando a {1}!",
    "cmd.submessage.lookup": "\"{0}\" [utiliza {1} clear para borrar]",
    "cmd.submessage.none": "Actualmente no hay ning\u00fan mensaje de suscripci\u00f3n para este canal.",
    "cmd.submessage.removed": "El mensaje de suscripci\u00f3n ha sido eliminado.",
    "cmd.submessage.set": "El mensaje de suscripci\u00f3n se ha cambiado a \"{0}\".",
    "cmd.sumfuk.single": "\u00a1{0} quiere un poco de \u00f1iki\u00f1iki!",
    "cmd.sumfuk.tagged": "\u00a1{0} quiere saber si quieres un poquito de \u00f1iki\u00f1iki, {1}!",
    "cmd.thumbsup.single": "{0} piensa que tiene una gran idea\u2026",
    "cmd.thumbsup.tagged": "\u00a1Oye, {1}! \u00a1{0} piensa que tu idea es genial!",
    "cmd.togglecommand.discord.disabled": "{0} est\u00e1 **desactivado**.",
    "cmd.togglecommand.discord.enabled": "{0} est\u00e1 **activado**.",
    "cmd.togglecommand.mayNotBeToggled": "Ese comando no puede ser activado\/desactivado.\nVisita https:\/\/yoshino.gigadrivegroup.com\/commands para ver una lista de los comandos conmutables.",
    "cmd.togglecommand.usage.commandName": "Nombre del comando",
    "cmd.triggered.single": "\u00a1{0} est\u00e1 triggered!",
    "cmd.triggered.tagged": "\u00a1Oh no, {1}! \u00a1{0} est\u00e1 triggered por tu culpa!",
    "cmd.urban.author": "Autor",
    "cmd.urban.definition": "Definici\u00f3n",
    "cmd.urban.example": "Ejemplo",
    "cmd.userinfo.bank": "Banco",
    "cmd.userinfo.cash": "Efectivo",
    "cmd.userinfo.id": "ID",
    "cmd.userinfo.joined.discord": "Tiempo desde que se creo una cuenta en Discord",
    "cmd.userinfo.joined.thisServer": "Tiempo desde que se uni\u00f3 a este servidor",
    "cmd.userinfo.nickname": "Mote",
    "cmd.userinfo.noMember": "Lo siento, pero {0} no es un miembro de este servidor.",
    "cmd.userinfo.roles": "Roles",
    "cmd.userinfo.status": "Estado",
    "cmd.waa.single": "{0} est\u00e1 triste... :(",
    "cmd.waa.tagged": "\u00a1Mira, {1}! Has puesto triste a {0}. :(",
    "cmd.wasted.single": "\u00a1{0} ha sido **ELIMINADO\/A**!",
    "cmd.wasted.tagged": "{1} ha sido **ELIMINADO\/A** por {0}!",
    "commandDescription.8ball": "Responde a una pregunta de si\/no.",
    "commandDescription.addcommand": "Agrega un comando de texto ejecutable al canal o servidor actual.",
    "commandDescription.anime": "Busca un anime en Kitsu.io.",
    "commandDescription.avatar": "Muestra el avatar de un usuario.",
    "commandDescription.awoo": "Muestra una imagen de reacci\u00f3n anime \"awoo\".",
    "commandDescription.bad": "Muestra una imagen de reacci\u00f3n anime \"bad\".",
    "commandDescription.ban": "Banea a un usuario permanentemente del servidor.",
    "commandDescription.blush": "Muestra una imagen de reacci\u00f3n anime \"blush\".",
    "commandDescription.chucknorris": "Env\u00eda una broma aleatoria de Chuck Norris.",
    "commandDescription.coinflip": "Lanza una moneda, que puede dar como resultado cara o cruz.",
    "commandDescription.confused": "Muestra una imagen de reacci\u00f3n anime \"confundido\".",
    "commandDescription.cuddle": "Muestra una imagen de reacci\u00f3n anime \"acurrucada\".",
    "commandDescription.dance": "Muestra una imagen de reacci\u00f3n anime \"bailar\".",
    "commandDescription.deletecommand": "Elimina un comando de texto ejecutable del canal o servidor actual.",
    "commandDescription.help": "Muestra una lista de comandos.",
    "commandDescription.hug": "Muestra una imagen de reacci\u00f3n anime \"abrazo\".",
    "commandDescription.idk": "Muestra una imagen de reacci\u00f3n anime \"idk\".",
    "commandDescription.info": "Muestra informaci\u00f3n sobre Yoshino.",
    "commandDescription.insult": "Muestra una imagen de reacci\u00f3n anime \"insulto\".",
    "commandDescription.kick": "Expulsa a un usuario del servidor.",
    "commandDescription.language": "Cambia el idioma en el que Yoshino deber\u00eda hablar.",
    "commandDescription.lenny": "Publica una cara lenny.",
    "commandDescription.lennyd": "Publica una cara lenny, pero elimina tu mensaje.",
    "commandDescription.lewd": "Muestra una imagen de reacci\u00f3n anime \"lewd\".",
    "commandDescription.lick": "Muestra una imagen de reacci\u00f3n anime \"lick\".",
    "commandDescription.manga": "Busca un manga en Kitsu.io.",
    "commandDescription.music": "Administra todas las funcionalidades de Yoshino relacionadas con la m\u00fasica.",
    "commandDescription.nom": "Muestra una imagen de reacci\u00f3n anime \"nom\".",
    "commandDescription.nyan": "Muestra una imagen de reacci\u00f3n anime \"nyan\".",
    "commandDescription.owo": "Muestra una imagen de reacci\u00f3n anime \"owo\".",
    "commandDescription.pat": "Muestra una imagen de reacci\u00f3n anime \"pat\".",
    "commandDescription.permissions": "Configura permisos para todo el servidor, canal o rol.",
    "commandDescription.ping": "Muestra la latencia en milisegundos.",
    "commandDescription.poke": "Muestra una imagen de reacci\u00f3n anime \"poke\".",
    "commandDescription.pout": "Muestra una imagen de reacci\u00f3n anime \"pout\".",
    "commandDescription.prefix": "Cambiar el prefijo de comandos de Yoshino.",
    "commandDescription.purge": "Borra los \u00faltimos x mensajes del canal actual.",
    "commandDescription.rps": "Juega piedra, papel o tijeras con Yoshino.",
    "commandDescription.serverinfo": "Muestra informaci\u00f3n sobre el servidor actual.",
    "commandDescription.setjoinmessage": "Establece el mensaje de bienvenida del servidor actual.",
    "commandDescription.setmodlogchannel": "Establece el canal para enviar registros de moderaci\u00f3n.",
    "commandDescription.setnotificationschannel": "Establece el canal para enviar mensajes de ingreso y salida del servidor.",
    "commandDescription.setquitmessage": "Establece el mensaje de salida del servidor actual.",
    "commandDescription.slap": "Muestra una imagen de reacci\u00f3n anime \"slap\".",
    "commandDescription.sleepy": "Muestra una imagen de reacci\u00f3n anime \"sleepy\".",
    "commandDescription.smug": "Muestra una imagen de reacci\u00f3n anime \"smug\".",
    "commandDescription.stare": "Muestra una imagen de reacci\u00f3n anime \"stare\".",
    "commandDescription.sumfuk": "Muestra una imagen de reaccion anime \"sumfuk\".",
    "commandDescription.thumbsup": "Muestra una imagen de reacci\u00f3n anime \"thumbsup\".",
    "commandDescription.togglecommand": "Alterna un determinado comando (no todos los comandos son conmutables).",
    "commandDescription.triggered": "Muestta una imagen de reacci\u00f3n anime \"triggered\".",
    "commandDescription.userinfo": "Muestra informaci\u00f3n sobre un usuario espec\u00edfico.",
    "commandDescription.waa": "Muestra una imagen de reacci\u00f3n anime \"waa\".",
    "commandDescription.wasted": "Muestra una imagen de reacci\u00f3n anime \"wasted\".",
    "commandDescription.yoshino": "Muestra una imagen aleatoria de Yoshino de Date A Live.",
    "discord.commandInCooldown": "\u00a1Oops! \u00a1Ese comando est\u00e1 actualmente en enfriamiento!",
    "discord.gameStatus.listening": "Escuchando",
    "discord.gameStatus.playing": "Jugando",
    "discord.gameStatus.streaming": "En directo",
    "discord.gameStatus.watching": "Viendo",
    "discord.itemRarity.common.name": "Com\u00fan",
    "discord.itemRarity.epic.name": "\u00c9pico",
    "discord.itemRarity.legendary.name": "Legendario",
    "discord.itemRarity.rare.name": "Raro",
    "discord.missingPermission": "\u00a1Oops! \u00a1Parece que no tienes el permiso `{0}`!",
    "discord.noNotificationsChannelDefined": "\u00a1Cuidado! No se a donde enviar las notificaciones de entrada y salida de miembros a\u00fan, por favor selecciona un canal con `{0}setnotificationschannel`",
    "discord.onlineStatus.dnd": "No Molestar",
    "discord.onlineStatus.idle": "Ocioso",
    "discord.onlineStatus.online": "Online",
    "discord.onlyOwnerMayExecute": "\u00a1Oops! \u00a1Solo el due\u00f1o del servidor puede ejecutar ese comando!",
    "discord.permission.addReactions": "Agregar Reacciones",
    "discord.permission.administrator": "Administrador",
    "discord.permission.banMembers": "Banear miembros",
    "discord.permission.connect": "Conectar",
    "discord.permission.createInstantInvite": "Crear invitaci\u00f3n instant\u00e1nea",
    "discord.permission.kickMembers": "Expulsar miembros",
    "discord.permission.manageMessages": "Administrar mensajes",
    "discord.permission.sendMessages": "Enviar mensajes",
    "discord.permission.speak": "Hablar",
    "discord.usageInfo.mention": "\u00a1Lo siento, pero has utilizado ese comando de forma incorrecta! La estructura correcta para utilizar el comando es: `{0}`",
    "discord.usageInfo.noMention": "La estructura correcta es: \"{0}\"",
    "discord.yoshinoMissingPermission": "\u00a1Oops! Parece que el servidor no me deja hacer eso. Por favor, dile al administrador que me de el permiso `{0}`.",
    "errorOccurred": "Ocurri\u00f3 un error.",
    "errorOccurred.text": "Ocurri\u00f3 un error: {0}",
    "invalidInteger": "Por favor introduzca un n\u00famero valido.",
    "modLog.moderator": "Moderador",
    "usage.mention": "@Mencionar",
    "yoshino.headline": "Yoshino - \u00a1un bot r\u00e1pido y confiable para Twitch, Discord y YouTube!"
}