{
    "8ball.neutral.1": "Antwort unklar, versuch's nochmal.",
    "8ball.neutral.2": "Frag sp\u00e4ter noch einmal.",
    "8ball.neutral.3": "Das sage ich dir lieber noch nicht.",
    "8ball.neutral.4": "Kann ich jetzt nicht sagen.",
    "8ball.neutral.5": "Konzentriere dich und frag noch einmal.",
    "8ball.no.1": "Z\u00e4hl nicht darauf.",
    "8ball.no.2": "Meine Antwort ist nein.",
    "8ball.no.3": "Meine Quellen sagen nein.",
    "8ball.no.4": "Keine guten Aussichten.",
    "8ball.no.5": "Sehr zweifelhaft.",
    "8ball.no.6": "Die Chancen stehen nicht gut.",
    "8ball.yes.1": "Es ist sicher.",
    "8ball.yes.10": "Ja.",
    "8ball.yes.11": "Die Zeichen deuten auf ja.",
    "8ball.yes.12": "Absolut.",
    "8ball.yes.2": "Es ist entschieden.",
    "8ball.yes.3": "Ohne Zweifel.",
    "8ball.yes.4": "Ja auf jeden Fall.",
    "8ball.yes.5": "Du kannst dich darauf verlassen.",
    "8ball.yes.6": "Du kannst darauf z\u00e4hlen.",
    "8ball.yes.7": "So, wie ich es sehe, ja.",
    "8ball.yes.8": "H\u00f6chstwahrscheinlich.",
    "8ball.yes.9": "Sieht gut aus.",
    "actionLog.ban.headline": "{0} wurde von {1} gebannt",
    "actionLog.ban.name": "Mitglied gebannt",
    "actionLog.ban.reason": "Grund",
    "actionLog.ban.target": "Ziel",
    "actionLog.channel_created.channel": "Kanal",
    "actionLog.channel_created.headline": "Kanal erstellt",
    "actionLog.channel_created.name": "Kanal erstellt",
    "actionLog.channel_created.type": "Typ",
    "actionLog.channel_created.type.text": "Text",
    "actionLog.channel_created.type.voice": "Sprache",
    "actionLog.channel_deleted.channel": "Kanal",
    "actionLog.channel_deleted.headline": "Kanal gel\u00f6scht",
    "actionLog.channel_deleted.name": "Kanal gel\u00f6scht",
    "actionLog.channel_deleted.type": "Typ",
    "actionLog.channel_deleted.type.text": "Text",
    "actionLog.channel_deleted.type.voice": "Sprache",
    "actionLog.discriminator_changed.headline": "Tag ge\u00e4ndert",
    "actionLog.discriminator_changed.name": "Tag ge\u00e4ndert",
    "actionLog.footer.userId": "Benutzer ID",
    "actionLog.kick.headline": "{0} wurde von {1} gekickt",
    "actionLog.kick.name": "Mitglied gekickt",
    "actionLog.kick.reason": "Grund",
    "actionLog.kick.target": "Ziel",
    "actionLog.member_join.headline": "Mitglied beigetreten",
    "actionLog.member_join.name": "Mitglied beigetreten",
    "actionLog.member_leave.headline": "Mitglied verlassen",
    "actionLog.member_leave.name": "Mitglied verlassen",
    "actionLog.message_deleted.channel": "Kanal",
    "actionLog.message_deleted.headline": "Nachricht gel\u00f6scht",
    "actionLog.message_deleted.message": "Nachricht",
    "actionLog.message_deleted.name": "Nachricht gel\u00f6scht",
    "actionLog.message_edit.headline": "Nachricht bearbeitet",
    "actionLog.message_edit.name": "Nachricht bearbeitet",
    "actionLog.message_edit.newMessage": "Neue Nachricht",
    "actionLog.message_edit.oldMessage": "Alte Nachricht",
    "actionLog.mfa_level_change.headline": "MFA Level ge\u00e4ndert",
    "actionLog.mfa_level_change.name": "MFA Level ge\u00e4ndert",
    "actionLog.nickname_changed.headline": "{0}s Nickname wurde von {1} ge\u00e4ndert",
    "actionLog.nickname_changed.name": "Nickname ge\u00e4ndert",
    "actionLog.nickname_changed.newNickname": "Neuer Nickname",
    "actionLog.nickname_changed.oldNickname": "Alter Nickname",
    "actionLog.owner_change.headline": "Server Besitzer ge\u00e4ndert",
    "actionLog.owner_change.name": "Server Besitzer ge\u00e4ndert",
    "actionLog.purge.amount": "Menge",
    "actionLog.purge.channel": "Kanal",
    "actionLog.purge.headline": "Nachrichten gel\u00f6scht",
    "actionLog.purge.name": "Nachrichten gel\u00f6scht",
    "actionLog.reaction_added.emote": "Emote",
    "actionLog.reaction_added.headline": "Reaktion hinzugef\u00fcgt",
    "actionLog.reaction_added.message": "Nachricht",
    "actionLog.reaction_added.name": "Reaktion hinzugef\u00fcgt",
    "actionLog.reaction_added.viewMessage": "Nachricht anzeigen",
    "actionLog.reaction_removed.emote": "Emote",
    "actionLog.reaction_removed.headline": "Reaktion entfernt",
    "actionLog.reaction_removed.message": "Nachricht",
    "actionLog.reaction_removed.name": "Reaktion entfernt",
    "actionLog.reaction_removed.viewMessage": "Nachricht anzeigen",
    "actionLog.reason.noneSpecified": "Es wurde kein Grund angegeben.",
    "actionLog.role_created.headline": "Rolle erstellt",
    "actionLog.role_created.hoisted": "Wird seperat angezeigt?",
    "actionLog.role_created.mentionable": "Kann erw\u00e4hnt werden?",
    "actionLog.role_created.name": "Rolle erstellt",
    "actionLog.role_created.position": "Position",
    "actionLog.role_created.roleNameAndID": "Name und ID",
    "actionLog.role_deleted.headline": "Rolle gel\u00f6scht",
    "actionLog.role_deleted.hoisted": "Wird seperat angezeigt?",
    "actionLog.role_deleted.mentionable": "Kann erw\u00e4hnt werden?",
    "actionLog.role_deleted.name": "Rolle gel\u00f6scht",
    "actionLog.role_deleted.position": "Position",
    "actionLog.role_deleted.roleNameAndID": "Name und ID",
    "actionLog.role_given.headline": "{1} hat {0} eine oder mehrere Rollen gegeben",
    "actionLog.role_given.name": "Rolle erhalten",
    "actionLog.role_given.roles": "Rollen",
    "actionLog.role_taken.headline": "{0} hat {1} eine oder mehrere Rollen weggenommen",
    "actionLog.role_taken.name": "Rolle entfernt",
    "actionLog.role_taken.roles": "Rollen",
    "actionLog.role_updated.headline": "Rolle aktualisiert",
    "actionLog.role_updated.isHoisted": "Wird seperat angezeigt?",
    "actionLog.role_updated.isMentionable": "Kann erw\u00e4hnt werden?",
    "actionLog.role_updated.name": "Rolle aktualisiert",
    "actionLog.role_updated.newColor": "Neue Farbe",
    "actionLog.role_updated.newName": "Neuer Name",
    "actionLog.role_updated.newPosition": "Neue Position",
    "actionLog.role_updated.oldColor": "Alte Farbe",
    "actionLog.role_updated.oldName": "Alte Name",
    "actionLog.role_updated.oldPosition": "Alte Position",
    "actionLog.role_updated.roleNameAndID": "Name und ID",
    "actionLog.role_updated.wasHoisted": "Wurde seperat angezeigt?",
    "actionLog.role_updated.wasMentionable": "Konnte erw\u00e4hnt werden?",
    "actionLog.server_icon_change.headline": "Server Icon ge\u00e4ndert",
    "actionLog.server_icon_change.name": "Server Icon ge\u00e4ndert",
    "actionLog.unban.headline": "{0} wurde von {1} entbannt",
    "actionLog.unban.name": "Mitglied entbannt",
    "actionLog.unban.target": "Ziel",
    "actionLog.username_changed.headline": "Benutzername ge\u00e4ndert",
    "actionLog.username_changed.name": "Benutzername ge\u00e4ndert",
    "actionLog.verification_level_change.headline": "Mitgliedbest\u00e4tigungslevel ge\u00e4ndert",
    "actionLog.verification_level_change.name": "Mitgliedbest\u00e4tigungslevel ge\u00e4ndert",
    "actionLog.voice_channel_join.channel": "Kanal",
    "actionLog.voice_channel_join.channelSize": "Kanalgr\u00f6\u00dfe",
    "actionLog.voice_channel_join.headline": "Sprachkanal beigetreten",
    "actionLog.voice_channel_join.name": "Sprachkanal beigetreten",
    "actionLog.voice_channel_leave.channel": "Kanal",
    "actionLog.voice_channel_leave.channelSize": "Kanalgr\u00f6\u00dfe",
    "actionLog.voice_channel_leave.headline": "Sprachkanal verlassen",
    "actionLog.voice_channel_leave.name": "Sprachkanal verlassen",
    "actionLog.voice_channel_move.headline": "Zu Sprachkanal verschoben",
    "actionLog.voice_channel_move.name": "Zu Sprachkanal verschoben",
    "actionLog.voice_channel_move.newChannel": "Neuer Kanal",
    "actionLog.voice_channel_move.newChannelSize": "Neue Kanalgr\u00f6\u00dfe",
    "actionLog.voice_channel_move.oldChannel": "Alter Kanal",
    "actionLog.voice_channel_move.oldChannelSize": "Alte Kanalgr\u00f6\u00dfe",
    "adminLog.guildJoin": "Server \"{0}\" beigetreten (ID {1}, Besitzer: {2})",
    "adminLog.guildQuit": "Server \"{0}\" verlassen (ID {1}, Besitzer: {2})",
    "booleanName.false": "Nein",
    "booleanName.true": "Ja",
    "chests.plural": "Kisten",
    "chests.singular": "Kiste",
    "cmd.50x2.invalidMode": "Dies ist kein g\u00fcltiger Modus! G\u00fcltige Modi sind **server** und **global**. **server** verwendet dein server-spezifisches Guthaben, w\u00e4hrend **global** dein globales Guthaben verwendet.",
    "cmd.50x2.notEnoughCash": "Du hast nicht genug Bargeld!",
    "cmd.50x2.usage.amount": "Menge",
    "cmd.8ball.questionTooLong": "Tut mir leid, aber die Frage darf maximal 250 Zeichen lang sein.",
    "cmd.8ball.usage.question": "Frage",
    "cmd.addcommand.discord.added": "Ich habe erfolgreich den Befehl `{0}` mit dem Text `{1}` erstellt.",
    "cmd.addcommand.discord.alreadyExists": "Es gibt bereits einen Befehls namens `{0}`.",
    "cmd.addcommand.usage.commandName": "Befehlsname",
    "cmd.addcommand.usage.commandText": "Befehlstext",
    "cmd.anime.endDate": "Enddatum",
    "cmd.anime.episodes": "Episoden",
    "cmd.anime.fetchFailed": "Daten konnten nicht abgerufen werden!",
    "cmd.anime.fetching": "Daten werden abgerufen...",
    "cmd.anime.notFound": "Tut mir leid, aber ich konnte keinen Anime mit diesem Namen finden.",
    "cmd.anime.resultsFound": "Ich habe **{0}** Ergebnisse f\u00fcr **{1}** gefunden. Bitte w\u00e4hle:",
    "cmd.anime.score": "Bewertung",
    "cmd.anime.startDate": "Anfangsdatum",
    "cmd.anime.status": "Status",
    "cmd.anime.synopsis": "Handlung",
    "cmd.anime.type": "Typ",
    "cmd.anime.usage.animeName": "Anime Name",
    "cmd.anime.viewOnKitsu": "Auf Kitsu.io ansehen",
    "cmd.anime.viewOnMAL": "Auf MyAnimeList ansehen",
    "cmd.assignablerole.add.added": "`{0}` ist nun eine selbstbestimmbare Rolle. Mitglieder k\u00f6nnen sich selbst diese Rolle mit dem Befehl `{1}role {0}` geben.",
    "cmd.assignablerole.add.alreadyDefined": "Diese Rolle ist bereits eine selbstbestimmbare Rolle.",
    "cmd.assignablerole.add.cannotInteract": "Du darfst diese Rolle nicht selbst-bestimmbar machen.",
    "cmd.assignablerole.add.info": "Rolle zu selbstbestimmbaren Rollen hinzuf\u00fcgen",
    "cmd.assignablerole.headline": "Selbstbestimmbare Rollen",
    "cmd.assignablerole.list.headline": "Selbstbestimmbare Rollen (zeige max. {0} Rollen, aktuell {1} Rollen bestimmbar)",
    "cmd.assignablerole.list.info": "Listet alle selbstbestimmbaren Rollen auf",
    "cmd.assignablerole.list.noRolesFound": "Es wurden bis jetzt keine selbstbestimmbaren Rollen definiert.",
    "cmd.assignablerole.remove.info": "Rolle von selbstbestimmbaren Rollen entfernen",
    "cmd.assignablerole.remove.notDefinedAsRole": "Diese Rolle ist keine selbstbestimmbare Rolle.",
    "cmd.assignablerole.remove.removed": "`{0}` ist nun keine selbstbestimmbare Rolle mehr.",
    "cmd.autorole.cannotInteract": "Du darfst diese Rolle nicht zur automatisch-vergebenen Rolle machen.",
    "cmd.autorole.cleared": "Die automatisch-vergebene Rolle wurde entfernt.",
    "cmd.autorole.defined": "Die automatisch-vergebene Rolle wurde zu `{0}` ge\u00e4ndert!",
    "cmd.autorole.defined.showOld": "Die automatisch-vergeben Rolle wurde von `{0}` zu `{1}` ge\u00e4ndert!",
    "cmd.autorole.noRoleDefined": "Derzeit ist keine automatisch-vergebene Rolle definiert.",
    "cmd.autorole.parameter.give.info": "(true\/false) Diese Rolle allen Mitgliedern des Servers geben, Bots ausgeschlossen?",
    "cmd.autorole.parameter.give.invalidValue": "Der Paramter `give` muss ein Boolean sein!",
    "cmd.autorole.usage.role": "Rolle",
    "cmd.avatar.showFull": "Klicke f\u00fcr einen direkten Link!",
    "cmd.awoo.single": "{0} macht _awoo_!",
    "cmd.bad.single": "{0} m\u00f6chte bestraft werden!",
    "cmd.bad.tagged": "Pass auf, {1}! {0} m\u00f6chte dich bestrafen!!",
    "cmd.baka.single": "{0} ist ein Dummkopf!",
    "cmd.baka.tagged": "{0} denkt {1} ist ein Dummkopf!",
    "cmd.ban.cannotBanOwner": "Du kannst den Server Besitzer nicht bannen.",
    "cmd.ban.cannotBanSelf": "Du kannst dich nicht selbst bannen.",
    "cmd.ban.cannotBanThatUser": "Du kannst diesen Benutzer nicht bannen!",
    "cmd.ban.cannotBanYoshino": "Warum willst du mich bannen?",
    "cmd.ban.delDays.invalidInteger": "Bitter gib eine g\u00fcltige Zahl f\u00fcr den `delDays` Parameter an.",
    "cmd.ban.delDaysTooLow": "`delDays` muss mindestens 1 betragen.",
    "cmd.ban.error": "Ein Fehler ist aufgetreten. Bitte \u00fcberpr\u00fcfe ob ich genug Rechte f\u00fcr diese Aktion habe.",
    "cmd.ban.noMember": "Dieser Benutzer ist nicht auf diesem Server.",
    "cmd.ban.parameter.delDays.info": "L\u00f6scht die Nachrichten des Nutzers der letzten x Tage",
    "cmd.ban.parameter.reason.info": "Grund f\u00fcrs Bannen",
    "cmd.ban.privateMsg": "Du wurdest vom Server **{0}** gebannt.",
    "cmd.ban.privateMsg.reason": "Du wurdest vom Server **{0}** gebannt.\nGrund: **{1}**",
    "cmd.ban.success": "Eine neue Bannregel wurde erfolgreich erstellt.",
    "cmd.ban.usage.delDays": "Tage",
    "cmd.ban.usage.reason": "Grund",
    "cmd.bigtext.usage.text": "Text",
    "cmd.blush.single": "Wie s\u00fc\u00df, {0} err\u00f6tet!",
    "cmd.blush.tagged": "Wow, {1}! {0} err\u00f6tet wegen dir!",
    "cmd.buychest.done.plural": "Du hast erfolgreich **{0}** Kisten f\u00fcr ${1} gekauft. Du hast noch **${2}** \u00fcbrig.",
    "cmd.buychest.done.singular": "Du hast erfolgreich **{0}** Kiste f\u00fcr ${1} gekauft. Du hast noch **${2}** \u00fcbrig.",
    "cmd.buychest.invalidAmount": "Bitte gib eine Zahl zwischen {0} und {1} ein!",
    "cmd.buychest.notEnoughMoney": "Du hast nicht genug Bargeld um so viele Kisten zu kaufen. Die Kosten betragen **${0}**, jedoch hast du nur **${1}**!",
    "cmd.buychest.usage.amount": "Menge",
    "cmd.chucknorris.fetchFailed": "Konnte keinen zuf\u00e4lligen Chuck Norris Witz abrufen!",
    "cmd.chucknorris.fetching": "Rufe einen zuf\u00e4lligen Chuck Norris Witz ab...",
    "cmd.coinflip.flipped": "Die M\u00fcnze ist auf **{0}** gelandet!",
    "cmd.coinflip.flipping": "Okay! Ich werfe eine M\u00fcnze f\u00fcr dich...",
    "cmd.coinflip.heads": "Kopf",
    "cmd.coinflip.tails": "Zahl",
    "cmd.confused.single": "{0} ist verwirrt...",
    "cmd.confused.tagged": "Oh nein, {1}! Du verwirrst {0}!",
    "cmd.convert.globalTooFull": "Dein globales Guthaben ist zu voll!",
    "cmd.convert.invalidCombination": "Tut mir leid, aber du hast eine ung\u00fcltige Kombination angegeben. Bitte gib zwei verschiedene Werte an.",
    "cmd.convert.invalidFrom": "Ung\u00fcltiger **from** Wert! Dies ist der Modus von dem dein Geld abgezogen wird. G\u00fcltige Werte sind **server** und **global**.",
    "cmd.convert.invalidTo": "Ung\u00fcltiger **to** Wert! Dies ist der Modus zu dem dein Geld transferriert wird. G\u00fcltige Werte sind **server** und **global**.",
    "cmd.convert.notEnoughGlobalMoney": "Du hast nicht genug globales Guthaben!",
    "cmd.convert.notEnoughServerMoney": "Du hast nicht genug server-spezifisches Guthaben!",
    "cmd.convert.serverTooFull": "Dein Server-spezifisches Guthaben ist zu voll!",
    "cmd.convert.transferred.globalToServer": "Du hast erfolgreich **${0}** von deinem globalen Guthaben auf dein Server-spezifisches Guthaben \u00fcbertragen. Du hast nun **${1}** auf deinem Server-spezifischen Guthaben und ${2} auf deinem globalen Guthaben.",
    "cmd.convert.transferred.serverToGlobal": "Du hast erfolgreich **${0}** von deinem server-spezifischen Guthaben auf dein globales Guthaben \u00fcbertragen. Du hast nun ${1} auf deinem Server-spezifischen Guthaben und **${2}** auf deinem globalen Guthaben.",
    "cmd.convert.usage.amount": "Betrag",
    "cmd.convert.usage.from": "Von",
    "cmd.convert.usage.to": "Zu",
    "cmd.cuddle.single": "{0} m\u00f6chte knuddeln!",
    "cmd.cuddle.tagged": "{0} knuddelt mit {1}!",
    "cmd.daily.claimed": "Du hast deine t\u00e4gliche Belohnung von **${0}** abgeholt! Du hast nun **${1}** Bargeld!",
    "cmd.daily.inCooldown": "Du darfst deine t\u00e4gliche Belohnung nur alle 24 Stunden abholen!",
    "cmd.daily.voteInfo": "Wusstest du, dass du alle 12 Stunden einen Extrabonus bekommen kannst, indem du f\u00fcr Yoshino votest?",
    "cmd.dance.single": "{0} tanzt! Schaut euch die Bewegungen an!",
    "cmd.dance.tagged": "{0} und {1} tanzen!",
    "cmd.deletecommand.discord.deleted": "Ich hab erfolgreich den Befehl `{0}` mit dem Text `{1}` gel\u00f6scht.",
    "cmd.deletecommand.discord.notFound": "Es gibt keinen Befehl names `{0}`.",
    "cmd.deletecommand.usage.commandName": "Befehlsname",
    "cmd.deposit.amountTooLow": "Du kannst nicht weniger als $100 einzahlen.",
    "cmd.deposit.cashEmpty": "Du hast derzeit kein Bargeld bei dir.",
    "cmd.deposit.complete": "Du hast erfolgreich **${0}** auf dein Bankkonto eingezahlt. Du hast noch **${1}** Bargeld \u00fcbrig.",
    "cmd.deposit.limitReached": "Du kannst nicht mehr als **$10 Millionen** in deiner Bank haben.",
    "cmd.deposit.usage.amount": "Menge",
    "cmd.door.closed": "Codys T\u00fcr ist gerade **GESCHLOSSEN**.",
    "cmd.door.open": "Codys T\u00fcr ist gerade **OFFEN**.",
    "cmd.emojify.usage.text": "Text",
    "cmd.emotelist.headline": "Emotes ({0} Emotes gefunden)",
    "cmd.emotelist.noEmotesFound": "Es wurden keine Emotes auf diesem Server registriert.",
    "cmd.fakemessage.cantFakeSelf": "Du kannst deine eigenen Nachrichten nicht f\u00e4lschen.",
    "cmd.fakemessage.noMember": "Dieser Benutzer ist kein Mitglied dieses Servers.",
    "cmd.fakemessage.usage.text": "Text",
    "cmd.followage.following": "{0} hat {1} angefangen zu folgen.",
    "cmd.followage.notfollowing": "{0} ist kein Follower!",
    "cmd.followmessage.lookup": "\"{0}\" [verwende {1} clear zum entfernen]",
    "cmd.followmessage.none": "Derzeit gibt es keine Follow-Nachricht auf diesem Kanal.",
    "cmd.followmessage.removed": "Die Follow-Nachricht wurde entfernt.",
    "cmd.followmessage.set": "Die Follow-Nachricht wurde zu \"{0}\" ge\u00e4ndert.",
    "cmd.fortnite.fetching": "Daten werden abgerufen...",
    "cmd.fortnite.headline": "Gesamtstatistiken",
    "cmd.fortnite.invalidPlatform": "Ung\u00fcltige Plattform!",
    "cmd.fortnite.kd": "K\/D Wertung",
    "cmd.fortnite.kills": "Kills",
    "cmd.fortnite.killsPerMin": "Kills\/Minute",
    "cmd.fortnite.matchesPlayed": "Gespielte Spiele",
    "cmd.fortnite.playtime": "Spielzeit",
    "cmd.fortnite.rateLimited": "Limit erreicht! Bitte warte etwas bevor du diesen Befehl erneut verwendest.",
    "cmd.fortnite.score": "Wertung",
    "cmd.fortnite.survivalTime": "\u00f8 \u00dcberlebenszeit",
    "cmd.fortnite.text": "Fortnite Statistiken f\u00fcr **{0}** auf **{1}**",
    "cmd.fortnite.top12s": "Top 12 Platzierungen",
    "cmd.fortnite.top25s": "Top 25 Platzierungen",
    "cmd.fortnite.top3s": "Top 3 Platzierungen",
    "cmd.fortnite.top5s": "Top 5 Platzierungen",
    "cmd.fortnite.top6s": "Top 6 Platzierungen",
    "cmd.fortnite.usage.platform": "Plattform",
    "cmd.fortnite.usage.username": "Epic Games Nutzername",
    "cmd.fortnite.winPercentage": "Siege %",
    "cmd.fortnite.wins": "Siege",
    "cmd.giveexp.amountUnspecified": "Der Parameter `amount` muss gegeben sein.",
    "cmd.giveexp.belowMinimum": "`amount` muss mindestens 1 betragen.",
    "cmd.giveexp.invalidInteger": "`amount` muss eine g\u00fcltige Zahl sein.",
    "cmd.giveexp.levelingDisabled": "Level wurden auf diesem Server deaktiviert.",
    "cmd.giveexp.mustNotBeBot": "Das Ziel darf kein Bot sein.",
    "cmd.giveexp.nobodyMentioned": "Bitte erw\u00e4hne den Zielnutzer.",
    "cmd.giveexp.success": "Die EXP wurden vergeben.",
    "cmd.google.headlineText": "Gefundene Ergebnisse f\u00fcr {0} ({1}):",
    "cmd.google.noResultsFound": "F\u00fcr diese Suchanfrage konnten keine Ergebnisse gefunden werden.",
    "cmd.google.usage.query": "Suchanfrage",
    "cmd.help.aliases": "Aliase",
    "cmd.help.availableParameters": "Verf\u00fcgbare Parameter",
    "cmd.help.availableVariables": "Verf\u00fcgbare Variablen",
    "cmd.help.chat": "Chat",
    "cmd.help.commandHelp": "Benutze `{0}help <Befehl-Name>` um weitere Informationen zu einem Befehl zu bekommen (z.B. `{0}help joinmessage`).",
    "cmd.help.commandNotFound": "Ups! Dieser Befehl konnte nicht gefunden werden.",
    "cmd.help.commands": "Befehle",
    "cmd.help.currency": "W\u00e4hrung",
    "cmd.help.custom": "Eigene",
    "cmd.help.description": "Beschreibung",
    "cmd.help.fun": "Spa\u00df",
    "cmd.help.guild": "Server",
    "cmd.help.images": "Bilder",
    "cmd.help.introduction": "Hallo! Mein Name ist Yoshino!",
    "cmd.help.introduction.text": "Hier hast du eine List der Befehle, die ich kenne! Klicke [hier](https:\/\/yoshino.gigadrivegroup.com\/commands) f\u00fcr eine detailliertere Liste.\n",
    "cmd.help.links": "Weiteres n\u00fctzliches Zeug",
    "cmd.help.links.donate": "Spenden",
    "cmd.help.links.permissions": "Rechte Hilfe",
    "cmd.help.links.supportServer": "Support Discord Server",
    "cmd.help.links.website": "Info Webseite",
    "cmd.help.music": "Musik",
    "cmd.help.prefix.alternative": "Alternativ, kann auch **{0}yoshi** als Pr\u00e4fix verwendet werden.\n(z.B. **{0}yoshihelp** statt {0}help)",
    "cmd.help.prefix.change": "Das Pr\u00e4fix ist auch durch den `{0}prefix` Befehl ver\u00e4nderbar.",
    "cmd.help.prefix.example": "Beispiel: **{0}avatar**",
    "cmd.help.prefix.info": "Alle Befehle werden mit einem **{0}** Pr\u00e4fix verwendet.",
    "cmd.help.util": "N\u00fctzliches",
    "cmd.hug.single": "{0} m\u00f6chte umarmt werden!",
    "cmd.hug.tagged": "{0} umarmt {1}!",
    "cmd.idk.single": "{0} zuckt mit den Schultern \u00af\\_(\u30c4)_\/\u00af",
    "cmd.idk.tagged": "{0} zuckt {1} mit den Schultern zu! \u00af\\_(\u30c4)_\/\u00af",
    "cmd.info.creator": "Ersteller",
    "cmd.info.instanceType": "Instanz-Typ",
    "cmd.info.latency": "Latenz",
    "cmd.info.library": "Bibliothek",
    "cmd.info.runningMusicBots": "Laufende Musikinstanzen",
    "cmd.info.servers": "Server",
    "cmd.info.shard": "Shard",
    "cmd.info.uptime": "Betriebszeit",
    "cmd.info.users": "Benutzer",
    "cmd.info.version": "Version",
    "cmd.info.website": "Webseite",
    "cmd.insult.single": "{0} f\u00fchlt sich beleidigt...",
    "cmd.insult.tagged": "{0} beleidigt {1}!",
    "cmd.inventory.headline.common": "Gew\u00f6hnliche Gegenst\u00e4nde von {0}",
    "cmd.inventory.headline.epic": "Epische Gegenst\u00e4nde von {0}",
    "cmd.inventory.headline.legendary": "Legend\u00e4re Gegenst\u00e4nde von {0}",
    "cmd.inventory.headline.mythic": "Mythische Gegenst\u00e4nde von {0}",
    "cmd.inventory.headline.none": "Sonstige Gegenst\u00e4nde von {0}",
    "cmd.inventory.headline.rare": "Seltene Gegenst\u00e4nde von {0}",
    "cmd.inventory.noItemsFound": "Dieser Nutzer hat keine Gegenst\u00e4nde in dieser Kategorie.",
    "cmd.inventory.sendingInDM": "Alles klar! Ich schicke dir das Inventar von {0} in einer privaten Nachricht!",
    "cmd.invite.click": "Klicke hier",
    "cmd.invite.headline": "Yoshino einladen",
    "cmd.invite.invHeadline": "Einladen",
    "cmd.invite.supportHeadline": "Support-Server",
    "cmd.invite.text": "Du ben\u00f6tigst das `Administrator` Recht um Yoshino zu einem Server einzuladen.",
    "cmd.joinmessage.cleared": "Ich habe die Beitrittsnachricht dieses Servers geleert!",
    "cmd.joinmessage.cleared.showOld": "Ich habe die Beitrittsnachricht dieses Servers geleert (zuvor: `{0}`)!",
    "cmd.joinmessage.furtherHelp": "Bitte verwende `{0} clear` um die Beitrittsnachricht zu leeren.",
    "cmd.joinmessage.parameter.user": "Name des beitretenden Nutzers",
    "cmd.joinmessage.parameter.userMention": "Name des beitretenden Nutzers als Erw\u00e4hnung",
    "cmd.joinmessage.set": "Ich habe die Beitrittsnachricht dieses Servers zu `{0}` ge\u00e4ndert!",
    "cmd.joinmessage.set.showOld": "Ich habe die Beitrittsnachricht dieses Servers von `{0}` zu `{1}` ge\u00e4ndert!",
    "cmd.joinmessage.usage.message": "Nachricht",
    "cmd.kick.cannotKickOwner": "Du kannst den Server Besitzer nicht kicken.",
    "cmd.kick.cannotKickSelf": "Du kannst dich nicht selbst kicken.",
    "cmd.kick.cannotKickThatUser": "Du kannst diesen Benutzer nicht kicken!",
    "cmd.kick.cannotKickYoshino": "Warum willst du mich kicken?",
    "cmd.kick.error": "Ein Fehler ist aufgetreten. Bitte \u00fcberpr\u00fcfe ob ich genug Rechte f\u00fcr diese Aktion habe.",
    "cmd.kick.noMember": "Dieser Benutzer ist nicht auf diesem Server.",
    "cmd.kick.parameter.reason.info": "Grund",
    "cmd.kick.privateMsg": "Du wurdest vom Server **{0}** geworfen.",
    "cmd.kick.privateMsg.reason": "Du wurdest vom Server **{0}** geworfen.\nGrund: **{1}**.",
    "cmd.kick.success": "Der Nutzer wurde erfolgreich gekickt.",
    "cmd.kick.usage.reason": "Grund",
    "cmd.language.languageChanged": "Die Sprache wurde zu {0} ge\u00e4ndert!",
    "cmd.leaderboard.empty": "Die Rangliste wurde noch nicht berechnet, bitte versuch es sp\u00e4ter erneut!",
    "cmd.leaderboard.headline": "Rangliste f\u00fcr **{0}**",
    "cmd.leaderboard.levelingDisabled": "Level wurden auf diesem Server deaktiviert.",
    "cmd.leave.leaving": "Ich verlasse nun diesen Kanal. Um mich wieder hinzuzuf\u00fcgen, besuche meine Webseite.",
    "cmd.lewd.single": "{0} ist unanst\u00e4ndig!",
    "cmd.lewd.tagged": "{0} glaubt, dass {1} VIEL zu unanst\u00e4ndig ist!",
    "cmd.lick.single": "{0} leckt sich selbst ab. Man muss sauber bleiben!",
    "cmd.lick.tagged": "{0} leckt {1} ab!",
    "cmd.manga.chapters": "Kapitel",
    "cmd.manga.endDate": "Enddatum",
    "cmd.manga.fetchFailed": "Daten konnten nicht abgerufen werden!",
    "cmd.manga.fetching": "Daten werden abgerufen...",
    "cmd.manga.notFound": "Tut mir leid, aber ich konnte keinen Manga mit diesem Namen finden.",
    "cmd.manga.score": "Bewertung",
    "cmd.manga.startDate": "Anfangsdatum",
    "cmd.manga.status": "Status",
    "cmd.manga.synopsis": "Handlung",
    "cmd.manga.type": "Typ",
    "cmd.manga.usage.mangaName": "Maga Name",
    "cmd.manga.viewOnMAL": "Auf MyAnimeList ansehen",
    "cmd.manga.volumes": "B\u00e4nde",
    "cmd.modlogchannel.channelNotFound": "Dieser Textkanal konnte nicht gefunden werden.",
    "cmd.modlogchannel.cleared": "Der Moderationslog-Kanal wurde entfernt.",
    "cmd.modlogchannel.set": "Ich habe den Moderationslog-Kanal zu `{0}` ge\u00e4ndert!",
    "cmd.modlogchannel.set.showOld": "Ich habe den Moderationslog-Kanal von `{0}` zu `{1}` ge\u00e4ndert!",
    "cmd.modlogchannel.usage.channel": "Textkanal",
    "cmd.movie.director": "Regisseur",
    "cmd.movie.fetchFailed": "Daten konnten nicht abgerufen werden!",
    "cmd.movie.fetching": "Daten werden abgerufen...",
    "cmd.movie.imdbRating": "IMDb Wertung",
    "cmd.movie.notFound": "Tut mir leid, aber ich konnte keinen Film mit diesem Namen finden.",
    "cmd.movie.released": "Ver\u00f6ffentlicht",
    "cmd.movie.resultsFound": "Ich habe **{0}** Ergebnisse zu **{1}** gefunden. Bitte w\u00e4hle:",
    "cmd.movie.runtime": "Dauer",
    "cmd.movie.runtime.display": "{0} Minuten",
    "cmd.movie.synopsis": "Zusammenfassung",
    "cmd.movie.usage.movieName": "Filmname",
    "cmd.movie.viewOnSimkl": "Auf Simkl.com ansehen",
    "cmd.music.addingPlaylist": "Okay! Ich f\u00fcge eine ganze Menge Lieder zur Warteschlange hinzu!\nDu kannst die Warteschlange mit `{0}queue` \u00fcberpr\u00fcfen.",
    "cmd.music.addingTrack": "Okay! Ich f\u00fcge `{0}` zur Warteschlange hinzu!\nDu kannst die Warteschlange mit `{1}queue` \u00fcberpr\u00fcfen.",
    "cmd.music.clear.info": "Leert die Warteschlange.",
    "cmd.music.cleared": "Die Warteschlange wurde geleert.",
    "cmd.music.delete.info": "L\u00f6scht eine gespeicherte Playlist.",
    "cmd.music.join.info": "Bringt Yoshino dazu deinen aktuellen Sprachkanal zu betreten.",
    "cmd.music.join.joined": "Ich hab mich erfolgreich mit `{0}` verbunden!",
    "cmd.music.join.limitReached": "Tut mir leid, aber dieser Kanal scheint voll zu sein!",
    "cmd.music.join.pleaseJoin": "Bitte betrete einen Sprachkanal.",
    "cmd.music.leave.info": "Bringt Yoshino dazu den Sprachkanal zu verlassen, in dem sie sich gerade befindet.",
    "cmd.music.leave.left": "Ich hab den Sprachkanal erfolgreich verlassen.",
    "cmd.music.leave.notInChannel": "Ich bin derzeit mit keinem Sprachkanal verbunden.",
    "cmd.music.load.info": "L\u00e4dt eine gespeicherte Playlist in die Warteschlange.",
    "cmd.music.loop.activated": "Schleifenmodus aktiviert!",
    "cmd.music.loop.deactivated": "Schleifenmodus deaktiviert!",
    "cmd.music.loop.info": "Schaltet den Schleifenmodus an\/aus.",
    "cmd.music.nameUnavaibale": "Du hast bereits eine Playlist mit diesem Namen.",
    "cmd.music.noTracksFound": "Tut mir leid, aber ich konnte nichts dazu finden.",
    "cmd.music.nowplaying.author": "Ersteller",
    "cmd.music.nowplaying.headline": "Aktuelles Lied",
    "cmd.music.nowplaying.info": "Zeigt das aktuelle Lied.",
    "cmd.music.nowplaying.length": "L\u00e4nge",
    "cmd.music.nowplaying.name": "Name",
    "cmd.music.nowplaying.noTrack": "Aktuell l\u00e4uft kein Lied.",
    "cmd.music.play.info": "Spielt ein Lied ab\/f\u00fcgt es zur Warteschlange hinzu.",
    "cmd.music.play.joinFirst": "Bitte benutze zuerst `{0}music join` um mich mit einem Sprachkanal zu verbinden.",
    "cmd.music.play.usage.urlOrQuery": "URL oder Suchw\u00f6rter",
    "cmd.music.playlist.queueLimitReached": "Nicht alle Tracks konnten hinzugef\u00fcgt werden, da das Warteschlangenlimit erreicht wurde! Benutze `{0}patreon` um herauszufinden wie du das Warteschlangenlimit erh\u00f6hen kannst.",
    "cmd.music.playlistDeleted": "Die Playlist wurde gel\u00f6scht.",
    "cmd.music.playlistLoaded": "Die Playlist wurde in die aktuelle Warteschlange geladen!",
    "cmd.music.playlistLoading": "Okay, die Playlist **{0}** wird geladen! Das kann eine Weile dauern...",
    "cmd.music.playlistNotFound": "Diese Playlist konnte nicht gefunden werden.",
    "cmd.music.playlists.headline": "Hier sind deine gespeicherten Playlists! Klicke auf eine Playlist f\u00fcr mehr Informationen. Mit dem `{0}playlist load` Befehl kannst du eine Playlist laden.",
    "cmd.music.playlists.info": "Zeigt deine gespeicherten Playlists.",
    "cmd.music.playlists.noPlaylists": "Du hast keine gespeicherten Playlists! Benutze den `{0}playlist save` Befehl um die aktuelle Warteschlange als Playlist zu speichern.",
    "cmd.music.playlists.sending": "Alles klar! Ich schicke dir deine Playlists in einer privaten Nachricht.",
    "cmd.music.queue.commandInfo": "Zeigt die Warteschlange.",
    "cmd.music.queue.currentSong": "Aktueller Song: **{0}** [L\u00e4nge: **{1}**]",
    "cmd.music.queue.currentSong.none": "Aktuell wird kein Lied abgespielt.",
    "cmd.music.queue.currentSong.stream": "Aktueller Song: **{0}**",
    "cmd.music.queue.empty": "Die Warteschlange ist leer.",
    "cmd.music.queue.headline": "Musikbot Warteschlange (zeige max. {0} Lieder, aktuell {1} in der Warteschlange)",
    "cmd.music.queue.info": "Bitte beachte, dass der Musikbot sich derzeit noch in einer Testphase befindet und Fehler auftreten k\u00f6nnen! Au\u00dferdem ist derzeit nur eine Serverregion verf\u00fcgbar. Um die beste Qualit\u00e4t zu genie\u00dfen, \u00e4ndere die Sprachregion deines Servers zu EU Zentral.",
    "cmd.music.queue.nowPlaying": "Aktuelles Lied",
    "cmd.music.queueLimitReached": "Du hast das Warteschlangenlimit erreicht. Benutze `{0}patreon` um herauszufinden wie du das Warteschlangenlimit erh\u00f6hen kannst.",
    "cmd.music.reachedSavedPlaylistsLimit": "Du hast das Playlist-Limit erreicht. Benutze `{0}patreon` um herauszufinden wie du das Playlist-Limit erh\u00f6hen kannst.",
    "cmd.music.remove.info": "Entfernt ein Lied aus der Warteschlange.",
    "cmd.music.remove.removed": "`{0}` wurde von der Warteschlange entfernt.",
    "cmd.music.restart.info": "Wiederholt das aktuelle Lied.",
    "cmd.music.restart.restarting": "Okay! Ich wiederhole `{0}`!",
    "cmd.music.save.created": "Die Playlist wurde gespeichert. Benutze den `{0}playlist load {1}` Befehl um die Playlist zu laden.",
    "cmd.music.save.errorWhileCreating": "Playlist konnte nicht erstellt werden! Bitte beachte, dass es nicht m\u00f6glich ist zwei Playlists den gleichen Namen zu geben.",
    "cmd.music.save.info": "Speichert die aktuelle Warteschlange als Playlist.",
    "cmd.music.save.nameTooLong": "Der angegebene Name ist zu lang.",
    "cmd.music.search": "{0} Suchergebnisse f\u00fcr: **{1}**",
    "cmd.music.shuffle.done": "Die Warteschlange wurde gemischt.",
    "cmd.music.skip.info": "\u00dcberspringt das aktuelle Lied.",
    "cmd.music.skipping": "Lied wird \u00fcbersprungen..",
    "cmd.music.usage.playlistId": "Playlist ID",
    "cmd.music.usage.playlistName": "Playlist Name",
    "cmd.music.volume.info": "\u00c4ndere die Lautst\u00e4rke (Nur f\u00fcr Patrons).",
    "cmd.music.volume.updated": "Die Lautst\u00e4rke wurde zu **{0}** ge\u00e4ndert.",
    "cmd.music.volume.usage.volume": "Lautst\u00e4rke",
    "cmd.nom.single": "{0} isst!",
    "cmd.nom.tagged": "{0} isst mit {1}!",
    "cmd.notificationschannel.cleared": "Der Benachrichtigungs-Kanal wurde entfernt.",
    "cmd.notificationschannel.set": "Ich habe den Benachrichtigungs-Kanal zu `{0}` ge\u00e4ndert!",
    "cmd.notificationschannel.set.showOld": "Ich habe den Benachrichtigungs-Kanal von `{0}` zu `{1}` ge\u00e4ndert!",
    "cmd.nyan.single": "{0} m\u00f6chte ein Catgirl!",
    "cmd.nyan.tagged": "{0} hat dir ein s\u00fc\u00dfes Catgirl geschickt, {1}!",
    "cmd.onlyAvailableToPatron": "Dieser Befehl ist nur f\u00fcr Patrons mit dem Level **{0}** oder h\u00f6her verf\u00fcgbar.\n\n\n\nUm ein h\u00f6heres Patreon Level zu erreichen, besuche <{1}>.",
    "cmd.openchest.invalidAmount": "Bitte gib eine g\u00fcltige Zahl an (zwischen 1 und 10).",
    "cmd.openchest.result.plural": "Ergebnisse",
    "cmd.openchest.result.singular": "Ergebnis",
    "cmd.osu.accuracy": "Genauigkeit",
    "cmd.osu.country": "Land",
    "cmd.osu.countryRanking": "L\u00e4nderrang",
    "cmd.osu.id": "ID",
    "cmd.osu.level": "Level",
    "cmd.osu.name": "Benutzername",
    "cmd.osu.plays": "Spiele",
    "cmd.osu.rankedScore": "Ranked Punkte",
    "cmd.osu.text": "osu! Statistiken f\u00fcr **{0}**",
    "cmd.osu.totalScore": "Gesamte Punkte",
    "cmd.owo.single": "OwO",
    "cmd.owo.tagged": "{1}, OwO was ist das?",
    "cmd.pat.single": "{0} t\u00e4tschelt sich selbst!",
    "cmd.pat.tagged": "{0} t\u00e4tschelt {1}!",
    "cmd.patreon.add.added": "Das Patreon Level dieses Servers wurde aktiviert. Es kann bis zu 5 Minuten dauern bis die \u00c4nderungen aktiv sind.",
    "cmd.patreon.add.info": "Aktiviere ein Patreon Level auf diesem Server",
    "cmd.patreon.add.notAPatron": "Du bist kein Patron. Benutze `{0}patreon` um herauszufinden wie du ein Patron wirst.",
    "cmd.patreon.add.ownerInfo": "Dein Server **{0}** wurde auf das Patreon Level **{1}** heraufgestuft.\n\n\n\nBitte beachte, dass wenn der Nutzer **{2}** den Server wieder verl\u00e4sst, das Patreon Level deaktiviert wird. Um mehr \u00fcber Patreon Level herauszufinden, besuche <{3}>.",
    "cmd.patreon.add.patreonLevelDoesNotAllowUpgrade": "Dein aktuelles Patreon Level erlaubt es dir nicht Server hochzustufen. Besuche <{0}> um auf ein h\u00f6heres Patreon Level zu wechseln.",
    "cmd.patreon.add.patronAlreadyActive": "Auf diesem Server ist bereits ein Patreon Level aktiv.",
    "cmd.patreon.add.reachedMaximum": "Du hast dein Server-Upgrade-Maximum erreicht. Besuche <{0}> um auf ein h\u00f6heres Patreon Level zu wechseln und mehr Server hochzustufen.",
    "cmd.patreon.donateInfo": "Durch das Spenden an meine Patreon-Seite kannst du deine Server auf ein Patreon Level erh\u00f6hen und ein paar extra Vorteile wie eine vergr\u00f6\u00dferte Musikwarteschlange oder bessere Server genie\u00dfen.\n\n\n\nUm mehr zu erfahren besuche: <{0}>",
    "cmd.patreon.list.headline": "Patreon-aktive Server ({0} gefunden)",
    "cmd.patreon.list.info": "Liste alle Server auf, auf denen du ein Patreon Level aktiviert hast",
    "cmd.patreon.list.noPatroningGuilds": "Du hast derzeit kein Patreon Level auf irgendeinem Server aktiv.",
    "cmd.patreon.remove.info": "Deaktiviere ein Patreon Level on this server",
    "cmd.patreon.remove.noPatronActive": "Dieser Server hat derzeit kein Patreon Level aktiv.",
    "cmd.patreon.remove.notAPatron": "Du bist kein Patron. Benutze `{0}patreon` um herauszufinden wie du ein Patron wirst.",
    "cmd.patreon.remove.otherPatron": "Das Patreon Level von einem anderen Benutzer ist derzeit aktiv, deswegen kannst du es nicht deaktivieren.",
    "cmd.patreon.remove.ownerInfo": "Der Benutzer **{0}** hat das Patreon Level auf deinem Server **{1}** deaktiviert.",
    "cmd.patreon.remove.removed": "Das Patreon Level dieses Servers wurde deaktiviert. Es kann bis zu 5 Minuten dauern bis die \u00c4nderungen aktiv sind.",
    "cmd.permissions.allow.info": "Erlaubt ein Recht (ben\u00f6tigt exakt einen Parameter!).",
    "cmd.permissions.changed.channel": "`{0}` wurde zu **{1}** ge\u00e4ndert (Channel `{2}`).",
    "cmd.permissions.changed.role": "`{0}` wurde zu **{1}** ge\u00e4ndert (alle Mitglieder der Rolle `{2}`).",
    "cmd.permissions.changed.server": "`{0}` wurde zu **{1}** ge\u00e4ndert (gesamter Server).",
    "cmd.permissions.default.info": "Setzt ein Recht auf den Standardwert zur\u00fcck (ben\u00f6tigt exakt einen Parameter!).",
    "cmd.permissions.deny.info": "Verbietet ein Recht (ben\u00f6tigt exakt einen Parameter!).",
    "cmd.permissions.headline": "Rechte Hilfe",
    "cmd.permissions.helpInfo": "Falls du irgendwelche Fragen \u00fcber Reche hast, besuche die Hilfe Seite oder meinen Support Server (Links bei **{0}help**).",
    "cmd.permissions.list.info": "Listet alle Rechte auf.",
    "cmd.permissions.parameter.channel.info": "Bezieht sich auf einen bestimmten Kanal (verwendet den aktuellen Kanal, wenn keiner angegeben wurde!)",
    "cmd.permissions.parameter.guild.info": "Bezieht sich auf den gesamten Server",
    "cmd.permissions.parameter.role.info": "Bezieht sich auf eine bestimmte Rolle",
    "cmd.permissions.permissionNotFound": "Dieses Recht konnte nicht gefunden werden! Benutze `{0} list` um eine Liste von Rechten zu erhalten.",
    "cmd.permissions.roleNotFound": "Dieser Rolle konnte nicht gefunden werden! Bitte verwende den **exakten** Rollennamen.",
    "cmd.permissions.show.guild": "Zeige Rechte f\u00fcr Ebene **Guild**.",
    "cmd.permissions.show.headline": "Rechte",
    "cmd.permissions.show.info": "Zeigt Rechte (ben\u00f6tigt exakt einen Parameter!).",
    "cmd.permissions.type.allowed": "ERLAUBT",
    "cmd.permissions.type.allowedDefault": "ERLAUBT (Standard)",
    "cmd.permissions.type.denied": "VERBOTEN",
    "cmd.permissions.type.deniedDefault": "VERBOTEN (Standard)",
    "cmd.ping.latency": "Latenz: `{0}`",
    "cmd.poke.single": "{0} wurde angestupst!",
    "cmd.poke.tagged": "{0} stupst {1} an!",
    "cmd.poll.alreadyActive": "In diesem Textkanal ist bereits eine Umfrage aktiv.",
    "cmd.poll.createdBy": "Umfrage von {0}",
    "cmd.poll.creating": "Okay, ich erstelle eine Umfrage im Kanal {0}!",
    "cmd.poll.footer": "Umfrage endet",
    "cmd.poll.footer.past": "Umfrage endete",
    "cmd.poll.invalidQuestionAnswerString": "Bitte gib eine Frage und mindestens 2 Antworten an. Denk daran sie mit `;` zu trennen.",
    "cmd.poll.parameter.channel.info": "Der Kanal in dem die Umfrage stattfinden soll",
    "cmd.poll.parameter.time.info": "L\u00e4nge der Umfrage in Minuten",
    "cmd.poll.pollEndedHeadline": "UMFRAGE BEENDET!",
    "cmd.poll.pollHeadline": "UMFRAGE",
    "cmd.poll.possibleAnswers": "M\u00f6gliche Ergebnisse",
    "cmd.poll.questionTooLong": "Die angegebene Frage ist zu lang.",
    "cmd.poll.result": "Ergebnis",
    "cmd.poll.time.invalidInteger": "Bitter gib eine g\u00fcltige Zahl f\u00fcr den `time` Parameter an.",
    "cmd.poll.usage.questionAnswerString": "Frage;Antwort 1;Antwort 2;(...)",
    "cmd.poll.votes.plural": "Stimmen",
    "cmd.poll.votes.singular": "Stimme",
    "cmd.pout.single": "{0} schmollt!",
    "cmd.pout.tagged": "{0} schmollt {1} an, ich frage mich warum?",
    "cmd.prefix.discord.changed": "Das Befehlspr\u00e4fix wurde zu `{0}` ge\u00e4ndert!",
    "cmd.prefix.discord.info": "Das aktuelle Befehlspr\u00e4fix ist `{0}`.\nDu kannst dieses Pr\u00e4fix mit `{0}prefix <Neus Pr\u00e4fix>` \u00e4ndern.\n\nAlternativ kannst du `!yoshi` als Pr\u00e4fix verwenden.",
    "cmd.pubg.invalidPlatformRegion": "`{0}` ist keine g\u00fcltige Plattform-Region Kombination.",
    "cmd.pubg.invalidUsername": "Ung\u00fcltiger Nutzername\/ID",
    "cmd.pubg.playerNotFound": "Dieser Spieler konnte nicht gefunden werden.\nBitte stell sicher, dass du den Benutzernamen richtig geschrieben hast (achte auf Gro\u00df- und kleinschreibung!).",
    "cmd.pubg.rateLimited": "Limit erreicht! Bitte warte etwas bevor du diesen Befehl erneut verwendest.",
    "cmd.pubg.usage.platform": "Plattform",
    "cmd.pubg.usage.region": "Region",
    "cmd.pubg.usage.username": "PUBG Nutzername",
    "cmd.purge.finished.plural": "Ich habe erfolgreich {0} Nachrichten entfernt!",
    "cmd.purge.finished.singular": "Ich habe erfolgreich {0} Nachricht entfernt!",
    "cmd.purge.minMax": "Bitte gib eine Zahl zwischen {0} und {1} ein.",
    "cmd.purge.started": "Okay! Ich l\u00f6sche jetzt die Nachrichten. Das kann eine Weile dauern...",
    "cmd.purge.usage.amount": "Anzahl",
    "cmd.quitmessage.cleared": "Ich habe die Verlassensnachricht dieses Servers geleert!",
    "cmd.quitmessage.cleared.showOld": "Ich habe die Verlassensnachricht dieses Servers geleert (zuvor: `{0}`)!",
    "cmd.quitmessage.furtherHelp": "Bitte verwende `{0} clear` um die Verlassensnachricht zu leeren.",
    "cmd.quitmessage.set": "Ich habe die Verlassensnachricht dieses Servers zu `{0}` ge\u00e4ndert!",
    "cmd.quitmessage.set.showOld": "Ich habe die Verlassensnachricht dieses Servers von `{0}` zu `{1}` ge\u00e4ndert!",
    "cmd.quitmessage.usage.message": "Nachricht",
    "cmd.raffle.alreadyParticipating": "Du nimmst bereits am aktuellen Gewinnspiel teil.",
    "cmd.raffle.ended.creatorInfo.noWinners": "Das Gewinnspiel, das du im Chat von {0} erstellt hast ist nun vorbei, jedoch konnten keine Gewinner ermittelt werden...",
    "cmd.raffle.ended.creatorInfo.winners.multiple": "Das Gewinnspiel, das du im Chat von {0} erstellt hast ist nun vorbei. Die Gewinner waren {1}.",
    "cmd.raffle.ended.creatorInfo.winners.single": "Das Gewinnspiel, das du im Chat von {0} erstellt hast ist nun vorbei und {1} hat gewonnen.",
    "cmd.raffle.ended.noWinners": "Das Gewinnspiel ist vorbei, aber es konnten keine Gewinner ermittelt werden...",
    "cmd.raffle.ended.winners.multiple": "{0} haben das Gewinnspiel gewonnen! Herzlichen Gl\u00fcckwunsch!",
    "cmd.raffle.ended.winners.single": "{0} hat das Gewinnspiel gewonnen! Herzlichen Gl\u00fcckwunsch!",
    "cmd.raffle.noActiveRaffle": "Aktuell l\u00e4uft kein Gewinnspiel in diesem Chat.",
    "cmd.raffle.noActiveRaffle.howToStart": "Aktuell ist kein Gewinnspiel in diesem Chat aktiv. Benutze {0}startraffle um ein Gewinnspiel zu starten.",
    "cmd.raffle.nowParticipating": "Du nimmst nun am aktuellen Gewinnspiel teil! Viel Gl\u00fcck!",
    "cmd.rl.fetching": "Daten werden abgerufen...",
    "cmd.rl.invalidPlatform": "`{0}` ist keine g\u00fcltige Plattform!",
    "cmd.rl.playerNotFound": "Dieser Spieler konnte nicht gefunden werden.",
    "cmd.rl.usage.platform": "Plattform",
    "cmd.rl.usage.username": "Steam ID\/Steam URL\/XBOX Tag\/PSN Nutzername",
    "cmd.rocketleague.text": "Rocket League Statistiken f\u00fcr **{0}** auf **{1}**",
    "cmd.role.given": "Du hast die Rolle `{0}` erhalten.",
    "cmd.role.taken": "Dir wurde die Rolle `{0}` weggenommen.",
    "cmd.rps.invalidPick": "Tut mir leid aber ich verstehe nicht was du gew\u00e4hlt hast.",
    "cmd.rps.paper": "Papier",
    "cmd.rps.result.lose": "\nDeine Wahl: **{0}**\nMeine Wahl: **{1}**\n\nDu hast **VERLOREN**! Viel Gl\u00fcck beim n\u00e4chsten Mal!",
    "cmd.rps.result.tie": "\nDeine Wahl: **{0}**\nMeine Wahl: **{1}**\n\nEs ist ein **UNENTSCHIEDEN**!",
    "cmd.rps.result.win": "\nDeine Wahl: **{0}**\nMeine Wahl: **{1}**\n\nDu hast **GEWONNEN**! Congrats!",
    "cmd.rps.rock": "Stein",
    "cmd.rps.scissors": "Schere",
    "cmd.seek.invalidTimestamp": "Bitte gib einen g\u00fcltigen Zeitstempel an.",
    "cmd.seek.notSeekable": "Im aktuellen Lied kann nicht gesprungen werden.",
    "cmd.seek.seeking": "Okay, ich springe zu **{0}**.",
    "cmd.seek.usage.timestamp": "Zeitstempel",
    "cmd.serverinfo.categories": "Kategorien",
    "cmd.serverinfo.channels": "Kan\u00e4le",
    "cmd.serverinfo.created": "Erstellt",
    "cmd.serverinfo.id": "ID",
    "cmd.serverinfo.members": "Mitglieder",
    "cmd.serverinfo.members.bots": "Bots",
    "cmd.serverinfo.members.humans": "Menschen",
    "cmd.serverinfo.owner": "Besitzer",
    "cmd.serverinfo.patron": "Patron",
    "cmd.serverinfo.region": "Region",
    "cmd.serverinfo.roles": "Rollen",
    "cmd.slap.single": "Es scheint, dass {0} sich selbst schl\u00e4gt...",
    "cmd.slap.tagged": "Wow! {0} hat {1} geschlagen!",
    "cmd.sleepy.single": "{0} scheint gleich einzuschlafen...",
    "cmd.sleepy.tagged": "{0} und {1} schneinen schl\u00e4frig zu sein!",
    "cmd.smug.single": "{0} ist selbstgef\u00e4llig!",
    "cmd.smug.tagged": "Sieh, {1}! {0} ist selbstgef\u00e4llig!",
    "cmd.stare.single": "{0} starrt...",
    "cmd.stare.tagged": "{0} starrt {1} an!",
    "cmd.startraffle.alreadyRaffleActive": "Es l\u00e4uft bereits ein Gewinnspiel in diesem Chat.",
    "cmd.startraffle.invalidTime": "Bitte gib f\u00fcr die Dauer des Gewinnspiels eine Zahl zwischen {0} und {1} an.",
    "cmd.startraffle.invalidWinners": "Bitte gib f\u00fcr die Anzahl der Gewinner des Gewinnspiels eine Zahl zwischen {0} und {1} an.",
    "cmd.startraffle.started": "Ich habe ein Gewinnspiel in diesem Chat gestartet, das {0} Minuten laufen wird und {1} Gewinner haben wird.",
    "cmd.startraffle.usage.time": "Zeit in Minuten",
    "cmd.startraffle.usage.winners": "Anzahl der Gewinner",
    "cmd.submessage.lookup": "\"{0}\" [verwende {1} clear zum entfernen]",
    "cmd.submessage.none": "Derzeit gibt es keine Abo-Nachricht auf diesem Kanal.",
    "cmd.submessage.removed": "Die Abo-Nachricht wurde entfernt.",
    "cmd.submessage.set": "Die Abo-Nachricht wurde zu \"{0}\" ge\u00e4ndert.",
    "cmd.sumfuk.single": "{0} will bissjen seks!",
    "cmd.sumfuk.tagged": "{0} will wissen, ob du ein bissjen seks willst, {1}!",
    "cmd.thumbsup.single": "{0} denkt, dass seine\/ihre Idee toll ist...",
    "cmd.thumbsup.tagged": "Hey, {1}! {0} denkt, dass deine Idee toll ist!",
    "cmd.togglecommand.discord.disabled": "{0} ist jetzt **deaktiviert**.",
    "cmd.togglecommand.discord.enabled": "{0} ist jetzt **aktiviert**.",
    "cmd.togglecommand.mayNotBeToggled": "Dieser Befehl kann nicht umgeschaltet werden. Besuche https:\/\/yoshino.gigadrivegroup.com\/commands um eine Liste umschaltbarer Befehle zu sehen.",
    "cmd.togglecommand.usage.commandName": "Befehlsname",
    "cmd.toggleleveling.disabled": "Level wurden deaktiviert! Nutzer k\u00f6nnen nun keine Erfahrungspunkte mehr sammeln.",
    "cmd.toggleleveling.enabled": "Level wurden aktiviert! Nutzer k\u00f6nnen nun wieder Erfahrungspunkte sammeln.",
    "cmd.topvoters.headline": "Besuche <https:\/\/discordbots.org\/bot\/Yoshino\/vote> um f\u00fcr Yoshino zu voten.",
    "cmd.topvoters.votes.plural": "Votes",
    "cmd.topvoters.votes.singular": "Vote",
    "cmd.triggered.single": "{0} ist getriggered!",
    "cmd.triggered.tagged": "Oh nein, {1}! {0} ist wegen dir getriggered!",
    "cmd.uptime.live": "{0} hat {1} angefangen zu streamen!",
    "cmd.uptime.offline": "{0} ist derzeit offline!",
    "cmd.urban.author": "Autor",
    "cmd.urban.definition": "Definition",
    "cmd.urban.example": "Beispiel",
    "cmd.urban.fetching": "Daten werden abgerufen...",
    "cmd.urban.headline": ":book: Ich habe **{0}** Ergebnisse f\u00fcr **{1}** gefunden.",
    "cmd.urban.rating": "Bewertung",
    "cmd.urban.usage.query": "Suchwort",
    "cmd.userinfo.bank": "Bank",
    "cmd.userinfo.cash": "Bargeld",
    "cmd.userinfo.cashGlobal": "Guthaben (Global)",
    "cmd.userinfo.cashServer": "Guthaben (Dieser server)",
    "cmd.userinfo.id": "ID",
    "cmd.userinfo.joined.discord": "Beigetreten (Discord)",
    "cmd.userinfo.joined.thisServer": "Beigetreten (Dieser Server)",
    "cmd.userinfo.levelHeadline": "Level & EXP",
    "cmd.userinfo.nickname": "Spitzname",
    "cmd.userinfo.noMember": "Tut mir leid, aber {0} ist kein Mitglied dieses Servers.",
    "cmd.userinfo.roles": "Rollen",
    "cmd.userinfo.status": "Status",
    "cmd.waa.single": "{0} ist traurig... :(",
    "cmd.waa.tagged": "Sie nur, {1}! Du hast {0} traurig gemacht. :(",
    "cmd.wasted.single": "{0} wurde **ZERST\u00d6RT**!",
    "cmd.wasted.tagged": "{1} wurde von {0} **ZERST\u00d6RT**!",
    "cmd.withdraw.amountTooLow": "Du kannst nicht weniger als $100 abheben.",
    "cmd.withdraw.bankEmpty": "Dein Bankkonto ist leer.",
    "cmd.withdraw.complete": "Du hast erfolgreich **${0}** von deinem Bankkonto abgehoben. Du hast noch **${1}** auf deinem Bankkonto \u00fcbrig.",
    "cmd.withdraw.limitReached": "Du kannst nicht mehr als **$10 Millionen** Bargeld haben.",
    "cmd.withdraw.usage.amount": "Menge",
    "commandDescription.50x2": "Wette 50x2, wenn du eine Zahl h\u00f6her als 50 rollst, wird dein Betrag verdoppelt, andernfalls verlierst du deinen Betrag!",
    "commandDescription.8ball": "Beantwortet eine Ja\/Nein Frage.",
    "commandDescription.addcommand": "F\u00fcgt einen ausf\u00fchrbaren Text-Befehl zum aktuellen Kanal oder Server hinzu.",
    "commandDescription.anime": "Suche auf Kitsu.io nach einem Anime.",
    "commandDescription.assignablerole": "Richte selbstbestimmbare Rollen ein.",
    "commandDescription.autorole": "Definiere eine Rolle die automatisch allen neuen Mitgliedern des Servers gegeben wird.",
    "commandDescription.avatar": "Zeigt den Avatar eines Benutzers.",
    "commandDescription.awoo": "Zeigt ein \"awoo\" Anime Reaktionsbild.",
    "commandDescription.bad": "Zeigt ein \"bad\" Anime Reaktionsbild.",
    "commandDescription.baka": "Zeigt eine \"baka\" Anime-Raktion.",
    "commandDescription.ban": "Verbannt einen Benutzer permanent vom Server.",
    "commandDescription.bigtext": "Konvertiert einen Text in einen Text mit gro\u00dfen Emoji Buchstaben.",
    "commandDescription.blush": "Zeigt ein \"blush\" Anime Reaktionsbild.",
    "commandDescription.buychest": "Kaufe Kisten f\u00fcr Bargeld.",
    "commandDescription.cat": "Zeigt ein zuf\u00e4lliges Katzenbild.",
    "commandDescription.chucknorris": "Postet einen zuf\u00e4lligen Chuck Norris Witz.",
    "commandDescription.clear": "Leert die Warteschlange",
    "commandDescription.coffee": "Zeigt ein zuf\u00e4lliges Bild von Kaffee.",
    "commandDescription.coinflip": "Wirft eine M\u00fcnze, die entweder auf Kopf oder Zahl landet.",
    "commandDescription.commands": "Zeigt einen Link zu einer Befehlsliste f\u00fcr den aktuellen Kanal.",
    "commandDescription.confused": "Zeigt ein \"confused\" Anime Reaktionsbild.",
    "commandDescription.convert": "Bewege Geld zwischen deinem server-spezifischen- und deinem globalen Guthaben.",
    "commandDescription.cuddle": "Zeigt ein \"cuddle\" Anime Reaktionsbild.",
    "commandDescription.daily": "Sammle deine t\u00e4gliche Belohnung ein.",
    "commandDescription.dance": "Zeigt ein \"dance\" Anime Reaktionsbild.",
    "commandDescription.deletecommand": "L\u00f6scht einen ausf\u00fchrbaren Text-Befehl vom aktuellen Kanal oder Server.",
    "commandDescription.deposit": "Zahle Geld auf dein Bankkonto ein.",
    "commandDescription.dog": "Zeigt ein zuf\u00e4lliges Hundebild.",
    "commandDescription.door": "Pr\u00fcfe ob codingnekos T\u00fcr offen ist.",
    "commandDescription.emojify": "Wandelt Text in dazugeh\u00f6rige Emojis um.",
    "commandDescription.emotes": "Zeigt die Emotes die auf dem aktuellen Server regstriert sind.",
    "commandDescription.fakemessage": "Zeigt eine Nachricht als w\u00e4re sie von einem anderen Benutzer verfasst worden.",
    "commandDescription.followage": "Zeigt wie lange ein Benutzer dem Kanal folgt.",
    "commandDescription.fortnite": "Zeigt Fortnite Statistiken.",
    "commandDescription.google": "Durchsuche das Internet mit Google.",
    "commandDescription.help": "Zeigt eine Befehlsliste.",
    "commandDescription.hentai": "Zeigt ein Hentai Bild.",
    "commandDescription.hug": "Zeigt ein \"hug\" Anime Reaktionsbild.",
    "commandDescription.idk": "Zeigt ein \"idk\" Anime Reaktionsbild.",
    "commandDescription.info": "Zeigt Informationen \u00fcber Yoshino.",
    "commandDescription.insult": "Zeigt ein \"insult\" Anime Reaktionsbild.",
    "commandDescription.inventory": "Betrachte dein Gegenstandsinventar (oder das von jemand anderem).",
    "commandDescription.invite": "Sendet einen Einladungslink mit dem Yoshino einem Server beitreten kann und einen Link f\u00fcr Yoshinos Support-Server.",
    "commandDescription.kick": "Wirft einen Nutzer vom Server.",
    "commandDescription.kotori": "Zeigt ein zuf\u00e4lliges Bild von Kotori aus Date A Live.",
    "commandDescription.kurumi": "Zeigt ein zuf\u00e4lliges Bild von Kurumi aus Date A Live.",
    "commandDescription.language": "\u00c4ndere die Sprache, die Yoshino benutzen soll.",
    "commandDescription.leaderboard": "Zeigt die besten 200 Mitglieder des Servers, geordnet nach ihrem Level.",
    "commandDescription.lenny": "Postet ein Lenny Gesicht.",
    "commandDescription.lennyd": "Postet ein Lenny Gesicht, aber l\u00f6scht deine Nachricht.",
    "commandDescription.lewd": "Zeigt ein \"lewd\" Anime Reaktionsbild.",
    "commandDescription.lick": "Zeigt ein \"lick\" Anime Reaktionsbild.",
    "commandDescription.loop": "Schaltet den Schleifenmodus an\/aus",
    "commandDescription.mana": "Zeigt ein zuf\u00e4lliges Bild von Mana aus Date A Live.",
    "commandDescription.manga": "Suche auf Kitsu.io nach einem Manga.",
    "commandDescription.meme": "Zeigt ein zuf\u00e4lliges Meme.",
    "commandDescription.miku": "Zeigt ein zuf\u00e4lliges Bild von Miku aus Date A Live.",
    "commandDescription.movie": "Zeigt Informationen zu einem Film.",
    "commandDescription.music": "Verwalte Yoshinos Musikbot.",
    "commandDescription.natsumi": "Zeigt ein zuf\u00e4lliges Bild von Natsumi aus Date A Live.",
    "commandDescription.nom": "Zeigt ein \"nom\" Anime Reaktionsbild.",
    "commandDescription.nowplaying": "Zeigt das aktuelle Lied",
    "commandDescription.nyan": "Zeigt ein \"nyan\" Anime Reaktionsbild.",
    "commandDescription.oof": "Zeigt ein zuf\u00e4lliges \"oof\" Bild.",
    "commandDescription.openchest": "\u00d6ffne eine Kiste.",
    "commandDescription.origami": "Zeigt ein zuf\u00e4lliges Bild von Origami aus Date A Live.",
    "commandDescription.osu": "\u00dcberpr\u00fcfe die osu! Statistiken eines Nutzers.",
    "commandDescription.owo": "Zeigt ein \"owo\" Anime Reaktionsbild.",
    "commandDescription.pat": "Zeigt ein \"pat\" Anime Reaktionsbild.",
    "commandDescription.patreon": "Verwalte dein Patreon-Level.",
    "commandDescription.permissions": "Verwalte Rechte f\u00fcr den ganzen Server, einen Kanal oder eine Rolle.",
    "commandDescription.ping": "Zeigt die Latenz in Millisekunden.",
    "commandDescription.play": "Spielt ein Lied ab\/f\u00fcgt es zur Warteschlange hinzu",
    "commandDescription.playlist": "Verwalte deine gespeicherten Playlists",
    "commandDescription.poke": "Zeigt ein \"poke\" Anime Reaktionsbild.",
    "commandDescription.poll": "Starte eine Umfrage.",
    "commandDescription.pout": "Zeigt ein \"pout\" Anime Reaktionsbild.",
    "commandDescription.prefix": "\u00c4ndere Yoshinos Befehlspr\u00e4fix.",
    "commandDescription.pubg": "Zeigt deine oder die Statistiken eines anderen Spielers in PlayerUnknown's Battlegrounds.",
    "commandDescription.purge": "L\u00f6sche die letzten x Nachrichten im aktuellen Kanal.",
    "commandDescription.queue": "Zeigt die Warteschlange",
    "commandDescription.reconnect": "Bring Yoshino dazu sich mit dem aktuellen Sprachkanal (wieder) zu verbinden.",
    "commandDescription.remove": "Entfernt ein Lied aus der Warteschlange",
    "commandDescription.restart": "Wiederholt das aktuelle Lied",
    "commandDescription.rocketleague": "Zeigt Rocket League Statistiken.",
    "commandDescription.role": "Gibt oder nimmt dir eine Rolle.",
    "commandDescription.rps": "Spiel Schere-Stein-Papier mit Yoshino.",
    "commandDescription.seek": "Springe zu einem bestimmten Zeitstempel im aktuellen Lied.",
    "commandDescription.serverinfo": "Zeigt Informationen \u00fcber den aktuellen Server.",
    "commandDescription.setjoinmessage": "Setzt die Beitrittsnachricht f\u00fcr den aktuellen Server.",
    "commandDescription.setmodlogchannel": "Setzt den Kanal, in dem die Moderationslogs gepostet werden sollen.",
    "commandDescription.setnotificationschannel": "Setzt den Kanal, in dem die Beitritts- und Verlassensnachrichten gepostet werden sollen.",
    "commandDescription.setquitmessage": "Setzt die Verlassensnachricht f\u00fcr den aktuellen Server.",
    "commandDescription.shuffle": "Mische die aktuelle Musikwarteschlange (hat keine Auswirkungen auf das aktuelle Lied).",
    "commandDescription.skip": "\u00dcberspringt das aktuelle Lied",
    "commandDescription.slap": "Zeigt ein \"slap\" Anime Reaktionsbild.",
    "commandDescription.sleepy": "Zeigt ein \"sleepy\" Anime Reaktionsbild.",
    "commandDescription.smug": "Zeigt ein \"smug\" Anime Reaktionsbild.",
    "commandDescription.stare": "Zeigt ein \"stare\" Anime Reaktionsbild.",
    "commandDescription.stop": "Beendet den Musikbot",
    "commandDescription.sumfuk": "Zeigt ein \"sumfuk\" Anime Reaktionsbild.",
    "commandDescription.tableflip": "Wirf einen Tisch um.",
    "commandDescription.thighs": "Zeigt Anime-Schenkel.",
    "commandDescription.thumbsup": "Zeigt ein \"thumbsup\" Anime Reaktionsbild.",
    "commandDescription.togglecommand": "Aktiviert oder deaktiviert einen bestimmten Befehl (nicht alle Befehle k\u00f6nnen umgeschaltet werden).",
    "commandDescription.toggleLeveling": "Aktiviere oder Deaktiviere Level auf dem Server.",
    "commandDescription.tohka": "Zeigt ein zuf\u00e4lliges Bild von Tohka aus Date A Live.",
    "commandDescription.topvoters": "Zeigt die Top-Voter f\u00fcr Yoshino.",
    "commandDescription.triggered": "Zeigt ein \"triggered\" Anime Reaktionsbild.",
    "commandDescription.uptime": "Zeigt wie lange der aktuelle Stream l\u00e4uft.",
    "commandDescription.urban": "Schlage eine Definition auf urbandictionary.com nach.",
    "commandDescription.userinfo": "Zeigt Informationen \u00fcber einen bestimmten Benutzer.",
    "commandDescription.volume": "\u00c4ndere die Lautst\u00e4rke (Nur f\u00fcr Patrons)",
    "commandDescription.waa": "Zeigt ein \"waa\" Anime Reaktionsbild.",
    "commandDescription.wasted": "Zeigt ein \"wasted\" Anime Reaktionsbild.",
    "commandDescription.withdraw": "Hebe Geld von deinem Bankkonto ab.",
    "commandDescription.yamai": "Zeigt ein zuf\u00e4lliges Bild von den Yamai Schwestern aus Date A Live.",
    "commandDescription.yoshino": "Zeigt ein zuf\u00e4lliges Bild von Yoshino aus Date A Live.",
    "discord.commandInCooldown": "Bitte warte etwas bevor du diesen Befehl erneut ausf\u00fchrst, ich bin etwas ersch\u00f6pft!",
    "discord.commandRequiresNSFWChanenl": "Dieser Befehl darf nur in NSFW-markierten Kan\u00e4len ausgef\u00fchrt werden. Wenn du diesen Kanal gerade erst erstellt hast, gehe in die Kanaleinstellungen und dr\u00fccke Speichern!",
    "discord.disabledChangelogs": "Du erh\u00e4lst nun keine Nachrichten zu neuen Versionen mehr. Um diese wieder zu aktivieren, schreibe mich mit **!togglechangelogs** an.",
    "discord.enabledChangelogs": "Du erh\u00e4lst nun wieder Nachrichten zu neuen Versionen, Um diese zu deaktivieren, schreibe mich mit **!togglechangelogs** an.",
    "discord.gameStatus.listening": "H\u00f6rt",
    "discord.gameStatus.playing": "Spielt",
    "discord.gameStatus.streaming": "Streamt",
    "discord.gameStatus.watching": "Schaut",
    "discord.itemRarity.common.name": "Gew\u00f6hnlich",
    "discord.itemRarity.epic.name": "Episch",
    "discord.itemRarity.legendary.name": "Legend\u00e4r",
    "discord.itemRarity.mythic.name": "Mythisch",
    "discord.itemRarity.none.name": "Sonstiges",
    "discord.itemRarity.rare.name": "Selten",
    "discord.joinInfo.description": "Ich hoffe ich kann f\u00fcr dich von gro\u00dfem Nutzen sein! Um eine Liste meiner Befehle zu bekommen, benutze **{0}help**. Wenn du Hilfe beim Einrcihten brauchst oder Probleme auftreten, besuche meine [Webseite](https:\/\/yoshino.gigadrivegroup.com) oder meinen [Support Server](https:\/\/yoshino.gigadrivegroup.com\/community)\n\nAu\u00dferdem, falls ich dir gefalle, bitte denke dar\u00fcber nach mich auf [Patreon zu unterst\u00fctzen]({1}), damit ich weiter laufen kann!",
    "discord.joinInfo.title": "Hallo! Mein Name ist Yoshino! Vielen Dank f\u00fcr's Einladen!",
    "discord.missingEmbedPermission": "Ups, anscheinend fehlt mir das `Links einbinden` Recht, also kann ich nicht weitermachen.",
    "discord.missingPermission": "Oh nein! Es scheint, dass dir das `{0}` Recht fehlt!",
    "discord.noNotificationsChannelDefined": "Pass auf! Ich wei\u00df noch nicht wo ich die Beitritts-\/Verlassensnachrichten hinschicken soll. Bitte definiere einen Kanal mit `{0}setnotificationschannel`",
    "discord.onlineStatus.dnd": "Besch\u00e4ftigt",
    "discord.onlineStatus.idle": "Abwesend",
    "discord.onlineStatus.offline": "Offline",
    "discord.onlineStatus.online": "Online",
    "discord.onlyOwnerMayExecute": "Oh nein! Es scheint, dass nur der Server Besitzer diesen Befehl ausf\u00fchren kann!",
    "discord.permission.addReactions": "Reaktionen hinzuf\u00fcgen",
    "discord.permission.administrator": "Administrator",
    "discord.permission.attachFiles": "Dateien anh\u00e4ngen",
    "discord.permission.banMembers": "Mitglieder bannen",
    "discord.permission.changeNickname": "Nickname \u00e4ndern",
    "discord.permission.connect": "Verbinden",
    "discord.permission.createInstantInvite": "Soforteinladung erstellen",
    "discord.permission.deafenMembers": "Mitglieder taub schalten",
    "discord.permission.embedLinks": "Links einbinden",
    "discord.permission.kickMembers": "Mitglieder kicken",
    "discord.permission.manageChannels": "Kan\u00e4le verwalten",
    "discord.permission.manageEmojis": "Emojis verwalten",
    "discord.permission.manageMessages": "Nachrichten verwalten",
    "discord.permission.manageNicknames": "Nicknamen verwalten",
    "discord.permission.manageRoles": "Rollen verwalten",
    "discord.permission.manageServer": "Server verwalten",
    "discord.permission.manageWebhooks": "WebHooks verwalten",
    "discord.permission.mentionEveryone": "Alle erw\u00e4hnen",
    "discord.permission.moveMembers": "Mitglieder verschieben",
    "discord.permission.muteMembers": "Mitglieder stumm schalten",
    "discord.permission.readHistory": "Nachrichtenverlauf lesen",
    "discord.permission.readTextChannelsSeeVoiceChannels": "Text-Kan\u00e4le lesen & Sprach-Kan\u00e4le einsehen",
    "discord.permission.sendMessages": "Nachrichten versenden",
    "discord.permission.sendTTSMessages": "Verschicke Text-zu-Sprache-Nachrichten",
    "discord.permission.speak": "Sprechen",
    "discord.permission.useExternalEmojis": "Benutzerdefinierte Emojis verwenden",
    "discord.permission.useVoiceActivity": "Sprachaktivierung verwenden",
    "discord.permission.viewAuditLogs": "Audit-Log anzeigen",
    "discord.roleNameOrID": "Rollenname oder ID",
    "discord.roleNotFound": "Diese Rolle konnte nicht gefunden werden.",
    "discord.usageInfo.mention": "Tut mir leid, aber du hast diesen Befehl falsch verwendet! Die korrekte Verwendung ist: `{0}`",
    "discord.usageInfo.noMention": "Die korrekte Verwendung ist: `{0}`",
    "discord.yoshinoCantInteract": "Tut mir leid, aber der Server erlaubt es mir nicht so mit diesem Nutzer zu interagieren!",
    "discord.yoshinoMissingPermission": "Oh nein! Es scheint, dass der Server mir nicht erlaubt das zu tun. Bitte sag einem Administrator, dass ich das `{0}` Recht brauche.",
    "errorOccurred": "Ein Fehler ist aufgetreten.",
    "errorOccurred.text": "Ein Fehler ist aufgetreten: {0}",
    "imageCommand.noImageFound": "Es tut mir leid aber f\u00fcr diese Suche konnte ich keine Ergebnisse finden.",
    "invalidInteger": "Bitte verwende eine g\u00fcltige Zahl.",
    "levelUp.description": "Herzlichen Gl\u00fcckwunsch, {0}! Du hast Level {1} erreicht!\n\nBenutze {2}profile f\u00fcr mehr Informationen.",
    "levelUp.headline": "Level Up!",
    "levelUp.reward": "Belohnung",
    "modLog.amount": "Anzahl",
    "modLog.ban.headline": "Nutzer vom Server verbannt",
    "modLog.channel": "Kanal",
    "modLog.kick.headline": "Nutzer vom Server geworfen",
    "modLog.moderator": "Moderator",
    "modLog.purge.headline": "Nachrichten geleert",
    "modLog.reason": "Grund",
    "modLog.target": "Ziel",
    "modLog.unban.headline": "Verbannung von Server-Mitglied aufgehoben",
    "nameList.lastSeperator": "und",
    "twitch.antispam.bannedwordsfilter.announcementMessage": "Du hast ein verbotenes Wort verwendet",
    "twitch.antispam.excessivecapsfilter.announcementMessage": "Bitte verwende weniger Caps Buchstaben",
    "twitch.antispam.excessiveemotesfilter.announcementMessage": "Du verwendest zu viele Emotes",
    "twitch.antispam.excessivesymbolsfilter.announcementMessage": "Bitte verwende nicht so viele Symbole",
    "twitch.antispam.fakepurgesfilter.announcementMessage": "Gef\u00e4lschte L\u00f6schungen sind nicht erlaubt",
    "twitch.antispam.linksfilter.announcementMessage": "Links sind nicht erlaubt",
    "twitch.antispam.longmessagesfilter.announcementMessage": "Deine Nachricht ist viel zu lang",
    "twitch.antispam.punishment.timeout": "Timeout",
    "twitch.antispam.punishment.warning": "Verwarnung",
    "twitch.antispam.spamfilter.announcementMessage": "Bitte spamme nicht",
    "usage.mention": "@Erw\u00e4hnung",
    "yoshino.headline": "Yoshino - ein schneller und zuverl\u00e4ssiger Bot f\u00fcr Twitch, Discord und YouTube!"
}