{
  "employees": [
    {
      "id": 1,
      "first_name": "Sebastian",
      "last_name": "Eschweiler",
      "email": "sebastian@codingthesmartway.com"
    },
    {
      "id": 2,
      "first_name": "Steve",
      "last_name": "Palmer",
      "email": "steve@codingthesmartway.com"
    },
    {
      "id": 3,
      "first_name": "Ann",
      "last_name": "Smith",
      "email": "ann@codingthesmartway.com"
    },
    {
      "first_name": "Leopoldo",
      "last_name": "Ramirez",
      "email": "leo@mail.com",
      "id": 4
    },
    {
      "id": 5
    },
    {
      "id": 6
    },
    {
      "id": 7
    },
    {
      "id": 8
    },
    {
      "id": 9
    },
    {
      "id": 10
    },
    {
      "id": 11
    },
    {
      "first_name": "Forest",
      "last_name": "Gump",
      "email": "forrest@mail.com",
      "id": 12
    },
    {
      "first_name": "Teniente",
      "last_name": "Dan",
      "email": "dan@mail.com",
      "id": 13
    },
    {
      "first_name": "Soldado",
      "last_name": "Buba",
      "email": "buba@mail.com",
      "id": 14
    },
    {
      "first_name": "Forrest",
      "last_name": "Gump JR",
      "email": "jr@mail.com",
      "id": 15
    },
    {
      "first_name": "Jenny",
      "last_name": "Gump",
      "email": "jenny@mail.com",
      "id": 16
    },
    {
      "first_name": "Jenny",
      "last_name": "Gump",
      "email": "jenny@mail.com",
      "id": 17
    },
    {
      "first_name": "Jenny",
      "last_name": "Gump",
      "email": "jenny@mail.com",
      "id": 18
    },
    {
      "first_name": "Jenny",
      "last_name": "Gump",
      "email": "jenny@mail.com",
      "id": 19
    },
    {
      "first_name": "Jenny",
      "last_name": "Gump",
      "email": "jenny@mail.com",
      "id": 20
    },
    {
      "first_name": "Jenny",
      "last_name": "Gump",
      "email": "jenny@mail.com",
      "id": 21
    },
    {
      "first_name": "Tom",
      "last_name": "Hanks",
      "email": "hanks@mail.com",
      "id": 22
    },
    {
      "first_name": "Antonio",
      "last_name": "Banderas",
      "email": "banderas@mail.com",
      "id": 23
    },
    {
      "first_name": "Antonio",
      "last_name": "Banderas",
      "email": "banderas@mail.com",
      "id": 24
    },
    {
      "first_name": "Salma",
      "last_name": "Hayek",
      "email": "salma@mail.com",
      "id": 25
    },
    {
      "first_name": "Salma",
      "last_name": "Hayek",
      "email": "salma@mail.com",
      "id": 26
    },
    {
      "first_name": "Machete",
      "last_name": "Chinga What..",
      "email": "machete@mail.com",
      "id": 27
    },
    {
      "first_name": "Control",
      "last_name": "Machete",
      "email": "machete@mail.com",
      "id": 28
    },
    {
      "first_name": "Control",
      "last_name": "Machete",
      "email": "machete@mail.com",
      "id": 29
    },
    {
      "first_name": "Dany",
      "last_name": "Trejo Machete",
      "email": "dany.machete@mail.com",
      "id": 30
    },
    {
      "first_name": "Dany",
      "last_name": "Trejo Machete II",
      "email": "dany.machete@mail.com",
      "id": 31
    },
    {
      "first_name": "Dany",
      "last_name": "Debito",
      "email": "dany.debito@mail.com",
      "id": 32
    },
    {
      "first_name": "Dany",
      "last_name": "Debito",
      "email": "dany.debito@mail.com",
      "id": 33
    },
    {
      "first_name": "Dany",
      "last_name": "Debito",
      "email": "dany.debito@mail.com",
      "id": 34
    },
    {
      "first_name": "Dany",
      "last_name": "Debito",
      "email": "dany.debito@mail.com",
      "id": 35
    },
    {
      "first_name": "Dany",
      "last_name": "Debito",
      "email": "dany.debito@mail.com",
      "id": 36
    },
    {
      "first_name": "Dany",
      "last_name": "Debito",
      "email": "dany.debito@mail.com",
      "id": 37
    },
    {
      "first_name": "Dany",
      "last_name": "Debito",
      "email": "dany.debito@mail.com",
      "id": 38
    },
    {
      "first_name": "Dany",
      "last_name": "Debito",
      "email": "dany.debito@mail.com",
      "id": 39
    },
    {
      "first_name": "Dany",
      "last_name": "Debito",
      "email": "dany.debito@mail.com",
      "id": 40
    },
    {
      "first_name": "Dany",
      "last_name": "Debito",
      "email": "dany.debito@mail.com",
      "id": 41
    },
    {
      "first_name": "Dany",
      "last_name": "Debito",
      "email": "dany.debito@mail.com",
      "id": 42
    },
    {
      "first_name": "Dany",
      "last_name": "Debito",
      "email": "dany.debito@mail.com",
      "id": 43
    },
    {
      "first_name": "Dany",
      "last_name": "Debito",
      "email": "dany.debito@mail.com",
      "id": 44
    },
    {
      "first_name": "Dany",
      "last_name": "Debito",
      "email": "dany.debito@mail.com",
      "id": 45
    },
    {
      "first_name": "Dany",
      "last_name": "Debito",
      "email": "dany.debito@mail.com",
      "id": 46
    },
    {
      "first_name": "Dany",
      "last_name": "Debito",
      "email": "dany.debito@mail.com",
      "id": 47
    },
    {
      "first_name": "Dany",
      "last_name": "Debito",
      "email": "dany.debito@mail.com",
      "id": 48
    },
    {
      "first_name": "Dany",
      "last_name": "Debito",
      "email": "dany.debito@mail.com",
      "id": 49
    },
    {
      "first_name": "Dany",
      "last_name": "Debito",
      "email": "dany.debito@mail.com",
      "id": 50
    },
    {
      "first_name": "Dany",
      "last_name": "Debito",
      "email": "dany.debito@mail.com",
      "id": 51
    },
    {
      "first_name": "Dany",
      "last_name": "Debito",
      "email": "dany.debito@mail.com",
      "id": 52
    },
    {
      "first_name": "Dany",
      "last_name": "Debito",
      "email": "dany.debito@mail.com",
      "id": 53
    },
    {
      "first_name": "Dany",
      "last_name": "Debito",
      "email": "dany.debito@mail.com",
      "id": 54
    },
    {
      "first_name": "Dany",
      "last_name": "Debito",
      "email": "dany.debito@mail.com",
      "id": 55
    },
    {
      "first_name": "Oliverio",
      "last_name": "Montes",
      "email": "oliverio@gmail.com",
      "id": 56
    },
    {
      "first_name": "Oliverio",
      "last_name": "Montes",
      "email": "oliverio@gmail.com",
      "id": 57
    },
    {
      "first_name": "Oliverio",
      "last_name": "Montes",
      "email": "oliverio@gmail.com",
      "id": 58
    },
    {
      "first_name": "Juan",
      "last_name": "Charrasqueado",
      "email": "charrasqueado@mail.com",
      "id": 59
    },
    {
      "first_name": "Oliverio11",
      "last_name": "Montes",
      "email": "oliverio@gmail.com.mx",
      "id": 60
    },
    {
      "first_name": "Oliverio",
      "last_name": "Girondo",
      "email": "girondo@gmail.com",
      "id": 61
    },
    {
      "first_name": "Juan",
      "last_name": "Charrasqueado II",
      "email": "charrasqueado@gmail.com",
      "id": 62
    },
    {
      "first_name": "Oliverio",
      "last_name": "Montes",
      "email": "charrasqueado@mail.com",
      "id": 63
    },
    {
      "first_name": "Leopoldo",
      "last_name": "Ramirez",
      "email": "leopoldo@gmail.com",
      "id": 64
    }
  ]
}