{
	"info": {
		"_postman_id": "791200c8-c44e-4d76-8a74-6ca10a7ece5b",
		"name": "HealthyFoodTests",
		"schema": "https://schema.getpostman.com/json/collection/v2.1.0/collection.json"
	},
	"item": [
		{
			"name": "Category",
			"item": [
				{
					"name": "Authenticate",
					"event": [
						{
							"listen": "test",
							"script": {
								"id": "43e371a3-88a5-4153-b3f7-988513872bf2",
								"exec": [
									"pm.collectionVariables.set('SessionCookie', pm.response.cookies.get(\"JSESSIONID\"));\r",
									"console.log(pm.response.cookies.get(\"JSESSIONID\"));"
								],
								"type": "text/javascript"
							}
						}
					],
					"protocolProfileBehavior": {
						"disabledSystemHeaders": {
							"content-type": true
						}
					},
					"request": {
						"method": "POST",
						"header": [
							{
								"key": "Content-Type",
								"value": "application/x-www-form-urlencoded",
								"type": "text"
							}
						],
						"body": {
							"mode": "urlencoded",
							"urlencoded": [
								{
									"key": "username",
									"value": "{{Stage10Admin_UserName}}",
									"type": "text"
								},
								{
									"key": "password",
									"value": "{{Stage10Admin_Password}}",
									"type": "text"
								}
							]
						},
						"url": {
							"raw": "{{BaseURL}}/authenticate",
							"host": [
								"{{BaseURL}}"
							],
							"path": [
								"authenticate"
							]
						}
					},
					"response": []
				},
				{
					"name": "Get list of all categories",
					"event": [
						{
							"listen": "test",
							"script": {
								"id": "43fe4aa5-4f34-4583-9429-53384775b6bd",
								"exec": [
									"\r",
									"pm.test(\"Status code is 200\", function () {\r",
									"    pm.response.to.have.status(200);\r",
									"});\r",
									"\r",
									"\r",
									"\r",
									"\r",
									"\r",
									""
								],
								"type": "text/javascript"
							}
						},
						{
							"listen": "prerequest",
							"script": {
								"id": "da2b16e4-83b3-4fc2-95a4-d2250aea1b87",
								"exec": [
									"\r",
									"  \r",
									"\r",
									""
								],
								"type": "text/javascript"
							}
						}
					],
					"protocolProfileBehavior": {
						"disableBodyPruning": true
					},
					"request": {
						"method": "GET",
						"header": [
							{
								"key": "Content-Type",
								"value": "application/json",
								"type": "text"
							},
							{
								"key": "Cookie",
								"value": "d085d9383ab64a97f2bb90b8aa07a953c1603705086",
								"type": "text",
								"disabled": true
							},
							{
								"key": "Cookie",
								"value": "{{Cookie}}",
								"type": "text",
								"disabled": true
							}
						],
						"body": {
							"mode": "formdata",
							"formdata": []
						},
						"url": {
							"raw": "{{BaseURL}}/api/v1/admin/categories",
							"host": [
								"{{BaseURL}}"
							],
							"path": [
								"api",
								"v1",
								"admin",
								"categories"
							]
						}
					},
					"response": []
				},
				{
					"name": "Create new category",
					"event": [
						{
							"listen": "test",
							"script": {
								"id": "3d382a02-8abc-4de1-aa45-7d0b64271a9a",
								"exec": [
									"pm.test(\"Status code is 200\", function () {\r",
									"    pm.response.to.have.status(200);\r",
									"});\r",
									"pm.collectionVariables.set(\"categoryID\",pm.response.json().id)\r",
									"console.log(pm.collectionVariables.get(\"categoryID\"));\r",
									"pm.collectionVariables.set(\"categoryPicture\",pm.response.json().emoji)\r",
									"console.log(pm.collectionVariables.get(\"categoryPicture\"));\r",
									"pm.collectionVariables.set(\"categoryTitle\",pm.response.json().category)\r",
									"console.log(pm.collectionVariables.get(\"categoryTitle\"));\r",
									"\r",
									"pm.test(\"Check name of the new category\", function () {\r",
									"    var jsonData = pm.response.json();\r",
									"    pm.expect(jsonData.category).to.eql(\"Chocolate\");\r",
									"});\r",
									"\r",
									"\r",
									""
								],
								"type": "text/javascript"
							}
						}
					],
					"request": {
						"method": "POST",
						"header": [
							{
								"key": "Cookie",
								"value": "d085d9383ab64a97f2bb90b8aa07a953c1603705086",
								"type": "text",
								"disabled": true
							},
							{
								"key": "Cookie",
								"value": "{{Cookie}}",
								"type": "text",
								"disabled": true
							}
						],
						"body": {
							"mode": "formdata",
							"formdata": [
								{
									"key": "category",
									"type": "file",
									"src": "category.json"
								},
								{
									"key": "file",
									"type": "file",
									"src": "/C:/Users/PetyoandGeri/Postman/chocolate-making-bars.jpg"
								}
							]
						},
						"url": {
							"raw": "{{BaseURL}}/api/v1/admin/categories",
							"host": [
								"{{BaseURL}}"
							],
							"path": [
								"api",
								"v1",
								"admin",
								"categories"
							]
						}
					},
					"response": []
				},
				{
					"name": "Edit new category",
					"event": [
						{
							"listen": "test",
							"script": {
								"id": "80c0a14c-5803-454a-89bb-b235a1a70044",
								"exec": [
									"pm.test(\"Status code is 200\", function () {\r",
									"    pm.response.to.have.status(200);\r",
									"});\r",
									"pm.test(\"Check if name of the new category is changed\", function () {\r",
									"    var jsonData = pm.response.json();\r",
									"    pm.expect(jsonData.category).to.not.eql(\"categoryTitle\");\r",
									"});\r",
									"pm.test(\"Check changed name of the new category\", function () {\r",
									"    var jsonData = pm.response.json();\r",
									"    pm.expect(jsonData.category).to.eql(\"Hot Chocolate\");\r",
									"});\r",
									"pm.test(\"Check if picture of the new category is changed\", function () {\r",
									"    var jsonData = pm.response.json();\r",
									"    pm.expect(jsonData.emoji).to.not.eql(\"categoryPicture\");\r",
									"});\r",
									"var category = pm.collectionVariables.get(\"categoryID\")\r",
									"pm.test(\"check that the edited category has the same ID \", function () {\r",
									"    var jsonData = pm.response.json();\r",
									"    pm.expect(jsonData.id).to.eql(category);\r",
									"});\r",
									""
								],
								"type": "text/javascript"
							}
						}
					],
					"request": {
						"method": "PUT",
						"header": [
							{
								"key": "Cookie",
								"value": "d085d9383ab64a97f2bb90b8aa07a953c1603705086",
								"type": "text",
								"disabled": true
							},
							{
								"key": "cookie",
								"value": "{{Cookie}}",
								"type": "text",
								"disabled": true
							}
						],
						"body": {
							"mode": "formdata",
							"formdata": [
								{
									"key": "category",
									"type": "file",
									"src": "EditCategory.json"
								},
								{
									"key": "file",
									"type": "file",
									"src": "/C:/Users/PetyoandGeri/Postman/Homemade-Hot-Chocolate-4-500x375.jpg"
								}
							]
						},
						"url": {
							"raw": "{{BaseURL}}/api/v1/admin/categories/{{categoryID}}",
							"host": [
								"{{BaseURL}}"
							],
							"path": [
								"api",
								"v1",
								"admin",
								"categories",
								"{{categoryID}}"
							]
						}
					},
					"response": []
				},
				{
					"name": "Get updated list with categories",
					"event": [
						{
							"listen": "test",
							"script": {
								"id": "34e613a7-b947-4304-9b00-654d6a4963ff",
								"exec": [
									"pm.test(\"Status code is 200\", function () {\r",
									"    pm.response.to.have.status(200);\r",
									"});\r",
									" var category = pm.collectionVariables.get(\"categoryID\")\r",
									"pm.test(\"check if the new category is added to the list\", function () {\r",
									"    var jsonData = pm.response.json();\r",
									"    pm.expect(jsonData[3].id).to.eql(category);\r",
									"});"
								],
								"type": "text/javascript"
							}
						}
					],
					"request": {
						"method": "GET",
						"header": [
							{
								"key": "cookie",
								"value": "{{Cookie}}",
								"type": "text",
								"disabled": true
							}
						],
						"url": {
							"raw": "{{BaseURL}}/api/v1/admin/categories",
							"host": [
								"{{BaseURL}}"
							],
							"path": [
								"api",
								"v1",
								"admin",
								"categories"
							]
						}
					},
					"response": []
				},
				{
					"name": "Delete new category",
					"event": [
						{
							"listen": "test",
							"script": {
								"id": "37d1c441-51c6-4537-8700-39532ff8e9ac",
								"exec": [
									"pm.test(\"Status code is 200\", function () {\r",
									"    pm.response.to.have.status(200);\r",
									"});\r",
									""
								],
								"type": "text/javascript"
							}
						}
					],
					"request": {
						"method": "DELETE",
						"header": [
							{
								"key": "Cookie",
								"value": "{{Cookie}}",
								"type": "text",
								"disabled": true
							}
						],
						"url": {
							"raw": "{{BaseURL}}/api/v1/admin/categories/{{categoryID}}",
							"host": [
								"{{BaseURL}}"
							],
							"path": [
								"api",
								"v1",
								"admin",
								"categories",
								"{{categoryID}}"
							]
						}
					},
					"response": []
				}
			],
			"protocolProfileBehavior": {}
		},
		{
			"name": "Posts",
			"item": [
				{
					"name": "Get list with all posts",
					"event": [
						{
							"listen": "test",
							"script": {
								"id": "8699a651-ab1d-4828-b601-d34d2396b408",
								"exec": [
									"pm.test(\"Status code is 200\", function () {\r",
									"    pm.response.to.have.status(200);\r",
									"});\r",
									"\r",
									"\r",
									"\r",
									"\r",
									""
								],
								"type": "text/javascript"
							}
						}
					],
					"protocolProfileBehavior": {
						"disableBodyPruning": true
					},
					"request": {
						"method": "GET",
						"header": [
							{
								"key": "Cookie",
								"value": "d085d9383ab64a97f2bb90b8aa07a953c1603705086",
								"type": "text",
								"disabled": true
							},
							{
								"key": "Cookie",
								"value": "{{Cookie}}",
								"type": "text",
								"disabled": true
							}
						],
						"body": {
							"mode": "raw",
							"raw": "",
							"options": {
								"raw": {
									"language": "json"
								}
							}
						},
						"url": {
							"raw": "{{BaseURL}}/api/v1/admin/posts?category=0&page=0&size=5&sort=&title=",
							"host": [
								"{{BaseURL}}"
							],
							"path": [
								"api",
								"v1",
								"admin",
								"posts"
							],
							"query": [
								{
									"key": "category",
									"value": "0"
								},
								{
									"key": "page",
									"value": "0"
								},
								{
									"key": "size",
									"value": "5"
								},
								{
									"key": "sort",
									"value": ""
								},
								{
									"key": "title",
									"value": ""
								},
								{
									"key": "Email",
									"value": "stage.10team.gergana.svetoslav@gmail.com",
									"disabled": true
								},
								{
									"key": "password",
									"value": "10^ShangriL@!",
									"disabled": true
								}
							]
						}
					},
					"response": []
				},
				{
					"name": "Get post of list of public post",
					"event": [
						{
							"listen": "test",
							"script": {
								"id": "c93e0ce0-c6fe-4e26-84ed-d3930df1197f",
								"exec": [
									"pm.test(\"Status code is 200\", function () {\r",
									"    pm.response.to.have.status(200);\r",
									"});\r",
									"\r",
									"pm.test(\"Check if visibility of the post is public\", function () {\r",
									"    var jsonData = pm.response.json();\r",
									"for (var i = 0; i < jsonData.length; i++) {\r",
									"  pm.expect(jsonData[i].visibility.type).to.eql(\"public\");\r",
									" \r",
									"}\r",
									"});"
								],
								"type": "text/javascript"
							}
						}
					],
					"protocolProfileBehavior": {
						"disableBodyPruning": true
					},
					"request": {
						"method": "GET",
						"header": [
							{
								"key": "Cookie",
								"value": "{{Cookie}}",
								"type": "text",
								"disabled": true
							}
						],
						"body": {
							"mode": "formdata",
							"formdata": []
						},
						"url": {
							"raw": "{{BaseURL}}/api/v1/posts?category=0&page=0&size=5&sort=&title=",
							"host": [
								"{{BaseURL}}"
							],
							"path": [
								"api",
								"v1",
								"posts"
							],
							"query": [
								{
									"key": "category",
									"value": "0"
								},
								{
									"key": "page",
									"value": "0"
								},
								{
									"key": "size",
									"value": "5"
								},
								{
									"key": "sort",
									"value": ""
								},
								{
									"key": "title",
									"value": ""
								}
							]
						}
					},
					"response": []
				},
				{
					"name": "Create new post",
					"event": [
						{
							"listen": "test",
							"script": {
								"id": "30c9d7c6-0be8-4fb8-be02-39a39b865876",
								"exec": [
									"pm.test(\"Status code is 200\", function () {\r",
									"    pm.response.to.have.status(200);\r",
									"});\r",
									"pm.test(\"Successful POST request\", function () {\r",
									"    pm.expect(pm.response.code).to.be.oneOf([200]);\r",
									"});\r",
									"\r",
									"pm.test(\"Check name of the new post\", function () {\r",
									"    var jsonData = pm.response.json();\r",
									"    pm.expect(jsonData.title).to.eql(\"Mulled Wine\");\r",
									"});\r",
									"pm.test(\"Check visibility of the new post\", function () {\r",
									"    var jsonData = pm.response.json();\r",
									"    pm.expect(jsonData.visibility.type).to.eql(\"public\");\r",
									"});\r",
									"pm.test(\"Check title of the new post\", function () {\r",
									"    var jsonData = pm.response.json();\r",
									"    pm.expect(jsonData.title).to.eql(\"Mulled Wine\");\r",
									"});\r",
									"pm.test(\"Check description of the new post\", function () {\r",
									"    var jsonData = pm.response.json();\r",
									"    pm.expect(jsonData.description).to.eql(\"Hot drink for cold nights\");\r",
									"});\r",
									"pm.collectionVariables.set(\"NewPostID\",pm.response.json().id)\r",
									"console.log(pm.collectionVariables.get(\"NewPostID\"));\r",
									"pm.collectionVariables.set(\"NewPostTitle\",pm.response.json().title)\r",
									"console.log(pm.collectionVariables.get(\"NewPostTitle\"));\r",
									"pm.collectionVariables.set(\"NewPostPicture\",pm.response.json().media.picture)\r",
									"console.log(pm.collectionVariables.get(\"NewPostPicture\"));\r",
									"\r",
									"\r",
									""
								],
								"type": "text/javascript"
							}
						}
					],
					"request": {
						"method": "POST",
						"header": [
							{
								"key": "Cookie",
								"type": "text",
								"value": "d085d9383ab64a97f2bb90b8aa07a953c1603705086",
								"disabled": true
							},
							{
								"key": "Cookie",
								"value": "{{Cookie}}",
								"type": "text",
								"disabled": true
							}
						],
						"body": {
							"mode": "formdata",
							"formdata": [
								{
									"key": "post",
									"type": "file",
									"src": "New POST.json"
								},
								{
									"key": "file",
									"type": "file",
									"src": "/C:/Users/PetyoandGeri/Postman/DSC00008-Pinterest-400x400.jpg"
								},
								{
									"key": "",
									"value": "",
									"type": "text"
								}
							]
						},
						"url": {
							"raw": "{{BaseURL}}/api/v1/posts?authenticated=true&credentials=%7B%7D&principal=%7B%7D&details=%7B%7D",
							"host": [
								"{{BaseURL}}"
							],
							"path": [
								"api",
								"v1",
								"posts"
							],
							"query": [
								{
									"key": "authenticated",
									"value": "true"
								},
								{
									"key": "authorities[0].authority",
									"value": "2",
									"disabled": true
								},
								{
									"key": "credentials",
									"value": "%7B%7D"
								},
								{
									"key": "principal",
									"value": "%7B%7D"
								},
								{
									"key": "details",
									"value": "%7B%7D"
								},
								{
									"key": "",
									"value": null,
									"disabled": true
								}
							]
						}
					},
					"response": []
				},
				{
					"name": "Get Post by Id",
					"event": [
						{
							"listen": "test",
							"script": {
								"id": "950a8c82-ba01-473f-a582-99f8b615d5cf",
								"exec": [
									"pm.test(\"Status code is 200\", function () {\r",
									"pm.response.to.have.status(200);\r",
									"});\r",
									"var newPostID = pm.collectionVariables.get(\"NewPostID\")\r",
									"pm.test(\"Check if get new post by id\", function () {\r",
									"    var jsonData = pm.response.json();\r",
									"    pm.expect(jsonData.id).to.eql(newPostID);\r",
									"});\r",
									"\r",
									""
								],
								"type": "text/javascript"
							}
						}
					],
					"request": {
						"method": "GET",
						"header": [
							{
								"key": "Cookie",
								"value": "{{Cookie}}",
								"type": "text",
								"disabled": true
							}
						],
						"url": {
							"raw": "{{BaseURL}}/api/v1/posts/{{NewPostID}}?authenticated=true&credentials=%7B%7D&principal=%7B%7D&details=%7B%7D",
							"host": [
								"{{BaseURL}}"
							],
							"path": [
								"api",
								"v1",
								"posts",
								"{{NewPostID}}"
							],
							"query": [
								{
									"key": "authenticated",
									"value": "true"
								},
								{
									"key": "credentials",
									"value": "%7B%7D"
								},
								{
									"key": "principal",
									"value": "%7B%7D"
								},
								{
									"key": "details",
									"value": "%7B%7D"
								}
							]
						}
					},
					"response": []
				},
				{
					"name": "Edit new post",
					"event": [
						{
							"listen": "test",
							"script": {
								"id": "683ff483-df3a-4cac-8d8b-3bb5a6053258",
								"exec": [
									"pm.test(\"Status code is 200\", function () {\r",
									"    pm.response.to.have.status(200);\r",
									"});\r",
									"pm.test(\"Check if name of the new post is changed\", function () {\r",
									"    var jsonData = pm.response.json();\r",
									"    pm.expect(jsonData.title).to.not.eql(\"NewPostTitle\");\r",
									"});\r",
									"pm.test(\"Check changed name of the new category\", function () {\r",
									"    var jsonData = pm.response.json();\r",
									"    pm.expect(jsonData.title).to.eql(\"Mulled Raspberries Wine\");\r",
									"});\r",
									"var newPostPicture = pm.collectionVariables.get(\"NewPostPicture\")\r",
									"pm.test(\"Check if picture of the new category is changed\", function () {\r",
									"    var jsonData = pm.response.json();\r",
									"    pm.expect(jsonData.media.picture).to.not.eql(newPostPicture);\r",
									"});"
								],
								"type": "text/javascript"
							}
						}
					],
					"request": {
						"method": "PUT",
						"header": [
							{
								"key": "Cookie",
								"value": "{{Cookie}}",
								"type": "text",
								"disabled": true
							}
						],
						"body": {
							"mode": "formdata",
							"formdata": [
								{
									"key": "post",
									"type": "file",
									"src": "Edit New POST.json"
								},
								{
									"key": "file",
									"type": "file",
									"src": "/C:/Users/PetyoandGeri/Postman/greyano-cherveno-vino-800x445.jpg"
								}
							]
						},
						"url": {
							"raw": "{{BaseURL}}/api/v1/posts/{{NewPostID}}?authenticated=true&credentials=%7B%7D&principal=%7B%7D&details=%7B%7D",
							"host": [
								"{{BaseURL}}"
							],
							"path": [
								"api",
								"v1",
								"posts",
								"{{NewPostID}}"
							],
							"query": [
								{
									"key": "authenticated",
									"value": "true"
								},
								{
									"key": "credentials",
									"value": "%7B%7D"
								},
								{
									"key": "principal",
									"value": "%7B%7D"
								},
								{
									"key": "details",
									"value": "%7B%7D"
								}
							]
						},
						"description": "Change name and picture on the new post"
					},
					"response": []
				},
				{
					"name": "Show Post's likes",
					"event": [
						{
							"listen": "test",
							"script": {
								"id": "8b27823c-9a99-42fe-bdad-6d18cf979181",
								"exec": [
									"pm.test(\"Status code is 200\", function () {\r",
									"    pm.response.to.have.status(200);\r",
									"});\r",
									"pm.collectionVariables.set(\"LikeCount\",pm.response.json())\r",
									"console.log(pm.collectionVariables.get(\"LikeCount\"));\r",
									"pm.test(\"Verify that the like on teh  post is 0\", function () {\r",
									"    var jsonData = pm.response.json();\r",
									"    pm.expect(jsonData).to.eql(0);\r",
									"});\r",
									""
								],
								"type": "text/javascript"
							}
						}
					],
					"request": {
						"method": "GET",
						"header": [
							{
								"key": "Cookie",
								"value": "{{Cookie}}",
								"type": "text",
								"disabled": true
							},
							{
								"key": "Cookie",
								"value": "d085d9383ab64a97f2bb90b8aa07a953c1603705086",
								"type": "text",
								"disabled": true
							}
						],
						"url": {
							"raw": "{{BaseURL}}/api/v1/posts/{{NewPostID}}/likes?authenticated=true&credentials=%7B%7D&principal=%7B%7D&details=%7B%7D",
							"host": [
								"{{BaseURL}}"
							],
							"path": [
								"api",
								"v1",
								"posts",
								"{{NewPostID}}",
								"likes"
							],
							"query": [
								{
									"key": "authenticated",
									"value": "true"
								},
								{
									"key": "credentials",
									"value": "%7B%7D"
								},
								{
									"key": "principal",
									"value": "%7B%7D"
								},
								{
									"key": "details",
									"value": "%7B%7D"
								}
							]
						}
					},
					"response": []
				},
				{
					"name": "Like a Post",
					"event": [
						{
							"listen": "test",
							"script": {
								"id": "8ff13bbd-5333-468a-9758-411ecc03def2",
								"exec": [
									"pm.test(\"Status code is 200\", function () {\r",
									"    pm.response.to.have.status(200);\r",
									"});\r",
									"pm.test(\"Like the Post\", function () {\r",
									"    var jsonData = pm.response.json();\r",
									"    pm.expect(jsonData).to.eql(1);\r",
									"});"
								],
								"type": "text/javascript"
							}
						}
					],
					"request": {
						"method": "POST",
						"header": [
							{
								"key": "Cookie",
								"value": "{{Cookie}}",
								"type": "text",
								"disabled": true
							}
						],
						"url": {
							"raw": "{{BaseURL}}/api/v1/posts/{{NewPostID}}/likes?authenticated=true&credentials=%7B%7D&principal=%7B%7D&details=%7B%7D",
							"host": [
								"{{BaseURL}}"
							],
							"path": [
								"api",
								"v1",
								"posts",
								"{{NewPostID}}",
								"likes"
							],
							"query": [
								{
									"key": "authenticated",
									"value": "true"
								},
								{
									"key": "credentials",
									"value": "%7B%7D"
								},
								{
									"key": "principal",
									"value": "%7B%7D"
								},
								{
									"key": "details",
									"value": "%7B%7D"
								}
							]
						}
					},
					"response": []
				},
				{
					"name": "Get all Post' likes",
					"event": [
						{
							"listen": "test",
							"script": {
								"id": "bf867660-f7ca-4c90-842b-3b67cea8ac1a",
								"exec": [
									"pm.test(\"Status code is 200\", function () {\r",
									"    pm.response.to.have.status(200);\r",
									"});\r",
									"\r",
									"pm.test(\"Body is correct\", function () {\r",
									"    pm.response.to.have.body(\"1\");\r",
									"});\r",
									""
								],
								"type": "text/javascript"
							}
						}
					],
					"request": {
						"method": "GET",
						"header": [
							{
								"key": "Cookie",
								"value": "{{Cookie}}",
								"type": "text",
								"disabled": true
							}
						],
						"url": {
							"raw": "{{BaseURL}}/api/v1/posts/{{NewPostID}}/likes?authenticated=true&credentials=%7B%7D&principal=%7B%7D&details=%7B%7D",
							"host": [
								"{{BaseURL}}"
							],
							"path": [
								"api",
								"v1",
								"posts",
								"{{NewPostID}}",
								"likes"
							],
							"query": [
								{
									"key": "authenticated",
									"value": "true"
								},
								{
									"key": "credentials",
									"value": "%7B%7D"
								},
								{
									"key": "principal",
									"value": "%7B%7D"
								},
								{
									"key": "details",
									"value": "%7B%7D"
								}
							]
						}
					},
					"response": []
				},
				{
					"name": "Delete New Post",
					"event": [
						{
							"listen": "test",
							"script": {
								"id": "26848952-30a0-4f32-a528-01a5c872510b",
								"exec": [
									"pm.test(\"Status code is 200\", function () {\r",
									"    pm.response.to.have.status(200);\r",
									"});"
								],
								"type": "text/javascript"
							}
						}
					],
					"request": {
						"method": "DELETE",
						"header": [
							{
								"key": "Cookie",
								"value": "{{Cookie}}",
								"type": "text",
								"disabled": true
							}
						],
						"url": {
							"raw": "{{BaseURL}}/api/v1/posts/{{NewPostID}}?authenticated=true&credentials=%7B%7D&principal=%7B%7D&details=%7B%7D",
							"host": [
								"{{BaseURL}}"
							],
							"path": [
								"api",
								"v1",
								"posts",
								"{{NewPostID}}"
							],
							"query": [
								{
									"key": "authenticated",
									"value": "true"
								},
								{
									"key": "credentials",
									"value": "%7B%7D"
								},
								{
									"key": "principal",
									"value": "%7B%7D"
								},
								{
									"key": "details",
									"value": "%7B%7D"
								}
							]
						}
					},
					"response": []
				},
				{
					"name": "Get List of connected users' posts",
					"event": [
						{
							"listen": "test",
							"script": {
								"id": "01328a13-9d22-4925-b598-48fe4e9889b5",
								"exec": [
									"pm.test(\"Status code is 200\", function () {\r",
									"    pm.response.to.have.status(200);\r",
									"});\r",
									"pm.test(\"Check if vivibility of the connections is public\", function () {\r",
									"    var jsonData = pm.response.json();\r",
									"for (var i = 0; i < jsonData.length; i++) {\r",
									"  pm.expect(jsonData[i].visibility.type).to.eql(\"connections\");\r",
									" \r",
									"}\r",
									"});"
								],
								"type": "text/javascript"
							}
						}
					],
					"request": {
						"method": "GET",
						"header": [
							{
								"key": "Cookie",
								"value": "{{Cookie}}",
								"type": "text",
								"disabled": true
							}
						],
						"url": {
							"raw": "{{BaseURL}}/api/v1/posts/connected?authenticated=true&category=2&credentials=%7B%7D&details=%7B%7D&page=0&principal=%7B%7D&size=5&sort&title",
							"host": [
								"{{BaseURL}}"
							],
							"path": [
								"api",
								"v1",
								"posts",
								"connected"
							],
							"query": [
								{
									"key": "authenticated",
									"value": "true"
								},
								{
									"key": "category",
									"value": "2"
								},
								{
									"key": "credentials",
									"value": "%7B%7D"
								},
								{
									"key": "details",
									"value": "%7B%7D"
								},
								{
									"key": "page",
									"value": "0"
								},
								{
									"key": "principal",
									"value": "%7B%7D"
								},
								{
									"key": "size",
									"value": "5"
								},
								{
									"key": "sort",
									"value": null
								},
								{
									"key": "title",
									"value": null
								}
							]
						}
					},
					"response": []
				},
				{
					"name": "Get list of top 3 posts",
					"event": [
						{
							"listen": "test",
							"script": {
								"id": "16f58874-8697-474a-b7bd-874f261d066e",
								"exec": [
									"pm.test(\"Status code is 200\", function () {\r",
									"    pm.response.to.have.status(200);\r",
									"});"
								],
								"type": "text/javascript"
							}
						}
					],
					"request": {
						"method": "GET",
						"header": [
							{
								"key": "Cookie",
								"value": "{{Cookie}}",
								"type": "text",
								"disabled": true
							}
						],
						"url": {
							"raw": "{{BaseURL}}/api/v1/posts/top",
							"host": [
								"{{BaseURL}}"
							],
							"path": [
								"api",
								"v1",
								"posts",
								"top"
							]
						}
					},
					"response": []
				}
			],
			"protocolProfileBehavior": {}
		},
		{
			"name": "Comments",
			"item": [
				{
					"name": " List of all comments",
					"event": [
						{
							"listen": "test",
							"script": {
								"id": "1d3d3961-0f0c-486b-ba08-14c625c1003e",
								"exec": [
									"pm.test(\"Status code is 200\", function () {\r",
									"    pm.response.to.have.status(200);\r",
									"});"
								],
								"type": "text/javascript"
							}
						}
					],
					"request": {
						"method": "GET",
						"header": [
							{
								"key": "Cookie",
								"value": "{{Cookie}}",
								"type": "text",
								"disabled": true
							}
						],
						"url": {
							"raw": "{{BaseURL}}/api/v1/posts/4/comments",
							"host": [
								"{{BaseURL}}"
							],
							"path": [
								"api",
								"v1",
								"posts",
								"4",
								"comments"
							]
						}
					},
					"response": []
				},
				{
					"name": " Create comment",
					"event": [
						{
							"listen": "test",
							"script": {
								"id": "a7b0218d-018c-4384-94d7-bf9113827cbb",
								"exec": [
									"pm.test(\"Status code is 200\", function () {\r",
									"    pm.response.to.have.status(200);\r",
									"});\r",
									"pm.test(\"check comment content\", function () {\r",
									"    var jsonData = pm.response.json();\r",
									"    pm.expect(jsonData.description).to.eq(\"I like Smoothie\");\r",
									"});\r",
									"pm.collectionVariables.set(\"commentID\",pm.response.json().id)\r",
									"console.log(pm.collectionVariables.get(\"commentID\"));\r",
									"pm.collectionVariables.set(\"NewComment\",pm.response.json().description)\r",
									"console.log(pm.collectionVariables.get(\"NewComment\"));"
								],
								"type": "text/javascript"
							}
						}
					],
					"request": {
						"method": "POST",
						"header": [
							{
								"key": "Cookie",
								"value": "{{Cookie}}",
								"type": "text",
								"disabled": true
							}
						],
						"body": {
							"mode": "raw",
							"raw": "{\r\n    \"comment\":\"I like Smoothie\"\r\n    }",
							"options": {
								"raw": {
									"language": "json"
								}
							}
						},
						"url": {
							"raw": "{{BaseURL}}/api/v1/posts/4/comments",
							"host": [
								"{{BaseURL}}"
							],
							"path": [
								"api",
								"v1",
								"posts",
								"4",
								"comments"
							]
						}
					},
					"response": []
				},
				{
					"name": "Get comment by ID",
					"event": [
						{
							"listen": "test",
							"script": {
								"id": "a31209c9-7ff8-4f64-8283-a7655f86705d",
								"exec": [
									"pm.test(\"Status code is 200\", function () {\r",
									"    pm.response.to.have.status(200);\r",
									"});\r",
									"var newCommentID = pm.collectionVariables.get(\"commentID\")\r",
									"pm.test(\"check comments ID\", function () {\r",
									"    var jsonData = pm.response.json();\r",
									"    pm.expect(jsonData.id).to.eq(newCommentID);\r",
									"});"
								],
								"type": "text/javascript"
							}
						}
					],
					"request": {
						"method": "GET",
						"header": [
							{
								"key": "Cookie",
								"value": "{{Cookie}}",
								"type": "text",
								"disabled": true
							}
						],
						"url": {
							"raw": "{{BaseURL}}/api/v1/comments/{{commentID}}",
							"host": [
								"{{BaseURL}}"
							],
							"path": [
								"api",
								"v1",
								"comments",
								"{{commentID}}"
							]
						}
					},
					"response": []
				},
				{
					"name": "Update comment",
					"event": [
						{
							"listen": "test",
							"script": {
								"id": "77e29377-2c56-4190-8302-4d5ebdc6463f",
								"exec": [
									"pm.test(\"Status code is 200\", function () {\r",
									"    pm.response.to.have.status(200);\r",
									"});\r",
									"pm.test(\"check comments description\", function () {\r",
									"    var jsonData = pm.response.json();\r",
									"    pm.expect(jsonData.description).to.eql(\"I love soup!\");\r",
									"});\r",
									"var newComment = pm.collectionVariables.get(\"NewComment\")\r",
									"pm.test(\"Check if name of the new post is changed\", function () {\r",
									"    var jsonData = pm.response.json();\r",
									"    pm.expect(jsonData.description).to.not.eql(newComment);\r",
									"});"
								],
								"type": "text/javascript"
							}
						}
					],
					"request": {
						"method": "PUT",
						"header": [
							{
								"key": "Cookie",
								"value": "{{Cookie}}",
								"type": "text",
								"disabled": true
							}
						],
						"body": {
							"mode": "raw",
							"raw": "{\r\n    \"comment\": \"I love soup!\"\r\n}",
							"options": {
								"raw": {
									"language": "json"
								}
							}
						},
						"url": {
							"raw": "{{BaseURL}}/api/v1/comments/{{commentID}}?authenticated=true&credentials=%7B%7D&details=%7B%7D&principal=%7B%7D",
							"host": [
								"{{BaseURL}}"
							],
							"path": [
								"api",
								"v1",
								"comments",
								"{{commentID}}"
							],
							"query": [
								{
									"key": "authenticated",
									"value": "true"
								},
								{
									"key": "credentials",
									"value": "%7B%7D"
								},
								{
									"key": "details",
									"value": "%7B%7D"
								},
								{
									"key": "principal",
									"value": "%7B%7D"
								}
							]
						}
					},
					"response": []
				},
				{
					"name": " Show comment`s likes",
					"event": [
						{
							"listen": "test",
							"script": {
								"id": "3cd0f826-6331-4598-a5fa-e81d186c816a",
								"exec": [
									"pm.test(\"Status code is 200\", function () {\r",
									"    pm.response.to.have.status(200);\r",
									"});\r",
									"pm.test(\"check comments ID\", function () {\r",
									"    var jsonData = pm.response.json();\r",
									"    pm.expect(jsonData).to.eq(0);\r",
									"});"
								],
								"type": "text/javascript"
							}
						}
					],
					"request": {
						"method": "GET",
						"header": [
							{
								"key": "Cookie",
								"value": "{{Cookie}}",
								"type": "text",
								"disabled": true
							}
						],
						"url": {
							"raw": "{{BaseURL}}/api/v1/comments/{{commentID}}/likes",
							"host": [
								"{{BaseURL}}"
							],
							"path": [
								"api",
								"v1",
								"comments",
								"{{commentID}}",
								"likes"
							]
						}
					},
					"response": []
				},
				{
					"name": "Like comment",
					"event": [
						{
							"listen": "test",
							"script": {
								"id": "ebd0c436-6627-407c-bbdf-fcab9e0ea229",
								"exec": [
									"pm.test(\"Status code is 200\", function () {\r",
									"    pm.response.to.have.status(200);\r",
									"});\r",
									"pm.test(\"check comments ID\", function () {\r",
									"    var jsonData = pm.response.json();\r",
									"    pm.expect(jsonData).to.eq(1);\r",
									"});"
								],
								"type": "text/javascript"
							}
						}
					],
					"request": {
						"method": "POST",
						"header": [
							{
								"key": "Cookie",
								"value": "{{Cookie}}",
								"type": "text",
								"disabled": true
							}
						],
						"body": {
							"mode": "raw",
							"raw": "",
							"options": {
								"raw": {
									"language": "json"
								}
							}
						},
						"url": {
							"raw": "{{BaseURL}}/api/v1/comments/{{commentID}}/likes",
							"host": [
								"{{BaseURL}}"
							],
							"path": [
								"api",
								"v1",
								"comments",
								"{{commentID}}",
								"likes"
							]
						}
					},
					"response": []
				},
				{
					"name": " List of latest 5 comments",
					"event": [
						{
							"listen": "test",
							"script": {
								"id": "b6cd51a6-8898-47c4-8586-9273ade9e60c",
								"exec": [
									"pm.test(\"Status code is 200\", function () {\r",
									"    pm.response.to.have.status(200);\r",
									"});\r",
									""
								],
								"type": "text/javascript"
							}
						}
					],
					"protocolProfileBehavior": {
						"disableBodyPruning": true
					},
					"request": {
						"method": "GET",
						"header": [
							{
								"key": "Content-Type",
								"value": "",
								"type": "text"
							},
							{
								"key": "Cookie",
								"value": "{{Cookie}}",
								"type": "text",
								"disabled": true
							}
						],
						"body": {
							"mode": "raw",
							"raw": "",
							"options": {
								"raw": {
									"language": "json"
								}
							}
						},
						"url": {
							"raw": "{{BaseURL}}/api/v1/posts/4/latest_comments",
							"host": [
								"{{BaseURL}}"
							],
							"path": [
								"api",
								"v1",
								"posts",
								"4",
								"latest_comments"
							]
						}
					},
					"response": []
				},
				{
					"name": "Delete comment",
					"event": [
						{
							"listen": "test",
							"script": {
								"id": "bcd1173b-af61-4b3d-b54d-916893fad1ff",
								"exec": [
									"pm.test(\"Status code is 200\", function () {\r",
									"    pm.response.to.have.status(200);\r",
									"});\r",
									"pm.test(\"check comments description\", function () {\r",
									"    var jsonData = pm.response.json();\r",
									"    pm.expect(jsonData.description).not.to.eq(\"I love soup!\");\r",
									"});\r",
									"// pm.test(\"Status code is 200\", function () {\r",
									"//     pm.response.to.have.status(404);\r",
									"// });\r",
									"// pm.test(\"Existing response lenght\", function () {​​\r",
									"//     var jsonData = pm.response.json();\r",
									"//     pm.expect(jsonData.lenght).to.eql(0);\r",
									"// });"
								],
								"type": "text/javascript"
							}
						}
					],
					"request": {
						"method": "DELETE",
						"header": [
							{
								"key": "Cookie",
								"value": "{{Cookie}}",
								"type": "text",
								"disabled": true
							}
						],
						"body": {
							"mode": "raw",
							"raw": "{\r\n    \"comment\": \"I love soup!\"\r\n}",
							"options": {
								"raw": {
									"language": "json"
								}
							}
						},
						"url": {
							"raw": "{{BaseURL}}/api/v1/comments/{{commentID}}",
							"host": [
								"{{BaseURL}}"
							],
							"path": [
								"api",
								"v1",
								"comments",
								"{{commentID}}"
							]
						}
					},
					"response": []
				},
				{
					"name": "Ger the Deleted comment ",
					"event": [
						{
							"listen": "test",
							"script": {
								"id": "69abeef6-0115-4eac-8578-6e0726084b28",
								"exec": [
									"pm.test(\"Status code is 404\", function () {\r",
									"    pm.response.to.have.status(404);\r",
									"});\r",
									"pm.test(\"check comments description\", function () {\r",
									"    var jsonData = pm.response.json();\r",
									"    pm.expect(jsonData.description).not.to.eq(\"I love soup!\");\r",
									"});"
								],
								"type": "text/javascript"
							}
						}
					],
					"protocolProfileBehavior": {
						"disableBodyPruning": true
					},
					"request": {
						"method": "GET",
						"header": [
							{
								"key": "Cookie",
								"value": "{{Cookie}}",
								"type": "text",
								"disabled": true
							}
						],
						"body": {
							"mode": "raw",
							"raw": "{\r\n    \"comment\": \"I love soup!\"\r\n}",
							"options": {
								"raw": {
									"language": "json"
								}
							}
						},
						"url": {
							"raw": "{{BaseURL}}/api/v1/comments/{{commentID}}",
							"host": [
								"{{BaseURL}}"
							],
							"path": [
								"api",
								"v1",
								"comments",
								"{{commentID}}"
							]
						}
					},
					"response": []
				}
			],
			"protocolProfileBehavior": {}
		},
		{
			"name": "Users",
			"item": [
				{
					"name": "Get all users",
					"event": [
						{
							"listen": "test",
							"script": {
								"id": "5b6908d3-7dc7-4d54-92f8-7d8766f869ad",
								"exec": [
									"pm.test(\"Status code is 200\", function () {\r",
									"    pm.response.to.have.status(200);\r",
									"});\r",
									""
								],
								"type": "text/javascript"
							}
						}
					],
					"protocolProfileBehavior": {
						"disableBodyPruning": true
					},
					"request": {
						"method": "GET",
						"header": [
							{
								"key": "Content-Type",
								"value": "",
								"type": "text"
							},
							{
								"key": "Cookie",
								"value": "{{Cookie}}",
								"type": "text",
								"disabled": true
							}
						],
						"body": {
							"mode": "raw",
							"raw": "",
							"options": {
								"raw": {
									"language": "json"
								}
							}
						},
						"url": {
							"raw": "{{BaseURL}}/api/v1/users",
							"host": [
								"{{BaseURL}}"
							],
							"path": [
								"api",
								"v1",
								"users"
							]
						}
					},
					"response": []
				},
				{
					"name": "Get user with ID",
					"event": [
						{
							"listen": "test",
							"script": {
								"id": "3823dcec-7bd9-475c-8fce-24fa0373f0e6",
								"exec": [
									"pm.test(\"Status code is 200\", function () {\r",
									"    pm.response.to.have.status(200);\r",
									"});\r",
									"pm.test(\"check list firstName\", function () {\r",
									"    var jsonData = pm.response.json();\r",
									"    pm.expect(jsonData.firstName).to.eql(\"Piny\");\r",
									"});\r",
									"pm.test(\"check list ID\", function () {\r",
									"    var jsonData = pm.response.json();\r",
									"    pm.expect(jsonData.id).to.eq(4);\r",
									"});\r",
									"pm.test(\"check age\", function () {\r",
									"    var jsonData = pm.response.json();\r",
									"    pm.expect(jsonData.age).to.eq(45);\r",
									"});\r",
									"pm.test(\"check description\", function () {\r",
									"    var jsonData = pm.response.json();\r",
									"    pm.expect(jsonData.description).to.eq(\"I love to cook.\");\r",
									"});\r",
									"    pm.test(\"check lastName\", function () {\r",
									"    var jsonData = pm.response.json();\r",
									"    pm.expect(jsonData.lastName).to.eq(\"Ata\");\r",
									"});\r",
									"pm.test(\"check email\", function () {\r",
									"    var jsonData = pm.response.json();\r",
									"    pm.expect(jsonData.email).to.eq(\"pinyata@abv.bg\");\r",
									"});"
								],
								"type": "text/javascript"
							}
						}
					],
					"protocolProfileBehavior": {
						"disableBodyPruning": true
					},
					"request": {
						"method": "GET",
						"header": [
							{
								"key": "Cookie",
								"value": "{{Cookie}}",
								"type": "text",
								"disabled": true
							}
						],
						"body": {
							"mode": "raw",
							"raw": "",
							"options": {
								"raw": {
									"language": "json"
								}
							}
						},
						"url": {
							"raw": "{{BaseURL}}/api/v1/users/4",
							"host": [
								"{{BaseURL}}"
							],
							"path": [
								"api",
								"v1",
								"users",
								"4"
							]
						}
					},
					"response": []
				},
				{
					"name": "Edit user ",
					"event": [
						{
							"listen": "test",
							"script": {
								"id": "6b999b79-c9c2-4fec-842f-930059e2a8b1",
								"exec": [
									"pm.test(\"Status code is 200\", function () {\r",
									"    pm.response.to.have.status(200);\r",
									"});\r",
									"pm.test(\"check age\", function () {\r",
									"    var jsonData = pm.response.json();\r",
									"    pm.expect(jsonData.age).to.eq(45);\r",
									"});\r",
									"pm.test(\"check description\", function () {\r",
									"    var jsonData = pm.response.json();\r",
									"    pm.expect(jsonData.description).to.eq(\"I love to cook.\");\r",
									"});\r",
									"pm.test(\"check firstName\", function () {\r",
									"    var jsonData = pm.response.json();\r",
									"    pm.expect(jsonData.firstName).to.eq(\"Piny\");\r",
									"});\r",
									"pm.test(\"check lastName\", function () {\r",
									"    var jsonData = pm.response.json();\r",
									"    pm.expect(jsonData.lastName).to.eq(\"Ata\");\r",
									"});\r",
									"\r",
									"pm.test(\"check email\", function () {\r",
									"    var jsonData = pm.response.json();\r",
									"    pm.expect(jsonData.email).to.eq(\"pinyata@abv.bg\");\r",
									"});"
								],
								"type": "text/javascript"
							}
						},
						{
							"listen": "prerequest",
							"script": {
								"id": "73f16d83-c359-4e1c-b487-496680b5ff05",
								"exec": [
									""
								],
								"type": "text/javascript"
							}
						}
					],
					"request": {
						"method": "PUT",
						"header": [
							{
								"key": "Cookie",
								"value": "{{Cookie}}",
								"type": "text",
								"disabled": true
							}
						],
						"body": {
							"mode": "formdata",
							"formdata": [
								{
									"key": "user",
									"type": "file",
									"src": "user.json"
								},
								{
									"key": "file",
									"type": "file",
									"src": "/C:/Users/win10user/OneDrive/Pictures/Screenshots/81wnocFvivL._AC_SX425_.jpg"
								},
								{
									"key": "",
									"type": "file",
									"src": []
								}
							],
							"options": {
								"raw": {
									"language": "json"
								}
							}
						},
						"url": {
							"raw": "{{BaseURL}}/api/v1/users/4",
							"host": [
								"{{BaseURL}}"
							],
							"path": [
								"api",
								"v1",
								"users",
								"4"
							]
						}
					},
					"response": []
				},
				{
					"name": "Delete user",
					"event": [
						{
							"listen": "test",
							"script": {
								"id": "4900a4ea-dc49-41f8-8874-5878ed07e010",
								"exec": [
									"pm.test(\"Status code is 200\", function () {\r",
									"    pm.response.to.have.status(200);\r",
									"});"
								],
								"type": "text/javascript"
							}
						}
					],
					"request": {
						"method": "DELETE",
						"header": [
							{
								"key": "Content-Type",
								"value": "",
								"type": "text"
							},
							{
								"key": "Cookie",
								"value": "{{Cookie}}",
								"type": "text",
								"disabled": true
							}
						],
						"body": {
							"mode": "formdata",
							"formdata": []
						},
						"url": {
							"raw": "{{BaseURL}}/api/v1/users/5",
							"host": [
								"{{BaseURL}}"
							],
							"path": [
								"api",
								"v1",
								"users",
								"5"
							]
						}
					},
					"response": []
				},
				{
					"name": "Get the deleted User",
					"event": [
						{
							"listen": "test",
							"script": {
								"id": "a72dd6c0-fe71-47c9-b335-e4257ec7204d",
								"exec": [
									"pm.test(\"Status code is 404\", function () {\r",
									"    pm.response.to.have.status(404);\r",
									"});\r",
									"pm.test(\"check list ID\", function () {\r",
									"    var jsonData = pm.response.json();\r",
									"    pm.expect(jsonData.id).not.to.eq(5);\r",
									"});"
								],
								"type": "text/javascript"
							}
						}
					],
					"request": {
						"method": "GET",
						"header": [],
						"url": {
							"raw": "{{BaseURL}}/api/v1/users/5",
							"host": [
								"{{BaseURL}}"
							],
							"path": [
								"api",
								"v1",
								"users",
								"5"
							]
						}
					},
					"response": []
				}
			],
			"protocolProfileBehavior": {}
		}
	],
	"event": [
		{
			"listen": "prerequest",
			"script": {
				"id": "a2491bbe-64f9-42d3-9a77-08b30cf0785c",
				"type": "text/javascript",
				"exec": [
					""
				]
			}
		},
		{
			"listen": "test",
			"script": {
				"id": "26194ede-73f7-4d4d-b808-946fc426382d",
				"type": "text/javascript",
				"exec": [
					""
				]
			}
		}
	],
	"variable": [
		{
			"id": "1e497dfa-4bd2-414d-837b-0f94b4cd0be6",
			"key": "id",
			"value": "2"
		},
		{
			"id": "b5c45f8f-c075-4e4e-8abf-5cb605dc3197",
			"key": "user",
			"value": "Brusko",
			"disabled": true
		},
		{
			"id": "0f024f5a-abcf-4bf9-905d-23de3ff9fe18",
			"key": "categoryID",
			"value": "5"
		},
		{
			"id": "1ef54b57-23fe-46ad-88d6-7b901fc105ec",
			"key": "NewPostID",
			"value": "14"
		},
		{
			"id": "006a98a5-f973-407c-80d1-6763c9900579",
			"key": "PostID",
			"value": "4"
		},
		{
			"id": "66bdbc5a-3141-44a0-9885-5303370a6586",
			"key": "category",
			"value": ""
		},
		{
			"id": "cd356e10-315a-42a8-afcd-32c68161f56f",
			"key": "categoryIMG",
			"value": ""
		},
		{
			"id": "4be02573-4847-451a-9cd5-fa69c34aa250",
			"key": "categoryTitle",
			"value": ""
		},
		{
			"id": "29daa09a-7f2d-4a7a-bbc1-3100c8820a40",
			"key": "NewPostIMG",
			"value": ""
		},
		{
			"id": "62afd17e-3dee-44c2-a396-c3e0a0bdb4aa",
			"key": "NewPostTitle",
			"value": ""
		},
		{
			"id": "bc5604a9-10c7-40ae-8268-469ebef7fa66",
			"key": "categoryPicture",
			"value": ""
		},
		{
			"id": "094e52d9-6b01-4cd1-b4d9-ec9c772225a2",
			"key": "NewPostPicture",
			"value": ""
		},
		{
			"id": "045c8d80-fba1-4ff7-812e-4f1c39252785",
			"key": "LikeCount",
			"value": null
		},
		{
			"id": "4099d265-fb8d-4961-87c6-13e8f44d7fd1",
			"key": "SessionCookie",
			"value": ""
		},
		{
			"id": "8e70f388-0db8-4e94-b67c-bb737e239a02",
			"key": "Stage10Admin_UserName",
			"value": "stage.10team.gergana.svetoslav@gmail.com"
		},
		{
			"id": "21534033-9088-4ac8-8971-0baa3f268a25",
			"key": "Stage10Admin_Password",
			"value": "10^ShangriL@!"
		},
		{
			"id": "ed6cf881-42c1-4297-9567-7d10a5526e69",
			"key": "commentID",
			"value": ""
		},
		{
			"id": "650567b3-40d8-410f-9d1e-faf90b2c159a",
			"key": "NewComment",
			"value": ""
		}
	],
	"protocolProfileBehavior": {}
}