/home/myrsini/Downloads/8o/oslab/ex3/virtio-crypto-helpcode-20180430/virtio-crypto/guest/virtio_crypto.ko
/home/myrsini/Downloads/8o/oslab/ex3/virtio-crypto-helpcode-20180430/virtio-crypto/guest/crypto-module.o /home/myrsini/Downloads/8o/oslab/ex3/virtio-crypto-helpcode-20180430/virtio-crypto/guest/crypto-chrdev.o

