PRINT_STR MACRO STRING
	PUSH AX
PUSH DX
    MOV DX,OFFSET STRING
    MOV AH,9
    INT 21H         
POP DX 
POP AX  
ENDM

READ MACRO
	MOV AH,8
	INT 21H
ENDM

PRINT MACRO CHAR
PUSH DX
PUSH AX
	MOV DL,CHAR
	MOV AH,2
	INT 21H

POP AX
POP DX
ENDM






PRINT_NUM MACRO CHAR
PUSH DX
PUSH AX
MOV DL, CHAR
ADD DL, 30H
MOV AH,2
INT 21H
POP AX
POP DX
ENDM



