{
  "contractName": "AnyHedge_v0_10",
  "constructorInputs": [
    {
      "name": "mutualRedemptionDataHash",
      "type": "bytes20"
    },
    {
      "name": "payoutDataHash",
      "type": "bytes20"
    },
    {
      "name": "hedgeUnitsXSatsPerBch_HighTrunc",
      "type": "int"
    },
    {
      "name": "payoutSats_LowTrunc",
      "type": "int"
    },
    {
      "name": "highLowDeltaTruncatedZeroes",
      "type": "bytes"
    },
    {
      "name": "lowTruncatedZeroes",
      "type": "bytes"
    },
    {
      "name": "lowLiquidationPrice",
      "type": "int"
    },
    {
      "name": "highLiquidationPrice",
      "type": "int"
    },
    {
      "name": "earliestLiquidationHeight",
      "type": "int"
    },
    {
      "name": "maturityHeight",
      "type": "int"
    }
  ],
  "abi": [
    {
      "name": "mutualRedeem",
      "covenant": false,
      "inputs": [
        {
          "name": "hedgeMutualRedeemPubk",
          "type": "pubkey"
        },
        {
          "name": "longMutualRedeemPubk",
          "type": "pubkey"
        },
        {
          "name": "hedgeMutualRedeemSig",
          "type": "sig"
        },
        {
          "name": "longMutualRedeemSig",
          "type": "sig"
        }
      ]
    },
    {
      "name": "payout",
      "covenant": true,
      "inputs": [
        {
          "name": "hedgeLockScript",
          "type": "bytes"
        },
        {
          "name": "longLockScript",
          "type": "bytes"
        },
        {
          "name": "oraclePubk",
          "type": "pubkey"
        },
        {
          "name": "preimageSig",
          "type": "sig"
        },
        {
          "name": "preimagePubk",
          "type": "pubkey"
        },
        {
          "name": "oracleMsg",
          "type": "bytes50"
        },
        {
          "name": "oracleSig",
          "type": "datasig"
        }
      ]
    }
  ],
  "bytecode": "OP_10 OP_PICK OP_0 OP_NUMEQUAL OP_IF OP_11 OP_PICK OP_13 OP_PICK OP_CAT OP_HASH160 OP_EQUALVERIFY OP_12 OP_ROLL OP_11 OP_ROLL OP_CHECKSIGVERIFY OP_11 OP_ROLL OP_11 OP_ROLL OP_CHECKSIGVERIFY OP_2DROP OP_2DROP OP_2DROP OP_2DROP OP_2DROP OP_1 OP_ELSE OP_10 OP_ROLL OP_1 OP_NUMEQUALVERIFY OP_10 OP_PICK OP_4 OP_SPLIT OP_NIP 20 OP_SPLIT 20 OP_SPLIT OP_NIP 24 OP_SPLIT OP_SIZE 28 OP_SUB OP_SPLIT OP_NIP 20 OP_SPLIT OP_DROP OP_ROT OP_ROT OP_HASH256 OP_EQUALVERIFY OP_ROT OP_12 OP_PICK OP_14 OP_PICK OP_CAT OP_15 OP_PICK OP_CAT OP_HASH160 OP_EQUALVERIFY 11 OP_ROLL 11 OP_PICK OP_15 OP_ROLL OP_CHECKDATASIGVERIFY OP_13 OP_ROLL OP_14 OP_ROLL OP_2DUP OP_SWAP OP_SIZE OP_1SUB OP_SPLIT OP_DROP OP_14 OP_ROLL OP_SHA256 OP_ROT OP_CHECKDATASIGVERIFY OP_CHECKSIGVERIFY OP_12 OP_PICK OP_4 OP_SPLIT OP_NIP OP_DUP 24 OP_SPLIT OP_NIP OP_2 OP_SPLIT OP_DROP OP_BIN2NUM OP_14 OP_ROLL OP_4 OP_SPLIT OP_DROP OP_BIN2NUM OP_ROT OP_4 OP_SPLIT OP_DROP OP_BIN2NUM OP_OVER OP_0 OP_GREATERTHAN OP_VERIFY OP_SWAP OP_10 OP_PICK OP_MIN OP_9 OP_PICK OP_MAX OP_OVER ff64cd1d OP_LESSTHAN OP_VERIFY OP_OVER OP_CHECKLOCKTIMEVERIFY OP_DROP OP_OVER OP_12 OP_ROLL OP_13 OP_PICK OP_1ADD OP_WITHIN OP_VERIFY OP_SWAP OP_11 OP_ROLL OP_LESSTHAN OP_IF OP_DUP OP_9 OP_PICK OP_1ADD OP_11 OP_PICK OP_WITHIN OP_NOT OP_VERIFY OP_ELSE OP_OVER OP_1 OP_NUMEQUALVERIFY OP_ENDIF OP_4 OP_PICK OP_OVER OP_DIV OP_7 OP_PICK OP_SWAP OP_4 OP_NUM2BIN OP_CAT OP_BIN2NUM OP_5 OP_ROLL OP_2 OP_PICK OP_MOD OP_7 OP_ROLL OP_SIZE OP_NIP OP_4 OP_2 OP_PICK OP_SIZE OP_NIP OP_SUB OP_OVER OP_MIN OP_0 OP_OVER OP_NUM2BIN OP_3 OP_ROLL OP_4 OP_NUM2BIN OP_CAT OP_BIN2NUM OP_ROT OP_ROT OP_SUB OP_3 OP_ROLL OP_SWAP OP_SPLIT OP_NIP OP_BIN2NUM OP_DIV OP_ADD OP_4 OP_PICK OP_MIN OP_4 OP_ROLL OP_OVER OP_SUB 2202 OP_8 OP_NUM2BIN OP_8 OP_7 OP_PICK OP_SIZE OP_NIP OP_SUB OP_7 OP_PICK OP_4 OP_ROLL OP_2 OP_PICK OP_NUM2BIN OP_CAT OP_2 OP_PICK OP_OR OP_10 OP_ROLL OP_CAT OP_7 OP_ROLL OP_4 OP_ROLL OP_3 OP_ROLL OP_NUM2BIN OP_CAT OP_ROT OP_OR OP_7 OP_ROLL OP_CAT OP_3 OP_ROLL OP_ROT OP_ROT OP_CAT OP_HASH256 OP_EQUALVERIFY OP_2DROP OP_2DROP OP_1 OP_ENDIF",
  "source": "<Omitted for compactness>",
  "compiler": {
    "name": "cashc",
    "version": "0.5.4"
  },
  "updatedAt": "2020-10-30T12:27:36.590Z"
}
