{
    "cluster": "13",
    "class_label": "Backdoor",
    "confidences": [
        "8.467238649318472e-15",
        "4.896854122193872e-08",
        "0.999993085861206",
        "3.100980094927763e-08",
        "4.970639366774776e-08",
        "5.665528376302964e-12",
        "6.783046956115868e-06",
        "3.982585816686424e-09",
        "5.61684698752174e-10"
    ]
}