{
    "cluster": "1",
    "class_label": "Worms",
    "confidences": [
        "2.276389075076508e-33",
        "9.792365791123307e-15",
        "3.2292213607981735e-12",
        "5.743382214262738e-09",
        "5.3507896780047304e-08",
        "3.722036012732133e-10",
        "2.1454197849379852e-06",
        "3.3001938390953e-06",
        "0.9999945163726807"
    ]
}