{
  "project_info": {
    "project_number": "800303941804",
    "firebase_url": "https://proxima-cities-8122097.firebaseio.com",
    "project_id": "proxima-cities-8122097",
    "storage_bucket": "proxima-cities-8122097.appspot.com"
  },
  "client": [
    {
      "client_info": {
        "mobilesdk_app_id": "1:800303941804:android:4bc0476eec4207f6137709",
        "android_client_info": {
          "package_name": "com.gamevrest.proximaCities"
        }
      },
      "oauth_client": [
        {
          "client_id": "800303941804-lap94d115ahk9ertqj30ojkv044n6ks1.apps.googleusercontent.com",
          "client_type": 3
        }
      ],
      "api_key": [
        {
          "current_key": "AIzaSyCDBcOGRLkth1wd0uwdbYjxID7eq3_rioQ"
        }
      ],
      "services": {
        "appinvite_service": {
          "other_platform_oauth_client": [
            {
              "client_id": "800303941804-lap94d115ahk9ertqj30ojkv044n6ks1.apps.googleusercontent.com",
              "client_type": 3
            }
          ]
        }
      }
    }
  ],
  "configuration_version": "1"
}