ID,anglais,français,Blop
TEST,"this is a test","Blop blobip","ceci est un test"
DEFAULT,"DEFAULT TEXT","BLOP","TEXTE PAR DEFAUT"
DELTA,"The delta time is %dms","%d Bili Bop Boop","Le temps delta est %dms"
