%YAML 1.1
%TAG !u! tag:unity3d.com,2011:
--- !u!1001 &2628296827846287948
PrefabInstance:
  m_ObjectHideFlags: 0
  serializedVersion: 2
  m_Modification:
    m_TransformParent: {fileID: 0}
    m_Modifications:
    - target: {fileID: 3136516619161101430, guid: 9c7d70c7adb737940807251bd652173d,
        type: 3}
      propertyPath: m_Name
      value: Sky_disk
      objectReference: {fileID: 0}
    - target: {fileID: 2151732056418293349, guid: 9c7d70c7adb737940807251bd652173d,
        type: 3}
      propertyPath: m_LocalPosition.x
      value: 0
      objectReference: {fileID: 0}
    - target: {fileID: 2151732056418293349, guid: 9c7d70c7adb737940807251bd652173d,
        type: 3}
      propertyPath: m_LocalPosition.y
      value: 1.21
      objectReference: {fileID: 0}
    - target: {fileID: 2151732056418293349, guid: 9c7d70c7adb737940807251bd652173d,
        type: 3}
      propertyPath: m_LocalPosition.z
      value: -0
      objectReference: {fileID: 0}
    - target: {fileID: 2151732056418293349, guid: 9c7d70c7adb737940807251bd652173d,
        type: 3}
      propertyPath: m_LocalRotation.x
      value: -0.7071068
      objectReference: {fileID: 0}
    - target: {fileID: 2151732056418293349, guid: 9c7d70c7adb737940807251bd652173d,
        type: 3}
      propertyPath: m_LocalRotation.y
      value: 0
      objectReference: {fileID: 0}
    - target: {fileID: 2151732056418293349, guid: 9c7d70c7adb737940807251bd652173d,
        type: 3}
      propertyPath: m_LocalRotation.z
      value: -0
      objectReference: {fileID: 0}
    - target: {fileID: 2151732056418293349, guid: 9c7d70c7adb737940807251bd652173d,
        type: 3}
      propertyPath: m_LocalRotation.w
      value: 0.7071067
      objectReference: {fileID: 0}
    - target: {fileID: 2151732056418293349, guid: 9c7d70c7adb737940807251bd652173d,
        type: 3}
      propertyPath: m_RootOrder
      value: 0
      objectReference: {fileID: 0}
    - target: {fileID: 2151732056418293349, guid: 9c7d70c7adb737940807251bd652173d,
        type: 3}
      propertyPath: m_LocalEulerAnglesHint.x
      value: 0
      objectReference: {fileID: 0}
    - target: {fileID: 2151732056418293349, guid: 9c7d70c7adb737940807251bd652173d,
        type: 3}
      propertyPath: m_LocalEulerAnglesHint.y
      value: 0
      objectReference: {fileID: 0}
    - target: {fileID: 2151732056418293349, guid: 9c7d70c7adb737940807251bd652173d,
        type: 3}
      propertyPath: m_LocalEulerAnglesHint.z
      value: 0
      objectReference: {fileID: 0}
    - target: {fileID: 2151732056418293349, guid: 9c7d70c7adb737940807251bd652173d,
        type: 3}
      propertyPath: m_LocalScale.x
      value: 4
      objectReference: {fileID: 0}
    - target: {fileID: 2151732056418293349, guid: 9c7d70c7adb737940807251bd652173d,
        type: 3}
      propertyPath: m_LocalScale.y
      value: 4
      objectReference: {fileID: 0}
    - target: {fileID: 2151732056418293349, guid: 9c7d70c7adb737940807251bd652173d,
        type: 3}
      propertyPath: m_LocalScale.z
      value: 1
      objectReference: {fileID: 0}
    - target: {fileID: 3727840520985563306, guid: 9c7d70c7adb737940807251bd652173d,
        type: 3}
      propertyPath: m_Materials.Array.data[0]
      value: 
      objectReference: {fileID: 2100000, guid: 1f7c2b555bba34f4ab706751ecd7c125, type: 2}
    m_RemovedComponents: []
  m_SourcePrefab: {fileID: 100100000, guid: 9c7d70c7adb737940807251bd652173d, type: 3}
