%YAML 1.1
%TAG !u! tag:unity3d.com,2011:
--- !u!1 &5626514649232154763
GameObject:
  m_ObjectHideFlags: 0
  m_CorrespondingSourceObject: {fileID: 0}
  m_PrefabInstance: {fileID: 0}
  m_PrefabAsset: {fileID: 0}
  serializedVersion: 6
  m_Component:
  - component: {fileID: 5626514649232154762}
  - component: {fileID: 5626514649232154760}
  - component: {fileID: 5626514649232154761}
  m_Layer: 0
  m_Name: DialogManager
  m_TagString: Untagged
  m_Icon: {fileID: 0}
  m_NavMeshLayer: 0
  m_StaticEditorFlags: 0
  m_IsActive: 1
--- !u!4 &5626514649232154762
Transform:
  m_ObjectHideFlags: 0
  m_CorrespondingSourceObject: {fileID: 0}
  m_PrefabInstance: {fileID: 0}
  m_PrefabAsset: {fileID: 0}
  m_GameObject: {fileID: 5626514649232154763}
  m_LocalRotation: {x: 0, y: 0, z: 0, w: 1}
  m_LocalPosition: {x: 0, y: 0, z: 0}
  m_LocalScale: {x: 1, y: 1, z: 1}
  m_Children: []
  m_Father: {fileID: 0}
  m_RootOrder: 0
  m_LocalEulerAnglesHint: {x: 0, y: 0, z: 0}
--- !u!114 &5626514649232154760
MonoBehaviour:
  m_ObjectHideFlags: 0
  m_CorrespondingSourceObject: {fileID: 0}
  m_PrefabInstance: {fileID: 0}
  m_PrefabAsset: {fileID: 0}
  m_GameObject: {fileID: 5626514649232154763}
  m_Enabled: 1
  m_EditorHideFlags: 0
  m_Script: {fileID: 11500000, guid: e11042f10ca34fae9f249bce132d7c74, type: 3}
  m_Name: 
  m_EditorClassIdentifier: 
  dialogs:
  - {fileID: 0}
  - {fileID: 0}
  - {fileID: 0}
--- !u!114 &5626514649232154761
MonoBehaviour:
  m_ObjectHideFlags: 0
  m_CorrespondingSourceObject: {fileID: 0}
  m_PrefabInstance: {fileID: 0}
  m_PrefabAsset: {fileID: 0}
  m_GameObject: {fileID: 5626514649232154763}
  m_Enabled: 1
  m_EditorHideFlags: 0
  m_Script: {fileID: 11500000, guid: c05edbacaf264ed395018fc1b1da0fc3, type: 3}
  m_Name: 
  m_EditorClassIdentifier: 
  eventsToListen:
  - subscriber: {fileID: 0}
    event: {fileID: 11400000, guid: 2c757a6672097024fa991270ba3491b1, type: 2}
    response:
      m_PersistentCalls:
        m_Calls:
        - m_Target: {fileID: 5626514649232154760}
          m_TargetAssemblyTypeName: GameLogic.DialogManager, Assembly-CSharp
          m_MethodName: AddCurrentTaskFromGameData
          m_Mode: 1
          m_Arguments:
            m_ObjectArgument: {fileID: 0}
            m_ObjectArgumentAssemblyTypeName: UnityEngine.Object, UnityEngine
            m_IntArgument: 0
            m_FloatArgument: 0
            m_StringArgument: 
            m_BoolArgument: 0
          m_CallState: 2
