%YAML 1.1
%TAG !u! tag:unity3d.com,2011:
--- !u!1045 &1
EditorBuildSettings:
  m_ObjectHideFlags: 0
  serializedVersion: 2
  m_Scenes:
  - enabled: 1
    path: Assets/Scenes/Game Scenes/MainMenu.unity
    guid: 396d1e01d2d3ca54bb206885a13c3a05
  - enabled: 0
    path: Assets/Scenes/Samples Scenes/Notifications.unity
    guid: 2d70d94e073d742458c476eff536c5f0
  - enabled: 1
    path: Assets/Scenes/Game Scenes/CharacterCreation.unity
    guid: 8ebe475610ca08f45ab5daa6a791c2af
  - enabled: 1
    path: Assets/Scenes/Game Scenes/NewMain.unity
    guid: fa677e6a0989f1a4b9254ea793f425f8
  - enabled: 1
    path: Assets/Scenes/Game Scenes/Victory.unity
    guid: 745faf9e0710d9e4b96df17e60ac07d9
  m_configObjects: {}
