%YAML 1.1
%TAG !u! tag:unity3d.com,2011:
--- !u!78 &1
TagManager:
  serializedVersion: 2
  tags:
  - Tool
  - Breakable
  - Crystal
  layers:
  - Default
  - TransparentFX
  - Ignore Raycast
  - 
  - Water
  - UI
  - 
  - 
  - Vert
  - Rouge
  - Bleu
  - 
  - 
  - 
  - 
  - 
  - 
  - 
  - 
  - 
  - 
  - 
  - 
  - 
  - 
  - 
  - 
  - 
  - 
  - 
  - 
  - 
  m_SortingLayers:
  - name: Background
    uniqueID: 3304106403
    locked: 0
  - name: Decor
    uniqueID: 91791723
    locked: 0
  - name: Default
    uniqueID: 0
    locked: 0
  - name: Enemies
    uniqueID: 3378183863
    locked: 0
  - name: Items
    uniqueID: 579919801
    locked: 0
  - name: FX
    uniqueID: 2854310193
    locked: 0
  - name: UI
    uniqueID: 1270919079
    locked: 0
