%YAML 1.1
%TAG !u! tag:unity3d.com,2011:
--- !u!1045 &1
EditorBuildSettings:
  m_ObjectHideFlags: 0
  serializedVersion: 2
  m_Scenes:
  - enabled: 1
    path: Assets/Scenes/MainMenu.unity
    guid: 3173b0dcd873d21428a15924bc7ac5c1
  - enabled: 1
    path: Assets/Scenes/LevelSelection_prev.unity
    guid: 4bd2389c4abc0e24ca84f60ffb44d0cb
  - enabled: 0
    path: 
    guid: 00000000000000000000000000000000
  - enabled: 0
    path: 
    guid: 00000000000000000000000000000000
  - enabled: 1
    path: Assets/Scenes/LevelSelection.unity
    guid: e34c586359c01154d92f03897a2056d4
  - enabled: 1
    path: Assets/Scenes/Levels/Level1.unity
    guid: 244ee1a89071a6c42bdeac9e63edafa9
  - enabled: 1
    path: Assets/Scenes/DefeatScene.unity
    guid: 6873a6bfff272e748b52ecbeb0ec65e4
  - enabled: 1
    path: Assets/Scenes/VictoryScene.unity
    guid: e19a16ce9f5878248b8b33713348d5fa
  - enabled: 1
    path: Assets/Scenes/Levels/Level2.unity
    guid: 37111ccde43871646aa9ff482c4e5960
  m_configObjects: {}
