%YAML 1.1
%TAG !u! tag:unity3d.com,2011:
--- !u!114 &11400000
MonoBehaviour:
  m_ObjectHideFlags: 0
  m_CorrespondingSourceObject: {fileID: 0}
  m_PrefabInstance: {fileID: 0}
  m_PrefabAsset: {fileID: 0}
  m_GameObject: {fileID: 0}
  m_Enabled: 1
  m_EditorHideFlags: 0
  m_Script: {fileID: 11500000, guid: 9d1514134bc4fbd41bb739b1b9a49231, type: 3}
  m_Name: Wall
  m_EditorClassIdentifier: 
  m_DefaultSprite: {fileID: 21300000, guid: cc58c835160702d409a87d2c3a3fbec8, type: 3}
  m_DefaultGameObject: {fileID: 8107200855218167166, guid: 724f77426278b194586166541ac409a7,
    type: 3}
  m_DefaultColliderType: 1
  m_TilingRules:
  - m_Id: 2
    m_Sprites:
    - {fileID: 21300000, guid: cc58c835160702d409a87d2c3a3fbec8, type: 3}
    m_GameObject: {fileID: 8107200855218167166, guid: 724f77426278b194586166541ac409a7,
      type: 3}
    m_AnimationSpeed: 1
    m_PerlinScale: 0.5
    m_Output: 0
    m_ColliderType: 1
    m_RandomTransform: 0
    m_Neighbors: 01000000010000000100000001000000
    m_NeighborPositions:
    - {x: -1, y: 0, z: 0}
    - {x: 0, y: 1, z: 0}
    - {x: 0, y: -1, z: 0}
    - {x: 1, y: 0, z: 0}
    m_RuleTransform: 1
  - m_Id: 3
    m_Sprites:
    - {fileID: 21300000, guid: c43ecac58d145a2458a761c4ddddaa55, type: 3}
    m_GameObject: {fileID: 8107200855218167166, guid: 724f77426278b194586166541ac409a7,
      type: 3}
    m_AnimationSpeed: 1
    m_PerlinScale: 0.5
    m_Output: 0
    m_ColliderType: 1
    m_RandomTransform: 0
    m_Neighbors: 010000000100000001000000
    m_NeighborPositions:
    - {x: -1, y: 0, z: 0}
    - {x: 0, y: -1, z: 0}
    - {x: 1, y: 0, z: 0}
    m_RuleTransform: 1
  - m_Id: 0
    m_Sprites:
    - {fileID: 21300000, guid: 457a9a66de9a1f64f97195f41951577f, type: 3}
    m_GameObject: {fileID: 8107200855218167166, guid: 724f77426278b194586166541ac409a7,
      type: 3}
    m_AnimationSpeed: 1
    m_PerlinScale: 0.5
    m_Output: 0
    m_ColliderType: 1
    m_RandomTransform: 0
    m_Neighbors: 010000000100000002000000
    m_NeighborPositions:
    - {x: -1, y: 0, z: 0}
    - {x: 1, y: 0, z: 0}
    - {x: 0, y: -1, z: 0}
    m_RuleTransform: 1
  - m_Id: 1
    m_Sprites:
    - {fileID: 21300000, guid: bde9727a62a42dc4db137a3d64aaa40c, type: 3}
    m_GameObject: {fileID: 8107200855218167166, guid: 724f77426278b194586166541ac409a7,
      type: 3}
    m_AnimationSpeed: 1
    m_PerlinScale: 0.5
    m_Output: 0
    m_ColliderType: 1
    m_RandomTransform: 0
    m_Neighbors: 0100000001000000
    m_NeighborPositions:
    - {x: 0, y: 1, z: 0}
    - {x: 1, y: 0, z: 0}
    m_RuleTransform: 1
  - m_Id: 4
    m_Sprites:
    - {fileID: 21300000, guid: a95fae7df46e2c048be22bebf3f5fbf6, type: 3}
    m_GameObject: {fileID: 8107200855218167166, guid: 724f77426278b194586166541ac409a7,
      type: 3}
    m_AnimationSpeed: 1
    m_PerlinScale: 0.5
    m_Output: 0
    m_ColliderType: 1
    m_RandomTransform: 0
    m_Neighbors: 0100000002000000
    m_NeighborPositions:
    - {x: 0, y: -1, z: 0}
    - {x: 0, y: 1, z: 0}
    m_RuleTransform: 1
