%YAML 1.1
%TAG !u! tag:unity3d.com,2011:
--- !u!114 &11400000
MonoBehaviour:
  m_ObjectHideFlags: 0
  m_CorrespondingSourceObject: {fileID: 0}
  m_PrefabInstance: {fileID: 0}
  m_PrefabAsset: {fileID: 0}
  m_GameObject: {fileID: 0}
  m_Enabled: 1
  m_EditorHideFlags: 0
  m_Script: {fileID: 11500000, guid: 95e66c6366d904e98bc83428217d4fd7, type: 3}
  m_Name: Bounce
  m_EditorClassIdentifier: 
  _data:
    _json: '{"graph":{"variables":{"collection":{"$content":[{"name":"movementSpeed","value":{"$content":3,"$type":"System.Int32"},"typeHandle":{"Identification":"System.Int32,
      mscorlib, Version=4.0.0.0, Culture=neutral, PublicKeyToken=b77a5c561934e089","$version":"A"},"$version":"A"},{"name":"distance","value":{"x":0.0,"y":-1.0,"z":0.0,"$type":"UnityEngine.Vector3"},"typeHandle":{"Identification":"UnityEngine.Vector3,
      UnityEngine.CoreModule, Version=0.0.0.0, Culture=neutral, PublicKeyToken=null","$version":"A"},"$version":"A"}],"$version":"A"},"$version":"A"},"controlInputDefinitions":[],"controlOutputDefinitions":[],"valueInputDefinitions":[],"valueOutputDefinitions":[],"title":"Bounce","summary":"Movement
      and collision for the Bounce Enemy","pan":{"x":-289.0421,"y":609.407},"zoom":0.4309444,"elements":[{"defaultValues":{},"position":{"x":-701.0,"y":104.0},"guid":"129bf507-d922-4832-9ae9-bc8c40177f1d","$version":"A","$type":"Unity.VisualScripting.GenericMultiply","$id":"11"},{"inputCount":2,"defaultValues":{},"position":{"x":-382.0,"y":37.0},"guid":"75ca0eb1-098e-4031-93a4-4f9b60d7232e","$version":"A","$type":"Unity.VisualScripting.GenericSum","$id":"13"},{"chainable":false,"member":{"name":"position","parameterTypes":null,"targetType":"UnityEngine.Transform","targetTypeName":"UnityEngine.Transform","$version":"A"},"defaultValues":{"target":null,"input":{"x":0.0,"y":0.0,"z":0.0,"$type":"UnityEngine.Vector3"}},"position":{"x":-234.0,"y":-108.0},"guid":"06f2c10d-8a4c-4d6f-a103-9577a81766fb","$version":"A","$type":"Unity.VisualScripting.SetMember","$id":"15"},{"member":{"name":"position","parameterTypes":null,"targetType":"UnityEngine.Transform","targetTypeName":"UnityEngine.Transform","$version":"A"},"defaultValues":{"target":null},"position":{"x":-559.0,"y":-22.0},"guid":"f5ce579e-2507-43dd-910c-f14dfc2704de","$version":"A","$type":"Unity.VisualScripting.GetMember","$id":"18"},{"member":{"name":"deltaTime","parameterTypes":null,"targetType":"UnityEngine.Time","targetTypeName":"UnityEngine.Time","$version":"A"},"defaultValues":{},"position":{"x":-909.0,"y":225.0},"guid":"e11c1e5d-6f18-47a5-a14d-b3bd5d61241a","$version":"A","$type":"Unity.VisualScripting.GetMember","$id":"21"},{"coroutine":false,"defaultValues":{},"position":{"x":-856.0,"y":-114.0},"guid":"af51850f-e54e-4ae7-8ccf-76665cd8e8a8","$version":"A","$type":"Unity.VisualScripting.Update","$id":"24"},{"specifyFallback":false,"kind":"Object","defaultValues":{"name":{"$content":"speed","$type":"System.String"},"object":null},"position":{"x":-686.0,"y":310.0},"guid":"5088790f-7642-4e5e-b9a4-e3251272e953","$version":"A","$type":"Unity.VisualScripting.GetVariable","$id":"26"},{"defaultValues":{},"position":{"x":-546.0,"y":106.0},"guid":"ea99162e-4c73-4917-9be9-2d075a80e2e7","$version":"A","$type":"Unity.VisualScripting.GenericMultiply","$id":"28"},{"specifyFallback":false,"kind":"Graph","defaultValues":{"name":{"$content":"distance","$type":"System.String"}},"position":{"x":-903.0,"y":104.0},"guid":"83646269-916d-4b6e-8b2c-5b047167ee5b","$version":"A","$type":"Unity.VisualScripting.GetVariable","$id":"30"},{"coroutine":false,"defaultValues":{"target":null},"position":{"x":-568.0,"y":629.0},"guid":"85f0bb51-e014-4292-95c3-6dc079ed9b6e","$version":"A","$type":"Unity.VisualScripting.OnCollisionEnter2D","$id":"32"},{"member":{"name":"y","parameterTypes":null,"targetType":"UnityEngine.Vector3","targetTypeName":"UnityEngine.Vector3","$version":"A"},"defaultValues":{"target":{"x":0.0,"y":0.0,"z":0.0,"$type":"UnityEngine.Vector3"}},"position":{"x":-527.0,"y":895.0},"guid":"4d2e03f4-227a-47ac-92ef-a0ab22c17790","$version":"A","$type":"Unity.VisualScripting.GetMember","$id":"34"},{"kind":"Graph","defaultValues":{"name":{"$content":"distance","$type":"System.String"}},"position":{"x":-60.0,"y":654.0},"guid":"850469aa-aa68-437c-8a89-a68c0232c1fa","$version":"A","$type":"Unity.VisualScripting.SetVariable","$id":"37"},{"defaultValues":{},"position":{"x":-129.0,"y":880.0},"guid":"0698b03e-1c34-46d8-a824-8d8dbc5919d4","$version":"A","$type":"Unity.VisualScripting.SelectUnit","$id":"39"},{"specifyFallback":false,"kind":"Graph","defaultValues":{"name":{"$content":"distance","$type":"System.String"}},"position":{"x":-729.0,"y":961.0},"guid":"476dfbe4-1aba-4f4d-8ef5-b22d1fcd71ce","$version":"A","$type":"Unity.VisualScripting.GetVariable","$id":"41"},{"chainable":false,"member":{"name":".ctor","parameterTypes":["System.Single","System.Single"],"targetType":"UnityEngine.Vector3","targetTypeName":"UnityEngine.Vector3","$version":"A"},"defaultValues":{"%x":{"$content":0.0,"$type":"System.Single"},"%y":{"$content":1.0,"$type":"System.Single"}},"position":{"x":-327.0,"y":1019.0},"guid":"e3db9d25-e155-43d5-af81-aee4093f5dac","$version":"A","$type":"Unity.VisualScripting.InvokeMember","$id":"43"},{"chainable":false,"member":{"name":".ctor","parameterTypes":["System.Single","System.Single"],"targetType":"UnityEngine.Vector3","targetTypeName":"UnityEngine.Vector3","$version":"A"},"defaultValues":{"%x":{"$content":0.0,"$type":"System.Single"},"%y":{"$content":-1.0,"$type":"System.Single"}},"position":{"x":-336.0,"y":1164.0},"guid":"1f23f0a4-cc63-4f1d-bed6-850b798a92ff","$version":"A","$type":"Unity.VisualScripting.InvokeMember","$id":"46"},{"numeric":true,"defaultValues":{"b":{"$content":0.0,"$type":"System.Single"}},"position":{"x":-316.0,"y":883.0},"guid":"7a85538d-7491-4a4e-9827-4bce54e4c235","$version":"A","$type":"Unity.VisualScripting.Less","$id":"49"},{"sourceUnit":{"$ref":"24"},"sourceKey":"trigger","destinationUnit":{"$ref":"15"},"destinationKey":"assign","guid":"2751eb12-a75f-437c-b538-56d71cd8cf06","$type":"Unity.VisualScripting.ControlConnection"},{"sourceUnit":{"$ref":"32"},"sourceKey":"trigger","destinationUnit":{"$ref":"37"},"destinationKey":"assign","guid":"5f4610ca-db22-40a1-9ac6-245b600c7590","$type":"Unity.VisualScripting.ControlConnection"},{"sourceUnit":{"$ref":"30"},"sourceKey":"value","destinationUnit":{"$ref":"11"},"destinationKey":"a","guid":"542bfd5c-690c-4f5c-863d-31d56fab5744","$type":"Unity.VisualScripting.ValueConnection"},{"sourceUnit":{"$ref":"18"},"sourceKey":"value","destinationUnit":{"$ref":"13"},"destinationKey":"0","guid":"3d5e3b1b-f490-4999-98ff-8c551c67319f","$type":"Unity.VisualScripting.ValueConnection"},{"sourceUnit":{"$ref":"13"},"sourceKey":"sum","destinationUnit":{"$ref":"15"},"destinationKey":"input","guid":"8ff02781-f17e-4df7-8cdf-fd2f7aeae561","$type":"Unity.VisualScripting.ValueConnection"},{"sourceUnit":{"$ref":"41"},"sourceKey":"value","destinationUnit":{"$ref":"34"},"destinationKey":"target","guid":"24cb6ccf-5679-41f4-a4d4-85ba8c0d5de3","$type":"Unity.VisualScripting.ValueConnection"},{"sourceUnit":{"$ref":"34"},"sourceKey":"value","destinationUnit":{"$ref":"49"},"destinationKey":"a","guid":"2d366e92-683b-4890-9d2c-0a43a239896c","$type":"Unity.VisualScripting.ValueConnection"},{"sourceUnit":{"$ref":"26"},"sourceKey":"value","destinationUnit":{"$ref":"28"},"destinationKey":"b","guid":"2a61109b-ac9d-4903-a586-983a469aa111","$type":"Unity.VisualScripting.ValueConnection"},{"sourceUnit":{"$ref":"28"},"sourceKey":"product","destinationUnit":{"$ref":"13"},"destinationKey":"1","guid":"76ac75e9-8443-4cd1-bd3c-989c31852bb8","$type":"Unity.VisualScripting.ValueConnection"},{"sourceUnit":{"$ref":"11"},"sourceKey":"product","destinationUnit":{"$ref":"28"},"destinationKey":"a","guid":"041fd839-ce61-4c64-8e06-5b556003c22a","$type":"Unity.VisualScripting.ValueConnection"},{"sourceUnit":{"$ref":"21"},"sourceKey":"value","destinationUnit":{"$ref":"11"},"destinationKey":"b","guid":"f8223c54-e66d-4c1a-858f-3ecd7738c4bf","$type":"Unity.VisualScripting.ValueConnection"},{"sourceUnit":{"$ref":"49"},"sourceKey":"comparison","destinationUnit":{"$ref":"39"},"destinationKey":"condition","guid":"b870908a-4137-4dc0-9739-21ea564324ae","$type":"Unity.VisualScripting.ValueConnection"},{"sourceUnit":{"$ref":"43"},"sourceKey":"result","destinationUnit":{"$ref":"39"},"destinationKey":"ifTrue","guid":"4a68cbf4-4de9-4a88-a910-3866f4bd8c37","$type":"Unity.VisualScripting.ValueConnection"},{"sourceUnit":{"$ref":"46"},"sourceKey":"result","destinationUnit":{"$ref":"39"},"destinationKey":"ifFalse","guid":"72dda27d-abed-42f0-b54c-3f0ba565c10b","$type":"Unity.VisualScripting.ValueConnection"},{"sourceUnit":{"$ref":"39"},"sourceKey":"selection","destinationUnit":{"$ref":"37"},"destinationKey":"input","guid":"48b2393d-d999-4726-8f82-8412cad89d09","$type":"Unity.VisualScripting.ValueConnection"},{"position":{"xMin":-925.0,"yMin":-165.0,"xMax":-82.0,"yMax":474.0},"label":"Bounce
      Movement","comment":null,"color":{"r":0.0,"g":0.0,"b":0.0,"a":1.0},"guid":"85c874a7-334b-4865-a77c-60da527b0b7f","$version":"A","$type":"Unity.VisualScripting.GraphGroup"},{"position":{"xMin":-930.7004,"yMin":540.303,"xMax":352.6163,"yMax":1383.814},"label":"Bounce
      Collision","comment":null,"color":{"r":0.8018868,"g":0.7672636,"b":0.1467604,"a":1.0},"guid":"e8f34476-2331-4dfa-a51d-075eb8242778","$version":"A","$type":"Unity.VisualScripting.GraphGroup"}],"$version":"A"}}'
    _objectReferences: []
