%YAML 1.1
%TAG !u! tag:unity3d.com,2011:
--- !u!114 &11400000
MonoBehaviour:
  m_ObjectHideFlags: 0
  m_CorrespondingSourceObject: {fileID: 0}
  m_PrefabInstance: {fileID: 0}
  m_PrefabAsset: {fileID: 0}
  m_GameObject: {fileID: 0}
  m_Enabled: 1
  m_EditorHideFlags: 0
  m_Script: {fileID: 11500000, guid: 95e66c6366d904e98bc83428217d4fd7, type: 3}
  m_Name: ScoreDisplay
  m_EditorClassIdentifier: 
  _data:
    _json: '{"graph":{"variables":{"collection":{"$content":[],"$version":"A"},"$version":"A"},"controlInputDefinitions":[],"controlOutputDefinitions":[],"valueInputDefinitions":[],"valueOutputDefinitions":[],"title":null,"summary":null,"pan":{"x":-177.9,"y":-15.39999},"zoom":1.0,"elements":[{"argumentCount":0,"coroutine":false,"defaultValues":{"target":null,"name":{"$content":"UpdateScore","$type":"System.String"}},"position":{"x":-353.0,"y":-126.0},"guid":"5f29064e-492e-492d-8a1c-d7b727cb8ef8","$version":"A","$type":"Unity.VisualScripting.CustomEvent","$id":"9"},{"specifyFallback":false,"kind":"Scene","defaultValues":{"name":{"$content":"currentScore","$type":"System.String"}},"position":{"x":-297.0,"y":58.0},"guid":"ce4f81a2-a000-4a85-9d69-642304abbf4c","$version":"A","$type":"Unity.VisualScripting.GetVariable","$id":"11"},{"chainable":false,"member":{"name":"ToString","parameterTypes":[],"targetType":"System.Int32","targetTypeName":"System.Int32","$version":"A"},"defaultValues":{"target":{"$content":0,"$type":"System.Int32"}},"position":{"x":20.0,"y":-71.0},"guid":"50fd768c-1dab-40dd-9bc7-1bca2b0145b2","$version":"A","$type":"Unity.VisualScripting.InvokeMember","$id":"13"},{"chainable":false,"member":{"name":"text","parameterTypes":null,"targetType":"TMPro.TextMeshProUGUI","targetTypeName":"TMPro.TextMeshProUGUI","$version":"A"},"defaultValues":{"target":null,"input":{"$content":"","$type":"System.String"}},"position":{"x":241.0,"y":-69.0},"guid":"b00082bc-d787-4969-bb29-0a710db19755","$version":"A","$type":"Unity.VisualScripting.SetMember","$id":"16"},{"sourceUnit":{"$ref":"9"},"sourceKey":"trigger","destinationUnit":{"$ref":"13"},"destinationKey":"enter","guid":"110c5e3c-dc20-4452-b2d6-cbf3c04b3f10","$type":"Unity.VisualScripting.ControlConnection"},{"sourceUnit":{"$ref":"13"},"sourceKey":"exit","destinationUnit":{"$ref":"16"},"destinationKey":"assign","guid":"913b4020-9f5c-4c9a-a869-7ec8f30fc2ec","$type":"Unity.VisualScripting.ControlConnection"},{"sourceUnit":{"$ref":"11"},"sourceKey":"value","destinationUnit":{"$ref":"13"},"destinationKey":"target","guid":"95eb0803-4e3d-480d-89ad-51daf6531aeb","$type":"Unity.VisualScripting.ValueConnection"},{"sourceUnit":{"$ref":"13"},"sourceKey":"result","destinationUnit":{"$ref":"16"},"destinationKey":"input","guid":"47ff8bf6-1650-4263-a056-6c4ad52dce20","$type":"Unity.VisualScripting.ValueConnection"}],"$version":"A"}}'
    _objectReferences: []
