[gd_scene load_steps=5 format=3 uid="uid://cdf3ngq0oxjc4"]

[ext_resource type="Texture2D" uid="uid://dc1gwv8ctflks" path="res://assets/textures/Terrain (16x16).png" id="1_60525"]

[sub_resource type="TileMapPattern" id="TileMapPattern_c5out"]
tile_data = PackedInt32Array(0, 458752, 0, 65536, 458752, 1, 131072, 458752, 2, 1, 458752, 0, 65537, 458752, 1, 131073, 458752, 2, 2, 458752, 0, 65538, 458752, 1, 131074, 458752, 2, 3, 458752, 0, 65539, 458752, 1, 131075, 458752, 2, 4, 458752, 0, 65540, 458752, 1, 131076, 458752, 2, 5, 458752, 0, 65541, 458752, 1, 131077, 458752, 2, 6, 458752, 0, 65542, 458752, 1, 131078, 458752, 2)

[sub_resource type="TileSetAtlasSource" id="TileSetAtlasSource_wcgj7"]
resource_name = "Terrain"
texture = ExtResource("1_60525")
0:0/0 = 0
0:0/0/physics_layer_0/linear_velocity = Vector2(0, 0)
0:0/0/physics_layer_0/angular_velocity = 0.0
0:0/0/physics_layer_0/polygon_0/points = PackedVector2Array(-8, -8, 8, -8, 8, 8, -8, 8)
1:0/0 = 0
1:0/0/physics_layer_0/linear_velocity = Vector2(0, 0)
1:0/0/physics_layer_0/angular_velocity = 0.0
1:0/0/physics_layer_0/polygon_0/points = PackedVector2Array(-8, -8, 8, -8, 8, 8, -8, 8)
2:0/0 = 0
2:0/0/physics_layer_0/linear_velocity = Vector2(0, 0)
2:0/0/physics_layer_0/angular_velocity = 0.0
2:0/0/physics_layer_0/polygon_0/points = PackedVector2Array(-8, -8, 8, -8, 8, 8, -8, 8)
3:0/0 = 0
3:0/0/physics_layer_0/linear_velocity = Vector2(0, 0)
3:0/0/physics_layer_0/angular_velocity = 0.0
3:0/0/physics_layer_0/polygon_0/points = PackedVector2Array(-8, -8, 8, -8, 8, 8, -8, 8)
4:0/0 = 0
4:0/0/physics_layer_0/linear_velocity = Vector2(0, 0)
4:0/0/physics_layer_0/angular_velocity = 0.0
4:0/0/physics_layer_0/polygon_0/points = PackedVector2Array(-8, -8, 8, -8, 8, 8, -8, 8)
6:0/0 = 0
6:0/0/terrain_set = 0
6:0/0/terrain = 0
6:0/0/physics_layer_0/linear_velocity = Vector2(0, 0)
6:0/0/physics_layer_0/angular_velocity = 0.0
6:0/0/physics_layer_0/polygon_0/points = PackedVector2Array(-8, -8, 8, -8, 8, 8, -8, 8)
6:0/0/terrains_peering_bit/right_side = 0
6:0/0/terrains_peering_bit/bottom_right_corner = 0
6:0/0/terrains_peering_bit/bottom_side = 0
7:0/0 = 0
7:0/0/terrain_set = 0
7:0/0/terrain = 0
7:0/0/physics_layer_0/linear_velocity = Vector2(0, 0)
7:0/0/physics_layer_0/angular_velocity = 0.0
7:0/0/physics_layer_0/polygon_0/points = PackedVector2Array(-8, -8, 8, -8, 8, 8, -8, 8)
7:0/0/terrains_peering_bit/right_side = 0
7:0/0/terrains_peering_bit/bottom_right_corner = 0
7:0/0/terrains_peering_bit/bottom_side = 0
7:0/0/terrains_peering_bit/bottom_left_corner = 0
7:0/0/terrains_peering_bit/left_side = 0
8:0/0 = 0
8:0/0/terrain_set = 0
8:0/0/terrain = 0
8:0/0/physics_layer_0/linear_velocity = Vector2(0, 0)
8:0/0/physics_layer_0/angular_velocity = 0.0
8:0/0/physics_layer_0/polygon_0/points = PackedVector2Array(-8, -8, 8, -8, 8, 8, -8, 8)
8:0/0/terrains_peering_bit/bottom_side = 0
8:0/0/terrains_peering_bit/bottom_left_corner = 0
8:0/0/terrains_peering_bit/left_side = 0
9:0/0 = 0
9:0/0/physics_layer_0/linear_velocity = Vector2(0, 0)
9:0/0/physics_layer_0/angular_velocity = 0.0
9:0/0/physics_layer_0/polygon_0/points = PackedVector2Array(-8, -8, 8, -8, 8, 8, -8, 8)
10:0/0 = 0
10:0/0/physics_layer_0/linear_velocity = Vector2(0, 0)
10:0/0/physics_layer_0/angular_velocity = 0.0
10:0/0/physics_layer_0/polygon_0/points = PackedVector2Array(-8, -8, 8, -8, 8, 8, -8, 8)
12:0/0 = 0
12:0/0/physics_layer_0/linear_velocity = Vector2(0, 0)
12:0/0/physics_layer_0/angular_velocity = 0.0
12:0/0/physics_layer_0/polygon_0/points = PackedVector2Array(-8, -8, 8, -8, 8, 8, -8, 8)
13:0/0 = 0
13:0/0/physics_layer_0/linear_velocity = Vector2(0, 0)
13:0/0/physics_layer_0/angular_velocity = 0.0
13:0/0/physics_layer_0/polygon_0/points = PackedVector2Array(-8, -8, 8, -8, 8, 8, -8, 8)
14:0/0 = 0
14:0/0/physics_layer_0/linear_velocity = Vector2(0, 0)
14:0/0/physics_layer_0/angular_velocity = 0.0
14:0/0/physics_layer_0/polygon_0/points = PackedVector2Array(-8, -8, 8, -8, 8, 8, -8, 8)
15:0/0 = 0
15:0/0/physics_layer_0/linear_velocity = Vector2(0, 0)
15:0/0/physics_layer_0/angular_velocity = 0.0
15:0/0/physics_layer_0/polygon_0/points = PackedVector2Array(-8, -8, 8, -8, 8, 8, -8, 8)
17:0/0 = 0
17:0/0/physics_layer_0/linear_velocity = Vector2(0, 0)
17:0/0/physics_layer_0/angular_velocity = 0.0
17:0/0/physics_layer_0/polygon_0/points = PackedVector2Array(-8, -8, 8, -8, 8, -3.125, -8, -3.125)
18:0/0 = 0
18:0/0/physics_layer_0/linear_velocity = Vector2(0, 0)
18:0/0/physics_layer_0/angular_velocity = 0.0
18:0/0/physics_layer_0/polygon_0/points = PackedVector2Array(-8, -8, 8, -8, 8, -3.125, -8, -3.125)
19:0/0 = 0
19:0/0/physics_layer_0/linear_velocity = Vector2(0, 0)
19:0/0/physics_layer_0/angular_velocity = 0.0
19:0/0/physics_layer_0/polygon_0/points = PackedVector2Array(-8, -8, 8, -8, 8, -3.125, -8, -3.125)
0:1/0 = 0
0:1/0/physics_layer_0/linear_velocity = Vector2(0, 0)
0:1/0/physics_layer_0/angular_velocity = 0.0
0:1/0/physics_layer_0/polygon_0/points = PackedVector2Array(-8, -8, 8, -8, 8, 8, -8, 8)
1:1/0 = 0
1:1/0/physics_layer_0/linear_velocity = Vector2(0, 0)
1:1/0/physics_layer_0/angular_velocity = 0.0
1:1/0/physics_layer_0/polygon_0/points = PackedVector2Array(-8, -8, 8, -8, 8, 8, -8, 8)
2:1/0 = 0
2:1/0/physics_layer_0/linear_velocity = Vector2(0, 0)
2:1/0/physics_layer_0/angular_velocity = 0.0
2:1/0/physics_layer_0/polygon_0/points = PackedVector2Array(-8, -8, 8, -8, 8, 8, -8, 8)
3:1/0 = 0
3:1/0/physics_layer_0/linear_velocity = Vector2(0, 0)
3:1/0/physics_layer_0/angular_velocity = 0.0
3:1/0/physics_layer_0/polygon_0/points = PackedVector2Array(-8, -8, 8, -8, 8, 8, -8, 8)
4:1/0 = 0
4:1/0/physics_layer_0/linear_velocity = Vector2(0, 0)
4:1/0/physics_layer_0/angular_velocity = 0.0
4:1/0/physics_layer_0/polygon_0/points = PackedVector2Array(-8, -8, 8, -8, 8, 8, -8, 8)
6:1/0 = 0
6:1/0/terrain_set = 0
6:1/0/terrain = 0
6:1/0/physics_layer_0/linear_velocity = Vector2(0, 0)
6:1/0/physics_layer_0/angular_velocity = 0.0
6:1/0/physics_layer_0/polygon_0/points = PackedVector2Array(-8, -8, 8, -8, 8, 8, -8, 8)
6:1/0/terrains_peering_bit/right_side = 0
6:1/0/terrains_peering_bit/bottom_right_corner = 0
6:1/0/terrains_peering_bit/bottom_side = 0
6:1/0/terrains_peering_bit/top_side = 0
6:1/0/terrains_peering_bit/top_right_corner = 0
7:1/0 = 0
7:1/0/terrain_set = 0
7:1/0/terrain = 0
7:1/0/physics_layer_0/linear_velocity = Vector2(0, 0)
7:1/0/physics_layer_0/angular_velocity = 0.0
7:1/0/physics_layer_0/polygon_0/points = PackedVector2Array(-8, -8, 8, -8, 8, 8, -8, 8)
7:1/0/terrains_peering_bit/right_side = 0
7:1/0/terrains_peering_bit/bottom_right_corner = 0
7:1/0/terrains_peering_bit/bottom_side = 0
7:1/0/terrains_peering_bit/bottom_left_corner = 0
7:1/0/terrains_peering_bit/left_side = 0
7:1/0/terrains_peering_bit/top_left_corner = 0
7:1/0/terrains_peering_bit/top_side = 0
7:1/0/terrains_peering_bit/top_right_corner = 0
8:1/0 = 0
8:1/0/terrain_set = 0
8:1/0/terrain = 0
8:1/0/physics_layer_0/linear_velocity = Vector2(0, 0)
8:1/0/physics_layer_0/angular_velocity = 0.0
8:1/0/physics_layer_0/polygon_0/points = PackedVector2Array(-8, -8, 8, -8, 8, 8, -8, 8)
8:1/0/terrains_peering_bit/bottom_side = 0
8:1/0/terrains_peering_bit/bottom_left_corner = 0
8:1/0/terrains_peering_bit/left_side = 0
8:1/0/terrains_peering_bit/top_left_corner = 0
8:1/0/terrains_peering_bit/top_side = 0
9:1/0 = 0
9:1/0/terrain_set = 0
9:1/0/terrain = 0
9:1/0/physics_layer_0/linear_velocity = Vector2(0, 0)
9:1/0/physics_layer_0/angular_velocity = 0.0
9:1/0/physics_layer_0/polygon_0/points = PackedVector2Array(-8, -8, 8, -8, 8, 8, -8, 8)
9:1/0/terrains_peering_bit/right_side = 0
9:1/0/terrains_peering_bit/bottom_right_corner = 0
9:1/0/terrains_peering_bit/bottom_side = 0
9:1/0/terrains_peering_bit/bottom_left_corner = 0
9:1/0/terrains_peering_bit/left_side = 0
9:1/0/terrains_peering_bit/top_left_corner = 0
9:1/0/terrains_peering_bit/top_side = 0
10:1/0 = 0
10:1/0/terrain_set = 0
10:1/0/terrain = 0
10:1/0/physics_layer_0/linear_velocity = Vector2(0, 0)
10:1/0/physics_layer_0/angular_velocity = 0.0
10:1/0/physics_layer_0/polygon_0/points = PackedVector2Array(-8, -8, 8, -8, 8, 8, -8, 8)
10:1/0/terrains_peering_bit/right_side = 0
10:1/0/terrains_peering_bit/bottom_right_corner = 0
10:1/0/terrains_peering_bit/bottom_side = 0
10:1/0/terrains_peering_bit/bottom_left_corner = 0
10:1/0/terrains_peering_bit/left_side = 0
10:1/0/terrains_peering_bit/top_side = 0
10:1/0/terrains_peering_bit/top_right_corner = 0
12:1/0 = 0
12:1/0/physics_layer_0/linear_velocity = Vector2(0, 0)
12:1/0/physics_layer_0/angular_velocity = 0.0
12:1/0/physics_layer_0/polygon_0/points = PackedVector2Array(-8, -8, 8, -8, 8, 8, -8, 8)
13:1/0 = 0
13:1/0/physics_layer_0/linear_velocity = Vector2(0, 0)
13:1/0/physics_layer_0/angular_velocity = 0.0
13:1/0/physics_layer_0/polygon_0/points = PackedVector2Array(-8, -8, 8, -8, 8, 8, -8, 8)
14:1/0 = 0
14:1/0/physics_layer_0/linear_velocity = Vector2(0, 0)
14:1/0/physics_layer_0/angular_velocity = 0.0
14:1/0/physics_layer_0/polygon_0/points = PackedVector2Array(-8, -8, 8, -8, 8, 8, -8, 8)
15:1/0 = 0
15:1/0/physics_layer_0/linear_velocity = Vector2(0, 0)
15:1/0/physics_layer_0/angular_velocity = 0.0
15:1/0/physics_layer_0/polygon_0/points = PackedVector2Array(-8, -8, 8, -8, 8, 8, -8, 8)
17:1/0 = 0
17:1/0/physics_layer_0/linear_velocity = Vector2(0, 0)
17:1/0/physics_layer_0/angular_velocity = 0.0
17:1/0/physics_layer_0/polygon_0/points = PackedVector2Array(-8, -8, 8, -8, 8, -3.125, -8, -3.125)
17:1/0/physics_layer_0/polygon_0/one_way = true
18:1/0 = 0
18:1/0/physics_layer_0/linear_velocity = Vector2(0, 0)
18:1/0/physics_layer_0/angular_velocity = 0.0
18:1/0/physics_layer_0/polygon_0/points = PackedVector2Array(-8, -8, 8, -8, 8, -3.125, -8, -3.125)
18:1/0/physics_layer_0/polygon_0/one_way = true
19:1/0 = 0
19:1/0/physics_layer_0/linear_velocity = Vector2(0, 0)
19:1/0/physics_layer_0/angular_velocity = 0.0
19:1/0/physics_layer_0/polygon_0/points = PackedVector2Array(-8, -8, 8, -8, 8, -3.125, -8, -3.125)
19:1/0/physics_layer_0/polygon_0/one_way = true
0:2/0 = 0
0:2/0/physics_layer_0/linear_velocity = Vector2(0, 0)
0:2/0/physics_layer_0/angular_velocity = 0.0
0:2/0/physics_layer_0/polygon_0/points = PackedVector2Array(-8, -8, 8, -8, 8, 8, -8, 8)
1:2/0 = 0
1:2/0/physics_layer_0/linear_velocity = Vector2(0, 0)
1:2/0/physics_layer_0/angular_velocity = 0.0
1:2/0/physics_layer_0/polygon_0/points = PackedVector2Array(-8, -8, 8, -8, 8, 8, -8, 8)
2:2/0 = 0
2:2/0/physics_layer_0/linear_velocity = Vector2(0, 0)
2:2/0/physics_layer_0/angular_velocity = 0.0
2:2/0/physics_layer_0/polygon_0/points = PackedVector2Array(-8, -8, 8, -8, 8, 8, -8, 8)
6:2/0 = 0
6:2/0/terrain_set = 0
6:2/0/terrain = 0
6:2/0/physics_layer_0/linear_velocity = Vector2(0, 0)
6:2/0/physics_layer_0/angular_velocity = 0.0
6:2/0/physics_layer_0/polygon_0/points = PackedVector2Array(-8, -8, 8, -8, 8, 8, -8, 8)
6:2/0/terrains_peering_bit/right_side = 0
6:2/0/terrains_peering_bit/top_side = 0
6:2/0/terrains_peering_bit/top_right_corner = 0
7:2/0 = 0
7:2/0/terrain_set = 0
7:2/0/terrain = 0
7:2/0/physics_layer_0/linear_velocity = Vector2(0, 0)
7:2/0/physics_layer_0/angular_velocity = 0.0
7:2/0/physics_layer_0/polygon_0/points = PackedVector2Array(-8, -8, 8, -8, 8, 8, -8, 8)
7:2/0/terrains_peering_bit/right_side = 0
7:2/0/terrains_peering_bit/left_side = 0
7:2/0/terrains_peering_bit/top_left_corner = 0
7:2/0/terrains_peering_bit/top_side = 0
7:2/0/terrains_peering_bit/top_right_corner = 0
8:2/0 = 0
8:2/0/terrain_set = 0
8:2/0/terrain = 0
8:2/0/physics_layer_0/linear_velocity = Vector2(0, 0)
8:2/0/physics_layer_0/angular_velocity = 0.0
8:2/0/physics_layer_0/polygon_0/points = PackedVector2Array(-8, -8, 8, -8, 8, 8, -8, 8)
8:2/0/terrains_peering_bit/left_side = 0
8:2/0/terrains_peering_bit/top_left_corner = 0
8:2/0/terrains_peering_bit/top_side = 0
13:2/0 = 0
13:2/0/physics_layer_0/linear_velocity = Vector2(0, 0)
13:2/0/physics_layer_0/angular_velocity = 0.0
13:2/0/physics_layer_0/polygon_0/points = PackedVector2Array(-8, -8, 8, -8, 8, 8, -8, 8)
14:2/0 = 0
14:2/0/physics_layer_0/linear_velocity = Vector2(0, 0)
14:2/0/physics_layer_0/angular_velocity = 0.0
14:2/0/physics_layer_0/polygon_0/points = PackedVector2Array(-8, -8, 8, -8, 8, 8, -8, 8)
15:2/0 = 0
15:2/0/physics_layer_0/linear_velocity = Vector2(0, 0)
15:2/0/physics_layer_0/angular_velocity = 0.0
15:2/0/physics_layer_0/polygon_0/points = PackedVector2Array(-8, -8, 8, -8, 8, 8, -8, 8)
17:2/0 = 0
17:2/0/physics_layer_0/linear_velocity = Vector2(0, 0)
17:2/0/physics_layer_0/angular_velocity = 0.0
17:2/0/physics_layer_0/polygon_0/points = PackedVector2Array(-8, -8, 8, -8, 8, -3.125, -8, -3.125)
18:2/0 = 0
18:2/0/physics_layer_0/linear_velocity = Vector2(0, 0)
18:2/0/physics_layer_0/angular_velocity = 0.0
18:2/0/physics_layer_0/polygon_0/points = PackedVector2Array(-8, -8, 8, -8, 8, -3.125, -8, -3.125)
19:2/0 = 0
19:2/0/physics_layer_0/linear_velocity = Vector2(0, 0)
19:2/0/physics_layer_0/angular_velocity = 0.0
19:2/0/physics_layer_0/polygon_0/points = PackedVector2Array(-8, -8, 8, -8, 8, -3.125, -8, -3.125)
0:4/0 = 0
0:4/0/physics_layer_0/linear_velocity = Vector2(0, 0)
0:4/0/physics_layer_0/angular_velocity = 0.0
0:4/0/physics_layer_0/polygon_0/points = PackedVector2Array(-8, -8, 8, -8, 8, 8, -8, 8)
1:4/0 = 0
1:4/0/physics_layer_0/linear_velocity = Vector2(0, 0)
1:4/0/physics_layer_0/angular_velocity = 0.0
1:4/0/physics_layer_0/polygon_0/points = PackedVector2Array(-8, -8, 8, -8, 8, 8, -8, 8)
2:4/0 = 0
2:4/0/physics_layer_0/linear_velocity = Vector2(0, 0)
2:4/0/physics_layer_0/angular_velocity = 0.0
2:4/0/physics_layer_0/polygon_0/points = PackedVector2Array(-8, -8, 8, -8, 8, 8, -8, 8)
3:4/0 = 0
3:4/0/physics_layer_0/linear_velocity = Vector2(0, 0)
3:4/0/physics_layer_0/angular_velocity = 0.0
3:4/0/physics_layer_0/polygon_0/points = PackedVector2Array(-8, -8, 8, -8, 8, 8, -8, 8)
4:4/0 = 0
4:4/0/physics_layer_0/linear_velocity = Vector2(0, 0)
4:4/0/physics_layer_0/angular_velocity = 0.0
4:4/0/physics_layer_0/polygon_0/points = PackedVector2Array(-8, -8, 8, -8, 8, 8, -8, 8)
6:4/0 = 0
6:4/0/terrain_set = 0
6:4/0/terrain = 1
6:4/0/physics_layer_0/linear_velocity = Vector2(0, 0)
6:4/0/physics_layer_0/angular_velocity = 0.0
6:4/0/physics_layer_0/polygon_0/points = PackedVector2Array(-8, -8, 8, -8, 8, 8, -8, 8)
6:4/0/terrains_peering_bit/right_side = 1
6:4/0/terrains_peering_bit/bottom_right_corner = 1
6:4/0/terrains_peering_bit/bottom_side = 1
7:4/0 = 0
7:4/0/terrain_set = 0
7:4/0/terrain = 1
7:4/0/physics_layer_0/linear_velocity = Vector2(0, 0)
7:4/0/physics_layer_0/angular_velocity = 0.0
7:4/0/physics_layer_0/polygon_0/points = PackedVector2Array(-8, -8, 8, -8, 8, 8, -8, 8)
7:4/0/terrains_peering_bit/right_side = 1
7:4/0/terrains_peering_bit/bottom_right_corner = 1
7:4/0/terrains_peering_bit/bottom_side = 1
7:4/0/terrains_peering_bit/bottom_left_corner = 1
7:4/0/terrains_peering_bit/left_side = 1
8:4/0 = 0
8:4/0/terrain_set = 0
8:4/0/terrain = 1
8:4/0/physics_layer_0/linear_velocity = Vector2(0, 0)
8:4/0/physics_layer_0/angular_velocity = 0.0
8:4/0/physics_layer_0/polygon_0/points = PackedVector2Array(-8, -8, 8, -8, 8, 8, -8, 8)
8:4/0/terrains_peering_bit/bottom_side = 1
8:4/0/terrains_peering_bit/bottom_left_corner = 1
8:4/0/terrains_peering_bit/left_side = 1
9:4/0 = 0
9:4/0/physics_layer_0/linear_velocity = Vector2(0, 0)
9:4/0/physics_layer_0/angular_velocity = 0.0
9:4/0/physics_layer_0/polygon_0/points = PackedVector2Array(-8, -8, 8, -8, 8, 8, -8, 8)
10:4/0 = 0
10:4/0/physics_layer_0/linear_velocity = Vector2(0, 0)
10:4/0/physics_layer_0/angular_velocity = 0.0
10:4/0/physics_layer_0/polygon_0/points = PackedVector2Array(-8, -8, 8, -8, 8, 8, -8, 8)
12:4/0 = 0
12:4/0/physics_layer_0/linear_velocity = Vector2(0, 0)
12:4/0/physics_layer_0/angular_velocity = 0.0
12:4/0/physics_layer_0/polygon_0/points = PackedVector2Array(-8, -8, 8, -8, 8, 8, -8, 8)
13:4/0 = 0
13:4/0/physics_layer_0/linear_velocity = Vector2(0, 0)
13:4/0/physics_layer_0/angular_velocity = 0.0
13:4/0/physics_layer_0/polygon_0/points = PackedVector2Array(-8, -8, 8, -8, 8, 8, -8, 8)
14:4/0 = 0
14:4/0/physics_layer_0/linear_velocity = Vector2(0, 0)
14:4/0/physics_layer_0/angular_velocity = 0.0
14:4/0/physics_layer_0/polygon_0/points = PackedVector2Array(-8, -8, 8, -8, 8, 8, -8, 8)
15:4/0 = 0
15:4/0/physics_layer_0/linear_velocity = Vector2(0, 0)
15:4/0/physics_layer_0/angular_velocity = 0.0
15:4/0/physics_layer_0/polygon_0/points = PackedVector2Array(-8, -8, 8, -8, 8, 8, -8, 8)
17:4/0 = 0
17:4/0/physics_layer_0/linear_velocity = Vector2(0, 0)
17:4/0/physics_layer_0/angular_velocity = 0.0
17:4/0/physics_layer_0/polygon_0/points = PackedVector2Array(-8, -8, 8, -8, 8, 8, -8, 8)
18:4/0 = 0
18:4/0/physics_layer_0/linear_velocity = Vector2(0, 0)
18:4/0/physics_layer_0/angular_velocity = 0.0
18:4/0/physics_layer_0/polygon_0/points = PackedVector2Array(-8, -8, 8, -8, 8, 8, -8, 8)
19:4/0 = 0
19:4/0/physics_layer_0/linear_velocity = Vector2(0, 0)
19:4/0/physics_layer_0/angular_velocity = 0.0
19:4/0/physics_layer_0/polygon_0/points = PackedVector2Array(-8, -8, 8, -8, 8, 8, -8, 8)
20:4/0 = 0
20:4/0/physics_layer_0/linear_velocity = Vector2(0, 0)
20:4/0/physics_layer_0/angular_velocity = 0.0
20:4/0/physics_layer_0/polygon_0/points = PackedVector2Array(-8, -8, 8, -8, 8, 8, -8, 8)
21:4/0 = 0
21:4/0/physics_layer_0/linear_velocity = Vector2(0, 0)
21:4/0/physics_layer_0/angular_velocity = 0.0
21:4/0/physics_layer_0/polygon_0/points = PackedVector2Array(-8, -8, 8, -8, 8, 8, -8, 8)
0:5/0 = 0
0:5/0/physics_layer_0/linear_velocity = Vector2(0, 0)
0:5/0/physics_layer_0/angular_velocity = 0.0
0:5/0/physics_layer_0/polygon_0/points = PackedVector2Array(-8, -8, 8, -8, 8, 8, -8, 8)
1:5/0 = 0
1:5/0/physics_layer_0/linear_velocity = Vector2(0, 0)
1:5/0/physics_layer_0/angular_velocity = 0.0
1:5/0/physics_layer_0/polygon_0/points = PackedVector2Array(-8, -8, 8, -8, 8, 8, -8, 8)
2:5/0 = 0
2:5/0/physics_layer_0/linear_velocity = Vector2(0, 0)
2:5/0/physics_layer_0/angular_velocity = 0.0
2:5/0/physics_layer_0/polygon_0/points = PackedVector2Array(-8, -8, 8, -8, 8, 8, -8, 8)
3:5/0 = 0
3:5/0/physics_layer_0/linear_velocity = Vector2(0, 0)
3:5/0/physics_layer_0/angular_velocity = 0.0
3:5/0/physics_layer_0/polygon_0/points = PackedVector2Array(-8, -8, 8, -8, 8, 8, -8, 8)
4:5/0 = 0
4:5/0/physics_layer_0/linear_velocity = Vector2(0, 0)
4:5/0/physics_layer_0/angular_velocity = 0.0
4:5/0/physics_layer_0/polygon_0/points = PackedVector2Array(-8, -8, 8, -8, 8, 8, -8, 8)
6:5/0 = 0
6:5/0/terrain_set = 0
6:5/0/terrain = 1
6:5/0/physics_layer_0/linear_velocity = Vector2(0, 0)
6:5/0/physics_layer_0/angular_velocity = 0.0
6:5/0/physics_layer_0/polygon_0/points = PackedVector2Array(-8, -8, 8, -8, 8, 8, -8, 8)
6:5/0/terrains_peering_bit/right_side = 1
6:5/0/terrains_peering_bit/bottom_right_corner = 1
6:5/0/terrains_peering_bit/bottom_side = 1
6:5/0/terrains_peering_bit/top_side = 1
6:5/0/terrains_peering_bit/top_right_corner = 1
7:5/0 = 0
7:5/0/terrain_set = 0
7:5/0/terrain = 1
7:5/0/physics_layer_0/linear_velocity = Vector2(0, 0)
7:5/0/physics_layer_0/angular_velocity = 0.0
7:5/0/physics_layer_0/polygon_0/points = PackedVector2Array(-8, -8, 8, -8, 8, 8, -8, 8)
7:5/0/terrains_peering_bit/right_side = 1
7:5/0/terrains_peering_bit/bottom_right_corner = 1
7:5/0/terrains_peering_bit/bottom_side = 1
7:5/0/terrains_peering_bit/bottom_left_corner = 1
7:5/0/terrains_peering_bit/left_side = 1
7:5/0/terrains_peering_bit/top_left_corner = 1
7:5/0/terrains_peering_bit/top_side = 1
7:5/0/terrains_peering_bit/top_right_corner = 1
8:5/0 = 0
8:5/0/terrain_set = 0
8:5/0/terrain = 1
8:5/0/physics_layer_0/linear_velocity = Vector2(0, 0)
8:5/0/physics_layer_0/angular_velocity = 0.0
8:5/0/physics_layer_0/polygon_0/points = PackedVector2Array(-8, -8, 8, -8, 8, 8, -8, 8)
8:5/0/terrains_peering_bit/bottom_side = 1
8:5/0/terrains_peering_bit/bottom_left_corner = 1
8:5/0/terrains_peering_bit/left_side = 1
8:5/0/terrains_peering_bit/top_left_corner = 1
8:5/0/terrains_peering_bit/top_side = 1
9:5/0 = 0
9:5/0/terrain_set = 0
9:5/0/terrain = 1
9:5/0/physics_layer_0/linear_velocity = Vector2(0, 0)
9:5/0/physics_layer_0/angular_velocity = 0.0
9:5/0/physics_layer_0/polygon_0/points = PackedVector2Array(-8, -8, 8, -8, 8, 8, -8, 8)
9:5/0/terrains_peering_bit/right_side = 1
9:5/0/terrains_peering_bit/bottom_right_corner = 1
9:5/0/terrains_peering_bit/bottom_side = 1
9:5/0/terrains_peering_bit/bottom_left_corner = 1
9:5/0/terrains_peering_bit/left_side = 1
9:5/0/terrains_peering_bit/top_left_corner = 1
9:5/0/terrains_peering_bit/top_side = 1
10:5/0 = 0
10:5/0/terrain_set = 0
10:5/0/terrain = 1
10:5/0/physics_layer_0/linear_velocity = Vector2(0, 0)
10:5/0/physics_layer_0/angular_velocity = 0.0
10:5/0/physics_layer_0/polygon_0/points = PackedVector2Array(-8, -8, 8, -8, 8, 8, -8, 8)
10:5/0/terrains_peering_bit/right_side = 1
10:5/0/terrains_peering_bit/bottom_right_corner = 1
10:5/0/terrains_peering_bit/bottom_side = 1
10:5/0/terrains_peering_bit/bottom_left_corner = 1
10:5/0/terrains_peering_bit/left_side = 1
10:5/0/terrains_peering_bit/top_side = 1
10:5/0/terrains_peering_bit/top_right_corner = 1
12:5/0 = 0
12:5/0/physics_layer_0/linear_velocity = Vector2(0, 0)
12:5/0/physics_layer_0/angular_velocity = 0.0
12:5/0/physics_layer_0/polygon_0/points = PackedVector2Array(-8, -8, 8, -8, 8, 8, -8, 8)
13:5/0 = 0
13:5/0/physics_layer_0/linear_velocity = Vector2(0, 0)
13:5/0/physics_layer_0/angular_velocity = 0.0
13:5/0/physics_layer_0/polygon_0/points = PackedVector2Array(-8, -8, 8, -8, 8, 8, -8, 8)
14:5/0 = 0
14:5/0/physics_layer_0/linear_velocity = Vector2(0, 0)
14:5/0/physics_layer_0/angular_velocity = 0.0
14:5/0/physics_layer_0/polygon_0/points = PackedVector2Array(-8, -8, 8, -8, 8, 8, -8, 8)
15:5/0 = 0
15:5/0/physics_layer_0/linear_velocity = Vector2(0, 0)
15:5/0/physics_layer_0/angular_velocity = 0.0
15:5/0/physics_layer_0/polygon_0/points = PackedVector2Array(-8, -8, 8, -8, 8, 8, -8, 8)
17:5/0 = 0
17:5/0/physics_layer_0/linear_velocity = Vector2(0, 0)
17:5/0/physics_layer_0/angular_velocity = 0.0
17:5/0/physics_layer_0/polygon_0/points = PackedVector2Array(-8, -8, 8, -8, 8, 8, -8, 8)
18:5/0 = 0
18:5/0/physics_layer_0/linear_velocity = Vector2(0, 0)
18:5/0/physics_layer_0/angular_velocity = 0.0
18:5/0/physics_layer_0/polygon_0/points = PackedVector2Array(-8, -8, 8, -8, 8, 8, -8, 8)
19:5/0 = 0
19:5/0/physics_layer_0/linear_velocity = Vector2(0, 0)
19:5/0/physics_layer_0/angular_velocity = 0.0
19:5/0/physics_layer_0/polygon_0/points = PackedVector2Array(-8, -8, 8, -8, 8, 8, -8, 8)
20:5/0 = 0
20:5/0/physics_layer_0/linear_velocity = Vector2(0, 0)
20:5/0/physics_layer_0/angular_velocity = 0.0
20:5/0/physics_layer_0/polygon_0/points = PackedVector2Array(-8, -8, 8, -8, 8, 8, -8, 8)
21:5/0 = 0
21:5/0/physics_layer_0/linear_velocity = Vector2(0, 0)
21:5/0/physics_layer_0/angular_velocity = 0.0
21:5/0/physics_layer_0/polygon_0/points = PackedVector2Array(-8, -8, 8, -8, 8, 8, -8, 8)
0:6/0 = 0
0:6/0/physics_layer_0/linear_velocity = Vector2(0, 0)
0:6/0/physics_layer_0/angular_velocity = 0.0
0:6/0/physics_layer_0/polygon_0/points = PackedVector2Array(-8, -8, 8, -8, 8, 8, -8, 8)
1:6/0 = 0
1:6/0/physics_layer_0/linear_velocity = Vector2(0, 0)
1:6/0/physics_layer_0/angular_velocity = 0.0
1:6/0/physics_layer_0/polygon_0/points = PackedVector2Array(-8, -8, 8, -8, 8, 8, -8, 8)
2:6/0 = 0
2:6/0/physics_layer_0/linear_velocity = Vector2(0, 0)
2:6/0/physics_layer_0/angular_velocity = 0.0
2:6/0/physics_layer_0/polygon_0/points = PackedVector2Array(-8, -8, 8, -8, 8, 8, -8, 8)
6:6/0 = 0
6:6/0/terrain_set = 0
6:6/0/terrain = 1
6:6/0/physics_layer_0/linear_velocity = Vector2(0, 0)
6:6/0/physics_layer_0/angular_velocity = 0.0
6:6/0/physics_layer_0/polygon_0/points = PackedVector2Array(-8, -8, 8, -8, 8, 8, -8, 8)
6:6/0/terrains_peering_bit/right_side = 1
6:6/0/terrains_peering_bit/top_side = 1
6:6/0/terrains_peering_bit/top_right_corner = 1
7:6/0 = 0
7:6/0/terrain_set = 0
7:6/0/terrain = 1
7:6/0/physics_layer_0/linear_velocity = Vector2(0, 0)
7:6/0/physics_layer_0/angular_velocity = 0.0
7:6/0/physics_layer_0/polygon_0/points = PackedVector2Array(-8, -8, 8, -8, 8, 8, -8, 8)
7:6/0/terrains_peering_bit/right_side = 1
7:6/0/terrains_peering_bit/left_side = 1
7:6/0/terrains_peering_bit/top_left_corner = 1
7:6/0/terrains_peering_bit/top_side = 1
7:6/0/terrains_peering_bit/top_right_corner = 1
8:6/0 = 0
8:6/0/terrain_set = 0
8:6/0/terrain = 1
8:6/0/physics_layer_0/linear_velocity = Vector2(0, 0)
8:6/0/physics_layer_0/angular_velocity = 0.0
8:6/0/physics_layer_0/polygon_0/points = PackedVector2Array(-8, -8, 8, -8, 8, 8, -8, 8)
8:6/0/terrains_peering_bit/left_side = 1
8:6/0/terrains_peering_bit/top_left_corner = 1
8:6/0/terrains_peering_bit/top_side = 1
13:6/0 = 0
13:6/0/physics_layer_0/linear_velocity = Vector2(0, 0)
13:6/0/physics_layer_0/angular_velocity = 0.0
13:6/0/physics_layer_0/polygon_0/points = PackedVector2Array(-8, -8, 8, -8, 8, 8, -8, 8)
14:6/0 = 0
14:6/0/physics_layer_0/linear_velocity = Vector2(0, 0)
14:6/0/physics_layer_0/angular_velocity = 0.0
14:6/0/physics_layer_0/polygon_0/points = PackedVector2Array(-8, -8, 8, -8, 8, 8, -8, 8)
15:6/0 = 0
15:6/0/physics_layer_0/linear_velocity = Vector2(0, 0)
15:6/0/physics_layer_0/angular_velocity = 0.0
15:6/0/physics_layer_0/polygon_0/points = PackedVector2Array(-8, -8, 8, -8, 8, 8, -8, 8)
17:6/0 = 0
17:6/0/physics_layer_0/linear_velocity = Vector2(0, 0)
17:6/0/physics_layer_0/angular_velocity = 0.0
17:6/0/physics_layer_0/polygon_0/points = PackedVector2Array(-8, -8, 8, -8, 8, 8, -8, 8)
18:6/0 = 0
18:6/0/physics_layer_0/linear_velocity = Vector2(0, 0)
18:6/0/physics_layer_0/angular_velocity = 0.0
18:6/0/physics_layer_0/polygon_0/points = PackedVector2Array(-8, -8, 8, -8, 8, 8, -8, 8)
19:6/0 = 0
19:6/0/physics_layer_0/linear_velocity = Vector2(0, 0)
19:6/0/physics_layer_0/angular_velocity = 0.0
19:6/0/physics_layer_0/polygon_0/points = PackedVector2Array(-8, -8, 8, -8, 8, 8, -8, 8)
0:8/0 = 0
0:8/0/physics_layer_0/linear_velocity = Vector2(0, 0)
0:8/0/physics_layer_0/angular_velocity = 0.0
0:8/0/physics_layer_0/polygon_0/points = PackedVector2Array(-8, -8, 8, -8, 8, 8, -8, 8)
1:8/0 = 0
1:8/0/physics_layer_0/linear_velocity = Vector2(0, 0)
1:8/0/physics_layer_0/angular_velocity = 0.0
1:8/0/physics_layer_0/polygon_0/points = PackedVector2Array(-8, -8, 8, -8, 8, 8, -8, 8)
2:8/0 = 0
2:8/0/physics_layer_0/linear_velocity = Vector2(0, 0)
2:8/0/physics_layer_0/angular_velocity = 0.0
2:8/0/physics_layer_0/polygon_0/points = PackedVector2Array(-8, -8, 8, -8, 8, 8, -8, 8)
3:8/0 = 0
3:8/0/physics_layer_0/linear_velocity = Vector2(0, 0)
3:8/0/physics_layer_0/angular_velocity = 0.0
3:8/0/physics_layer_0/polygon_0/points = PackedVector2Array(-8, -8, 8, -8, 8, 8, -8, 8)
4:8/0 = 0
4:8/0/physics_layer_0/linear_velocity = Vector2(0, 0)
4:8/0/physics_layer_0/angular_velocity = 0.0
4:8/0/physics_layer_0/polygon_0/points = PackedVector2Array(-8, -8, 8, -8, 8, 8, -8, 8)
6:8/0 = 0
6:8/0/terrain_set = 0
6:8/0/terrain = 2
6:8/0/physics_layer_0/linear_velocity = Vector2(0, 0)
6:8/0/physics_layer_0/angular_velocity = 0.0
6:8/0/physics_layer_0/polygon_0/points = PackedVector2Array(-8, -8, 8, -8, 8, 8, -8, 8)
6:8/0/terrains_peering_bit/right_side = 2
6:8/0/terrains_peering_bit/bottom_right_corner = 2
6:8/0/terrains_peering_bit/bottom_side = 2
7:8/0 = 0
7:8/0/terrain_set = 0
7:8/0/terrain = 2
7:8/0/physics_layer_0/linear_velocity = Vector2(0, 0)
7:8/0/physics_layer_0/angular_velocity = 0.0
7:8/0/physics_layer_0/polygon_0/points = PackedVector2Array(-8, -8, 8, -8, 8, 8, -8, 8)
7:8/0/terrains_peering_bit/right_side = 2
7:8/0/terrains_peering_bit/bottom_right_corner = 2
7:8/0/terrains_peering_bit/bottom_side = 2
7:8/0/terrains_peering_bit/bottom_left_corner = 2
7:8/0/terrains_peering_bit/left_side = 2
8:8/0 = 0
8:8/0/terrain_set = 0
8:8/0/terrain = 2
8:8/0/physics_layer_0/linear_velocity = Vector2(0, 0)
8:8/0/physics_layer_0/angular_velocity = 0.0
8:8/0/physics_layer_0/polygon_0/points = PackedVector2Array(-8, -8, 8, -8, 8, 8, -8, 8)
8:8/0/terrains_peering_bit/bottom_side = 2
8:8/0/terrains_peering_bit/bottom_left_corner = 2
8:8/0/terrains_peering_bit/left_side = 2
9:8/0 = 0
9:8/0/physics_layer_0/linear_velocity = Vector2(0, 0)
9:8/0/physics_layer_0/angular_velocity = 0.0
9:8/0/physics_layer_0/polygon_0/points = PackedVector2Array(-8, -8, 8, -8, 8, 8, -8, 8)
10:8/0 = 0
10:8/0/physics_layer_0/linear_velocity = Vector2(0, 0)
10:8/0/physics_layer_0/angular_velocity = 0.0
10:8/0/physics_layer_0/polygon_0/points = PackedVector2Array(-8, -8, 8, -8, 8, 8, -8, 8)
12:8/0 = 0
12:8/0/physics_layer_0/linear_velocity = Vector2(0, 0)
12:8/0/physics_layer_0/angular_velocity = 0.0
12:8/0/physics_layer_0/polygon_0/points = PackedVector2Array(-8, -8, 8, -8, 8, 8, -8, 8)
13:8/0 = 0
13:8/0/physics_layer_0/linear_velocity = Vector2(0, 0)
13:8/0/physics_layer_0/angular_velocity = 0.0
13:8/0/physics_layer_0/polygon_0/points = PackedVector2Array(-8, -8, 8, -8, 8, 8, -8, 8)
14:8/0 = 0
14:8/0/physics_layer_0/linear_velocity = Vector2(0, 0)
14:8/0/physics_layer_0/angular_velocity = 0.0
14:8/0/physics_layer_0/polygon_0/points = PackedVector2Array(-8, -8, 8, -8, 8, 8, -8, 8)
15:8/0 = 0
15:8/0/physics_layer_0/linear_velocity = Vector2(0, 0)
15:8/0/physics_layer_0/angular_velocity = 0.0
15:8/0/physics_layer_0/polygon_0/points = PackedVector2Array(-8, -8, 8, -8, 8, 8, -8, 8)
17:8/0 = 0
17:8/0/physics_layer_0/linear_velocity = Vector2(0, 0)
17:8/0/physics_layer_0/angular_velocity = 0.0
17:8/0/physics_layer_0/polygon_0/points = PackedVector2Array(-8, -8, 8, -8, 8, 8, -8, 8)
18:8/0 = 0
18:8/0/physics_layer_0/linear_velocity = Vector2(0, 0)
18:8/0/physics_layer_0/angular_velocity = 0.0
18:8/0/physics_layer_0/polygon_0/points = PackedVector2Array(-8, -8, 8, -8, 8, 8, -8, 8)
19:8/0 = 0
19:8/0/physics_layer_0/linear_velocity = Vector2(0, 0)
19:8/0/physics_layer_0/angular_velocity = 0.0
19:8/0/physics_layer_0/polygon_0/points = PackedVector2Array(-8, -8, 8, -8, 8, 8, -8, 8)
20:8/0 = 0
20:8/0/physics_layer_0/linear_velocity = Vector2(0, 0)
20:8/0/physics_layer_0/angular_velocity = 0.0
20:8/0/physics_layer_0/polygon_0/points = PackedVector2Array(-8, -8, 8, -8, 8, 8, -8, 8)
0:9/0 = 0
0:9/0/physics_layer_0/linear_velocity = Vector2(0, 0)
0:9/0/physics_layer_0/angular_velocity = 0.0
0:9/0/physics_layer_0/polygon_0/points = PackedVector2Array(-8, -8, 8, -8, 8, 8, -8, 8)
1:9/0 = 0
1:9/0/physics_layer_0/linear_velocity = Vector2(0, 0)
1:9/0/physics_layer_0/angular_velocity = 0.0
1:9/0/physics_layer_0/polygon_0/points = PackedVector2Array(-8, -8, 8, -8, 8, 8, -8, 8)
2:9/0 = 0
2:9/0/physics_layer_0/linear_velocity = Vector2(0, 0)
2:9/0/physics_layer_0/angular_velocity = 0.0
2:9/0/physics_layer_0/polygon_0/points = PackedVector2Array(-8, -8, 8, -8, 8, 8, -8, 8)
3:9/0 = 0
3:9/0/physics_layer_0/linear_velocity = Vector2(0, 0)
3:9/0/physics_layer_0/angular_velocity = 0.0
3:9/0/physics_layer_0/polygon_0/points = PackedVector2Array(-8, -8, 8, -8, 8, 8, -8, 8)
4:9/0 = 0
4:9/0/physics_layer_0/linear_velocity = Vector2(0, 0)
4:9/0/physics_layer_0/angular_velocity = 0.0
4:9/0/physics_layer_0/polygon_0/points = PackedVector2Array(-8, -8, 8, -8, 8, 8, -8, 8)
6:9/0 = 0
6:9/0/terrain_set = 0
6:9/0/terrain = 2
6:9/0/physics_layer_0/linear_velocity = Vector2(0, 0)
6:9/0/physics_layer_0/angular_velocity = 0.0
6:9/0/physics_layer_0/polygon_0/points = PackedVector2Array(-8, -8, 8, -8, 8, 8, -8, 8)
6:9/0/terrains_peering_bit/right_side = 2
6:9/0/terrains_peering_bit/bottom_right_corner = 2
6:9/0/terrains_peering_bit/bottom_side = 2
6:9/0/terrains_peering_bit/top_side = 2
6:9/0/terrains_peering_bit/top_right_corner = 2
7:9/0 = 0
7:9/0/terrain_set = 0
7:9/0/terrain = 2
7:9/0/physics_layer_0/linear_velocity = Vector2(0, 0)
7:9/0/physics_layer_0/angular_velocity = 0.0
7:9/0/physics_layer_0/polygon_0/points = PackedVector2Array(-8, -8, 8, -8, 8, 8, -8, 8)
7:9/0/terrains_peering_bit/right_side = 2
7:9/0/terrains_peering_bit/bottom_right_corner = 2
7:9/0/terrains_peering_bit/bottom_side = 2
7:9/0/terrains_peering_bit/bottom_left_corner = 2
7:9/0/terrains_peering_bit/left_side = 2
7:9/0/terrains_peering_bit/top_left_corner = 2
7:9/0/terrains_peering_bit/top_side = 2
7:9/0/terrains_peering_bit/top_right_corner = 2
8:9/0 = 0
8:9/0/terrain_set = 0
8:9/0/terrain = 2
8:9/0/physics_layer_0/linear_velocity = Vector2(0, 0)
8:9/0/physics_layer_0/angular_velocity = 0.0
8:9/0/physics_layer_0/polygon_0/points = PackedVector2Array(-8, -8, 8, -8, 8, 8, -8, 8)
8:9/0/terrains_peering_bit/bottom_side = 2
8:9/0/terrains_peering_bit/bottom_left_corner = 2
8:9/0/terrains_peering_bit/left_side = 2
8:9/0/terrains_peering_bit/top_left_corner = 2
8:9/0/terrains_peering_bit/top_side = 2
9:9/0 = 0
9:9/0/terrain_set = 0
9:9/0/terrain = 2
9:9/0/physics_layer_0/linear_velocity = Vector2(0, 0)
9:9/0/physics_layer_0/angular_velocity = 0.0
9:9/0/physics_layer_0/polygon_0/points = PackedVector2Array(-8, -8, 8, -8, 8, 8, -8, 8)
9:9/0/terrains_peering_bit/right_side = 2
9:9/0/terrains_peering_bit/bottom_right_corner = 2
9:9/0/terrains_peering_bit/bottom_side = 2
9:9/0/terrains_peering_bit/bottom_left_corner = 2
9:9/0/terrains_peering_bit/left_side = 2
9:9/0/terrains_peering_bit/top_left_corner = 2
9:9/0/terrains_peering_bit/top_side = 2
10:9/0 = 0
10:9/0/terrain_set = 0
10:9/0/terrain = 2
10:9/0/physics_layer_0/linear_velocity = Vector2(0, 0)
10:9/0/physics_layer_0/angular_velocity = 0.0
10:9/0/physics_layer_0/polygon_0/points = PackedVector2Array(-8, -8, 8, -8, 8, 8, -8, 8)
10:9/0/terrains_peering_bit/right_side = 2
10:9/0/terrains_peering_bit/bottom_right_corner = 2
10:9/0/terrains_peering_bit/bottom_side = 2
10:9/0/terrains_peering_bit/bottom_left_corner = 2
10:9/0/terrains_peering_bit/left_side = 2
10:9/0/terrains_peering_bit/top_side = 2
10:9/0/terrains_peering_bit/top_right_corner = 2
12:9/0 = 0
12:9/0/physics_layer_0/linear_velocity = Vector2(0, 0)
12:9/0/physics_layer_0/angular_velocity = 0.0
12:9/0/physics_layer_0/polygon_0/points = PackedVector2Array(-8, -8, 8, -8, 8, 8, -8, 8)
13:9/0 = 0
13:9/0/physics_layer_0/linear_velocity = Vector2(0, 0)
13:9/0/physics_layer_0/angular_velocity = 0.0
13:9/0/physics_layer_0/polygon_0/points = PackedVector2Array(-8, -8, 8, -8, 8, 8, -8, 8)
14:9/0 = 0
14:9/0/physics_layer_0/linear_velocity = Vector2(0, 0)
14:9/0/physics_layer_0/angular_velocity = 0.0
14:9/0/physics_layer_0/polygon_0/points = PackedVector2Array(-8, -8, 8, -8, 8, 8, -8, 8)
15:9/0 = 0
15:9/0/physics_layer_0/linear_velocity = Vector2(0, 0)
15:9/0/physics_layer_0/angular_velocity = 0.0
15:9/0/physics_layer_0/polygon_0/points = PackedVector2Array(-8, -8, 8, -8, 8, 8, -8, 8)
17:9/0 = 0
17:9/0/physics_layer_0/linear_velocity = Vector2(0, 0)
17:9/0/physics_layer_0/angular_velocity = 0.0
17:9/0/physics_layer_0/polygon_0/points = PackedVector2Array(-8, -8, 8, -8, 8, 8, -8, 8)
18:9/0 = 0
18:9/0/physics_layer_0/linear_velocity = Vector2(0, 0)
18:9/0/physics_layer_0/angular_velocity = 0.0
18:9/0/physics_layer_0/polygon_0/points = PackedVector2Array(-8, -8, 8, -8, 8, 8, -8, 8)
19:9/0 = 0
19:9/0/physics_layer_0/linear_velocity = Vector2(0, 0)
19:9/0/physics_layer_0/angular_velocity = 0.0
19:9/0/physics_layer_0/polygon_0/points = PackedVector2Array(-8, -8, 8, -8, 8, 8, -8, 8)
20:9/0 = 0
20:9/0/physics_layer_0/linear_velocity = Vector2(0, 0)
20:9/0/physics_layer_0/angular_velocity = 0.0
20:9/0/physics_layer_0/polygon_0/points = PackedVector2Array(-8, -8, 8, -8, 8, 8, -8, 8)
0:10/0 = 0
0:10/0/physics_layer_0/linear_velocity = Vector2(0, 0)
0:10/0/physics_layer_0/angular_velocity = 0.0
0:10/0/physics_layer_0/polygon_0/points = PackedVector2Array(-8, -8, 8, -8, 8, 8, -8, 8)
1:10/0 = 0
1:10/0/physics_layer_0/linear_velocity = Vector2(0, 0)
1:10/0/physics_layer_0/angular_velocity = 0.0
1:10/0/physics_layer_0/polygon_0/points = PackedVector2Array(-8, -8, 8, -8, 8, 8, -8, 8)
2:10/0 = 0
2:10/0/physics_layer_0/linear_velocity = Vector2(0, 0)
2:10/0/physics_layer_0/angular_velocity = 0.0
2:10/0/physics_layer_0/polygon_0/points = PackedVector2Array(-8, -8, 8, -8, 8, 8, -8, 8)
6:10/0 = 0
6:10/0/terrain_set = 0
6:10/0/terrain = 2
6:10/0/physics_layer_0/linear_velocity = Vector2(0, 0)
6:10/0/physics_layer_0/angular_velocity = 0.0
6:10/0/physics_layer_0/polygon_0/points = PackedVector2Array(-8, -8, 8, -8, 8, 8, -8, 8)
6:10/0/terrains_peering_bit/right_side = 2
6:10/0/terrains_peering_bit/top_side = 2
6:10/0/terrains_peering_bit/top_right_corner = 2
7:10/0 = 0
7:10/0/terrain_set = 0
7:10/0/terrain = 2
7:10/0/physics_layer_0/linear_velocity = Vector2(0, 0)
7:10/0/physics_layer_0/angular_velocity = 0.0
7:10/0/physics_layer_0/polygon_0/points = PackedVector2Array(-8, -8, 8, -8, 8, 8, -8, 8)
7:10/0/terrains_peering_bit/right_side = 2
7:10/0/terrains_peering_bit/left_side = 2
7:10/0/terrains_peering_bit/top_left_corner = 2
7:10/0/terrains_peering_bit/top_side = 2
7:10/0/terrains_peering_bit/top_right_corner = 2
8:10/0 = 0
8:10/0/terrain_set = 0
8:10/0/terrain = 2
8:10/0/physics_layer_0/linear_velocity = Vector2(0, 0)
8:10/0/physics_layer_0/angular_velocity = 0.0
8:10/0/physics_layer_0/polygon_0/points = PackedVector2Array(-8, -8, 8, -8, 8, 8, -8, 8)
8:10/0/terrains_peering_bit/left_side = 2
8:10/0/terrains_peering_bit/top_left_corner = 2
8:10/0/terrains_peering_bit/top_side = 2
13:10/0 = 0
13:10/0/physics_layer_0/linear_velocity = Vector2(0, 0)
13:10/0/physics_layer_0/angular_velocity = 0.0
13:10/0/physics_layer_0/polygon_0/points = PackedVector2Array(-8, -8, 8, -8, 8, 8, -8, 8)
14:10/0 = 0
14:10/0/physics_layer_0/linear_velocity = Vector2(0, 0)
14:10/0/physics_layer_0/angular_velocity = 0.0
14:10/0/physics_layer_0/polygon_0/points = PackedVector2Array(-8, -8, 8, -8, 8, 8, -8, 8)
15:10/0 = 0
15:10/0/physics_layer_0/linear_velocity = Vector2(0, 0)
15:10/0/physics_layer_0/angular_velocity = 0.0
15:10/0/physics_layer_0/polygon_0/points = PackedVector2Array(-8, -8, 8, -8, 8, 8, -8, 8)
18:10/0 = 0
18:10/0/physics_layer_0/linear_velocity = Vector2(0, 0)
18:10/0/physics_layer_0/angular_velocity = 0.0
18:10/0/physics_layer_0/polygon_0/points = PackedVector2Array(-8, -8, 8, -8, 8, 8, -8, 8)
19:10/0 = 0
19:10/0/physics_layer_0/linear_velocity = Vector2(0, 0)
19:10/0/physics_layer_0/angular_velocity = 0.0
19:10/0/physics_layer_0/polygon_0/points = PackedVector2Array(-8, -8, 8, -8, 8, 8, -8, 8)
20:10/0 = 0
20:10/0/physics_layer_0/linear_velocity = Vector2(0, 0)
20:10/0/physics_layer_0/angular_velocity = 0.0
20:10/0/physics_layer_0/polygon_0/points = PackedVector2Array(-8, -8, 8, -8, 8, 8, -8, 8)

[sub_resource type="TileSet" id="TileSet_a1emk"]
physics_layer_0/collision_layer = 1
physics_layer_0/collision_mask = 2
terrain_set_0/mode = 0
terrain_set_0/terrain_0/name = "Terrain 0"
terrain_set_0/terrain_0/color = Color(0.5, 0.34375, 0.25, 1)
terrain_set_0/terrain_1/name = "Terrain 1"
terrain_set_0/terrain_1/color = Color(0.501961, 0.439216, 0.25098, 1)
terrain_set_0/terrain_2/name = "Terrain 2"
terrain_set_0/terrain_2/color = Color(0.46875, 0.5, 0.25, 1)
sources/0 = SubResource("TileSetAtlasSource_wcgj7")
pattern_0 = SubResource("TileMapPattern_c5out")

[node name="TileMap" type="TileMap"]
tile_set = SubResource("TileSet_a1emk")
format = 2
