[gd_scene load_steps=2 format=3 uid="uid://dr4f4pv085uqv"]

[ext_resource type="Script" path="res://scripts/enemy_spawner.cs" id="1_yet1y"]

[node name="EnemySpawner" type="Node2D"]
script = ExtResource("1_yet1y")

[node name="SpawnPositions" type="Node" parent="."]

[node name="SpawnPosition_01" type="Marker2D" parent="SpawnPositions"]
position = Vector2(1326, 84)

[node name="SpawnPosition_02" type="Marker2D" parent="SpawnPositions"]
position = Vector2(1328, 173)

[node name="SpawnPosition_03" type="Marker2D" parent="SpawnPositions"]
position = Vector2(1329, 291)

[node name="SpawnPosition_04" type="Marker2D" parent="SpawnPositions"]
position = Vector2(1325, 401)

[node name="SpawnPosition_05" type="Marker2D" parent="SpawnPositions"]
position = Vector2(1325, 517)

[node name="SpawnPosition_06" type="Marker2D" parent="SpawnPositions"]
position = Vector2(1324, 619)

[node name="Timer" type="Timer" parent="."]
wait_time = 3.0
autostart = true

[node name="PathEnemyTimer" type="Timer" parent="."]
autostart = true

[node name="EnemyContainer" type="Node" parent="."]

[connection signal="timeout" from="Timer" to="." method="_on_timer_timeout"]
[connection signal="timeout" from="PathEnemyTimer" to="." method="_on_path_enemy_timer_timeout"]
