[gd_scene load_steps=4 format=3 uid="uid://v341w6aan7ud"]

[ext_resource type="Script" path="res://scripts/enemy.cs" id="1_yu8p8"]
[ext_resource type="Texture2D" uid="uid://ba32yewl260mc" path="res://assets/textures/enemy_ship.png" id="2_0qlo0"]

[sub_resource type="CapsuleShape2D" id="CapsuleShape2D_b7aac"]
radius = 23.0
height = 108.0

[node name="enemy" type="Area2D"]
collision_layer = 2
collision_mask = 13
script = ExtResource("1_yu8p8")

[node name="CollisionShape2D" type="CollisionShape2D" parent="."]
rotation = -1.5708
shape = SubResource("CapsuleShape2D_b7aac")

[node name="Sprite2D" type="Sprite2D" parent="."]
rotation = -1.5708
scale = Vector2(0.2, 0.2)
texture = ExtResource("2_0qlo0")

[node name="VisibleNotifier2D" type="VisibleOnScreenNotifier2D" parent="."]

[connection signal="body_entered" from="." to="." method="_enemy_on_body_shape_entered"]
