{
  "project_info": {
    "project_number": "651212253747",
    "firebase_url": "https://gotoesig-e2e90.firebaseio.com",
    "project_id": "gotoesig-e2e90",
    "storage_bucket": "gotoesig-e2e90.appspot.com"
  },
  "client": [
    {
      "client_info": {
        "mobilesdk_app_id": "1:651212253747:android:9f690d54404132e4abd146",
        "android_client_info": {
          "package_name": "com.source.gotoesig"
        }
      },
      "oauth_client": [
        {
          "client_id": "651212253747-pt1vde5053krdr24addbg782s7ineueu.apps.googleusercontent.com",
          "client_type": 3
        }
      ],
      "api_key": [
        {
          "current_key": "AIzaSyA_TgeVQVTJn-j46YoOF0SjG-lTgV8LkVA"
        }
      ],
      "services": {
        "appinvite_service": {
          "other_platform_oauth_client": [
            {
              "client_id": "651212253747-pt1vde5053krdr24addbg782s7ineueu.apps.googleusercontent.com",
              "client_type": 3
            }
          ]
        }
      }
    }
  ],
  "configuration_version": "1"
}