[{
        "id": 1,
        "nombre": "Career",
        "imagen": "https://images-na.ssl-images-amazon.com/images/I/51IY4ohvfUL._AC_.jpg"
    },
    {
        "id": 2,
        "nombre": "Animal",
        "imagen": "https://upload.wikimedia.org/wikipedia/commons/b/b1/Chuck_Norris%2C_The_Delta_Force_1986.jpg"
    },
    {
        "id": 3,
        "nombre": "Celebrity",
        "imagen": "https://elsol-compress-release.s3-accelerate.amazonaws.com/images/large/1566905779573Chuck-Norris.jpg"
    },
    {
        "id": 4,
        "nombre": "Dev",
        "imagen": "https://c8.alamy.com/compes/b7wdt9/top-dog-ano-1995-director-chuck-norris-usa-aaron-norris-b7wdt9.jpg"
    },
    {
        "id": 5,
        "nombre": "Explicit",
        "imagen": "https://www.telemundo.com/sites/nbcutelemundo/files/styles/full/public/images/mpx/2019/08/28/190828_4020318_Chuck_Norris_dejo_su_carrera_para_cuidar_a_s.jpg"
    }
]