<?xml version="1.0" encoding="UTF-8" standalone="no"?>
<!DOCTYPE svg PUBLIC "-//W3C//DTD SVG 1.1//EN" "http://www.w3.org/Graphics/SVG/1.1/DTD/svg11.dtd">
<svg width="100%" height="100%" viewBox="0 0 78 91" version="1.1" xmlns="http://www.w3.org/2000/svg" xmlns:xlink="http://www.w3.org/1999/xlink" xml:space="preserve" xmlns:serif="http://www.serif.com/" style="fill-rule:evenodd;clip-rule:evenodd;stroke-linejoin:round;stroke-miterlimit:2;">
    <g transform="matrix(1,0,0,1,-222.25,-136.463)">
        <g transform="matrix(1,0,0,1,288.527,214.494)">
            <path d="M0,-66.14C-6.96,-73.613 -13.643,-78.827 -36.423,-77.931L-39.072,-77.931L-45.735,-77.987L-39.823,-72.145L-28.923,-60.736L-21.06,-60.736C-16.906,-60.736 -12.967,-55.604 -10.792,-52.183C-6.154,-44.89 -4.201,-26.047 -11.251,-14.219C-16.469,-5.449 -21.378,-4.752 -27.256,-4.752L-29.504,-4.752L-39.772,5.413L-47.198,12.687L-39.965,12.657C-39.942,12.658 -39.92,12.661 -39.896,12.661C-39.404,12.661 -38.918,12.662 -38.437,12.662C-23.191,12.662 -13.686,12.376 -1.733,2.859C3.197,-1.073 6.3,-8.33 8.035,-13.726C13.241,-29.935 12.775,-52.428 0,-66.14" style="fill:rgb(242,101,48);fill-rule:nonzero;"/>
        </g>
        <g transform="matrix(1,0,0,1,242.101,182.507)">
            <path d="M0,-1.023L13.085,-14.108L-17.215,-45.697L-17.247,-25.528L-6.843,-14.327L-19.851,-1.32L-6.273,13.096L-17.627,24.718L-17.417,44.674L13.51,13.321L0,-1.023Z" style="fill:rgb(242,101,48);fill-rule:nonzero;"/>
        </g>
    </g>
</svg>
