<?xml version="1.0" encoding="UTF-8" standalone="no"?>
<svg
   xmlns:dc="http://purl.org/dc/elements/1.1/"
   xmlns:cc="http://creativecommons.org/ns#"
   xmlns:rdf="http://www.w3.org/1999/02/22-rdf-syntax-ns#"
   xmlns:svg="http://www.w3.org/2000/svg"
   xmlns="http://www.w3.org/2000/svg"
   xmlns:xlink="http://www.w3.org/1999/xlink"
   xmlns:sodipodi="http://sodipodi.sourceforge.net/DTD/sodipodi-0.dtd"
   xmlns:inkscape="http://www.inkscape.org/namespaces/inkscape"
   enable-background="new 0 0 515.91 728.5"
   height="16"
   id="Layer_1"
   version="1.1"
   viewBox="0 0 512.00003 512"
   width="16"
   xml:space="preserve"
   inkscape:version="0.91 r13725"
   sodipodi:docname="tor_proxy_mode_reload.svg"><metadata
     id="metadata3410"><rdf:RDF><cc:Work
         rdf:about=""><dc:format>image/svg+xml</dc:format><dc:type
           rdf:resource="http://purl.org/dc/dcmitype/StillImage" /><dc:title></dc:title></cc:Work></rdf:RDF></metadata><sodipodi:namedview
     pagecolor="#ffffff"
     bordercolor="#666666"
     borderopacity="1"
     objecttolerance="10"
     gridtolerance="10"
     guidetolerance="10"
     inkscape:pageopacity="0"
     inkscape:pageshadow="2"
     inkscape:window-width="1295"
     inkscape:window-height="744"
     id="namedview3408"
     showgrid="false"
     inkscape:zoom="1.1425781"
     inkscape:cx="256"
     inkscape:cy="256"
     inkscape:window-x="65"
     inkscape:window-y="24"
     inkscape:window-maximized="1"
     inkscape:current-layer="Layer_1" /><defs
     id="defs7" /><g
     id="g6907"
     transform="translate(-402.72312,-200.33327)"><path
       d="m -733.62329,72.267944 c 0,203.804876 -165.21649,369.021366 -369.02141,369.021366 -203.8048,0 -369.0213,-165.21649 -369.0213,-369.021366 0,-203.804874 165.2165,-369.021364 369.0213,-369.021364 203.80492,0 369.02141,165.21649 369.02141,369.021364 z"
       id="path5070"
       style="fill:#FFD700;fill-opacity:1;fill-rule:nonzero;stroke:none"
       transform="matrix(0.69372682,0,0,0.69372682,1423.6573,406.19906)" /><path
       d="m 723.53196,283.83325 c -23.7152,17.0853 -44.3711,36.4707 -57.375,62.2227 l 9.1833,-36.4713 c -13.741,24.4841 -23.16811,49.8059 -26.18021,74.56251 l -18.4381,-12.3397 -3.3113,2.5489 c 16.5756,29.8315 7.9107,45.6423 -0.2501,51.2527 -16.5756,11.4749 -40.8066,25.7518 -52.7892,38.246 -23.2056,23.7132 -29.8409,46.4084 -27.8002,76.2418 2.2946,38.25001 30.0938,70.12001 67.3206,82.61421 16.3179,5.3566 31.3621,6.1222 48.19171,6.1222 27.029,0 54.8238,-7.1353 74.9673,-23.9648 21.4187,-17.8488 34.1725,-44.6256 34.1725,-72.41841 0,-28.0485 -11.7308,-54.5745 -32.3858,-73.4428 -10.9651,-9.9438 -24.7411,-18.0965 -39.0202,-26.0015 -6.3742,-3.5717 -26.009,-18.8666 -19.3791,-40.795 l -14.1978,-1.9415 c 19.7024,-30.84491 45.3352,-61.50381 77.4329,-90.11801 -24.7326,8.4147 -46.6533,21.1684 -62.9731,44.1181 9.6899,-20.1435 25.4925,-40.2926 42.8318,-60.4361 z m -88.98661,95.87101 14.436,5.9555 c 0,0.01 9e-4,0.016 0,0.024 l 6.3486,2.7633 -0.143,0 0,140.5846 c -2.8144,8.4267 -5.2362,9.7924 -11.9585,17.71161 -7.9032,9.1803 -9.2191,22.6971 -9.2191,33.6603 0,4.5911 1.8342,9.6883 3.6209,14.5313 2.0388,5.1008 3.7824,10.1836 6.5868,14.0073 3.6154,5.3173 8.1007,8.6595 10.9699,9.9217 l 0,0.6552 c -9.8068,-2.0917 -21.0397,-5.5748 -27.7644,-11.3392 -13.5135,-11.7287 -25.4829,-31.3446 -27.014,-48.4299 -1.2733,-14.0233 11.7103,-34.70071 29.8131,-45.15431 15.2985,-8.9244 18.8523,-19.0914 22.1663,-35.4112 -4.5892,14.2791 -8.9021,26.2493 -23.6908,33.8986 -21.4188,11.2189 -32.4048,30.04491 -31.3854,47.89381 1.5291,22.9478 10.7217,38.4945 28.8244,50.9907 5.2508,3.6756 13.6234,7.5003 21.2492,10.0289 -27.8159,-6.4371 -30.5727,-9.4369 -38.5915,-18.9145 0,-0.5097 -2.0367,-1.7892 -2.0367,-2.2988 -10.1996,-11.7306 -23.2109,-31.6197 -27.8001,-49.9783 -1.531,-6.374 -3.0594,-13.25321 -1.2745,-19.62921 8.4128,-30.0891 26.7719,-41.8177 45.1305,-54.3137 4.5892,-3.0583 8.9216,-6.1253 13.2569,-9.1834 10.1997,-7.9051 12.7608,-29.0643 15.0554,-40.7949 -4.3371,14.533 -8.6768,32.3834 -16.58,38.2459 -4.0795,3.314 -9.1717,5.8668 -13.5071,8.6712 -19.124,13.004 -37.9983,25.2439 -46.6669,56.3506 -2.0388,7.9069 -0.5104,13.76481 1.2744,21.41581 4.8431,19.1242 17.8531,39.5247 28.5625,51.7649 0,0 1.7747,1.7828 1.7747,2.0368 4.8596,5.6076 11.1241,9.5747 18.4858,12.7566 -6.4048,-1.7769 -12.5938,-4.0332 -18.4739,-6.8845 -29.8316,-14.5348 -49.7274,-45.6458 -51.0026,-71.14401 -2.8043,-51.7617 22.1928,-66.807 45.1424,-85.6753 13.0039,-10.7093 30.8416,-15.8145 41.2952,-34.6846 2.0407,-4.0776 3.0688,-13.2562 0.7742,-22.6903 -1.0213,-3.314 -5.8738,-14.792 -7.6587,-17.3424 z m 21.6779,9.1357 7.01551,3.0492 c 0.088,3.1904 0.087,6.3118 0.06,9.3501 -0.022,-1.0459 -0.027,-2.1178 0,-3.204 -0.7564,13.6259 -0.9643,18.6542 1.5842,28.5981 2.8043,10.9651 17.088,26.7639 22.9523,44.8685 11.2192,34.6784 8.4229,80.07011 0.2621,115.51211 -1.4364,5.8676 -5.4205,12.9683 -10.7317,19.4625 1.8712,-3.4233 3.4855,-7.149 4.6094,-11.0533 8.1609,-28.5583 11.4706,-41.8127 7.647,-73.43091 -0.5098,-3.062 -1.7895,-13.5181 -6.6345,-24.739 -7.1396,-17.0852 -17.3315,-33.3936 -18.6049,-36.7094 -2.2964,-5.3529 -5.3623,-28.5601 -5.87201,-44.3682 0.25581,13.2578 1.27791,37.9913 4.84771,47.6794 1.0194,3.314 10.4523,17.8538 17.0803,35.4469 4.5911,12.2403 5.6068,23.4617 6.3723,26.7757 3.0601,14.535 -0.7594,39.00731 -5.8602,62.21081 -2.0981,10.2863 -8.3526,22.6365 -16.0439,30.099 -0.096,0.07 -0.1895,0.1454 -0.2859,0.2143 4.7805,-4.8389 9.4405,-12.9366 12.2682,-22.6784 3.8256,-13.5135 5.3437,-30.8065 5.0859,-41.7715 -0.2557,-6.3742 -3.0701,-20.17751 -8.1708,-32.67171 -2.8043,-6.8838 -7.1156,-13.7719 -9.9218,-18.6168 -3.0563,-4.8487 -3.0785,-15.2997 -4.6095,-27.5381 0.2558,13.2597 -1.03901,19.9125 2.275,29.3485 2.0387,5.6085 8.9292,13.2582 10.9699,20.6536 2.8044,9.9457 5.8558,20.90831 5.5982,27.53801 0,7.6512 -0.4737,21.9333 -3.7877,37.2336 -2.4815,12.413 -8.1409,23.0851 -17.61631,29.289 -0.1628,0.1065 -0.3234,0.2177 -0.4883,0.3216 l 0,-0.4645 c 0.084,0.025 0.171,0.064 0.2501,0.084 0.016,0 0.042,0 0.06,0 0.057,0.013 0.1249,0.049 0.1786,0.059 l 0,-0.2978 c 4.94741,-5.5159 7.91911,-10.9926 8.92131,-16.5086 1.2753,-6.6298 1.5691,-13.2725 2.3345,-21.1776 0.7637,-6.6299 0.2127,-15.5606 -1.5722,-24.739 -2.5485,-11.4748 -6.8505,-23.18061 -8.63541,-31.33771 0.2539,8.9245 3.83081,20.35751 5.35991,32.08811 1.277,8.6705 0.7323,17.3856 0.4765,25.0368 -0.2521,8.8557 -3.2095,24.7172 -7.24191,32.4334 -0.046,-0.021 -0.086,-0.039 -0.131,-0.06 l 0,-225.98601 z m -1.0363,140.9659 0,84.49611 c -2.9668,-1.6106 -4.3877,-3.503 -6.5867,-6.3604 -3.0583,-4.3353 -5.1416,-8.6701 -7.1823,-13.7691 -1.5291,-3.8256 -3.3181,-8.1937 -4.0855,-13.2926 -1.0194,-7.6492 -0.7359,-19.6214 7.9328,-31.8617 6.1097,-8.92981 7.8859,-10.27871 9.9217,-19.21231 z"
       id="path2554-4"
       style="fill:#ffffff;fill-opacity:1" /></g><image
     width="512"
     height="512"
     preserveAspectRatio="none"
     xlink:href="data:image/png;base64,iVBORw0KGgoAAAANSUhEUgAAAgAAAAIACAYAAAD0eNT6AABMd0lEQVR42u29CZgkR3muO62qnqqu LpUWECNpqiIiI7OqenpmujUaDTMSGs/oyMYGbAwc0PGxuYDBC2YxNvs9XC+AMcZsBoOEDAjwQSx2 iyvZ2IcLGLOZzWDMYnbLYCyxCyEQAiGNbmZ3ZCtm1J2V3V1LRuRbz5MPAqrfVv//H//3ZWYs27bx 4cOHDx8+fPhs9PPTP310Kr5Osq4pePDgwYMHD55bvI3+8sqJFzx48ODBgwfPLd5GXUc1vqatq7pZ 9wEPHjx48ODBGz9vM788+YXbrWt6i38MPHjw4MGDB2+MvM388lp81a2rtsU/Bh48ePDgwYM3Rt5m fnnyC2esq77FPwYePHjw4MGDN0Zeysz7xWR2YSO+Zq0r+e8nbfIXw4MHDx48ePDGz5sykwZPyvvL k1/YtK7ZLf4x8ODBgwcPHrzx8tIJhIMNgPXLW9bV3OIf04QHDx48ePDgjZU3Za0ayDYA5ssN61/g FPOfW/ljUs4p8ODBgwcPHryx8NIJhNstAzCV9eW69eihRbDhwYMHDx48J3npqoFVAzDIKcyc8O6B YMODBw8ePHhu8RrWqoHEAFQHvSOoWwZglmDDgwcPHjx4zvFSDU8NwHTWo/+qcQipAWgQbHjw4MGD B885nr1qYCZz0yAzKWDaMgB1gg0PHjx48OA5yWtZBqA+aNKfbQC2sl0hyYMHDx48ePAmy0sNQCNT z80PVaw1gog/PHjw4MGD5y6vlWsOn2UAqog/PHjw4MGD5zwv3+o9ywAg/vDgwYMHD15ZeFs8UYhg w4MHDx48eI7zCA48ePDgwYOH+BMcePDgwYMHD/En2PDgwYMHDx7iT7DhwYMHDx48xB8ePHjw4MGD h/jDgwcPHjx48Ioo/rlX/xFsePDgwYMHzwteuvV/7k2CmgQbHjx48ODBc178q7kMgHWecItgw4MH Dx48eE6Lf3reT7YBMF9umLv/FsGGBw8ePHjwnBX/mjntdzpz63/z5bq5+29aZwsTbHjw4MGDB88t Xt1cqwZgkFOYsQxAk2DDgwcPHjx4zvEaRs9TA1Ad9I6gbhmAWYINDx48ePDgOcdLNTw1ANNZj/6r xiGkBqBBsOHBgwcPHjzneOnT+9QA1LLEv2LcwXbrfQHBhgcPHjx48NzjtSwDUB806c82ALXcuwQR bHjw4MGDB69ovNQANDL13PxQxVojiPjDgwcPHjx47vJauebwWQagivjDgwcPHjx4zvPyrd6zDADi Dw8ePHjw4JWFt1nhJ9jw4MGDBw+eHzyCAw8ePHjw4CH+BAcePHjw4MFD/Ak2PHjw4MGDh/gTbHjw 4MGDBw/xhwcPHjx48OAh/vDgwYMHDx68Iop/7tV/BBsePHjw4MHzgpdu/Z97k6AmwYYHDx48ePCc F/9qLgNgnSfcItjw4MGDBw+e0+KfnveTbQDMlxvm7r9FsOHBgwcPHjxnxb9mTvudztz633y5bu7+ m9bZwgQbHjx48ODBc4tXN9eqARjkFGYsA9Ak2PDgwYMHD55zvIbR89QAVAe9I6hbBmCWYMODBw8e PHjO8VINTw3AdNaj/6pxCKkBaBBsePDgwYMHzzle+vQ+NQC1LPGvGHew3XpfQLDhwYMHDx4893gt ywDUB036sw1ALfcuQQQbHjx48ODBKxovNQCNTD03P1Sx1ggi/vDgwYMHD567vFauOXyWAagi/vDg wYMHD57zvHyr9ywDgPjDgwcPHjx4ZeFtVvgJNjx48ODBg+cHj+DAgwcPHjx4iD/BgQcPHjx48BB/ gg0PHjx48OAh/gQbHjx48ODBQ/zhwYMHDx48eIg/PHjw4MGDB6+I4p979R/BhgcPHjx48LzgpVv/ 594kqEmw4cGDBw8ePOfFv5rLAFjnCbcINjx48ODBg+e0+Kfn/WQbAPPlhrn7bxFsePDgwYMHz1nx r5nTfqczt/43X66bu/+mdbYwwYYHDx48ePDc4tXNtWoABjmFGcsANAk2PHjw4MGD5xyvYfQ8NQDV Qe8I6pYBmCXY8ODBgwcPnnO8VMNTAzCd9ei/ahxCagAaBBsePHjw4MFzjpc+vU8NQC1L/CvGHWy3 3hcQbHjw4MGDB889XssyAPVBk/5sA1DLvUsQwYYHD14G78CBc+9x7rnniPTat2+xE4bh6VLKUzd6 JT+X/Dy8yfDa7fYM48MZXmoAGpl6bn6oYq0RRPzhwYM3FF4v1Jd1A31HeoVSbfqyOfDGy9NSXad3 6i7jwxleK9ccPssAVBF/ePDgDZNnGwDEFfFnfIyNl2/1nmUAEH948OANlZcaAMQV8Wd8FJC3WeEn 2PDgjZRXmTv77LsppfpdpQ5GSh3RQv9sPwofMteNHtrvRo/sd7u/1Q+jx0dSPi6U8olayt9ZvoT6 7aAd7C3C39vT+lLEFfGnH3BEMDx4pecFgWpGQszHQn3fUIjHxsL9p6FQr4n/+98EHfWB+H/7fNx8 vxNfx7bUzEXwuCL8vaGSL0FcEX/6AeIPD14peOcKcfLc3NxFu8Lwcf0wfHEUBFd1A/XRsCO+MbZm nmEAxhm/2OD8GeKK+NNfEH948HzjnRS2wyi+e3+QFuoPwo66KpDyi3GzPTbxZr6OARh3/DZjABBr xB8e4g8PXqF4QojTkkf3sdg/Rwvx7rhZ/qCwzXwNAzCJ+G3UACDWiD88xB8evEnzppbv7pV6eCz6 fxFI9W9OicMJBmBS+diIAUCsEX94iD88eBPhJTuiRSJ4SNhRr04aotPiYBmASeYjrwFArCfHi83t fyH+5RL/3Kv/CDY8X3mHD59/2u5+70gv1M+KG+H74+s2b8TBGIBJ5yOPAUCsEX94Y+OlW//n3iSo SbDh+cK78MIL7tbvRpf0dPCGrlLf9FYcYgNQhHwMMgCINeIPb6ziX81lAKzzhFsEG57LvP37909H St23F4T/uyv1jWUQh0jqxxchH1kGALFG/OGNVfzT836yDYD5csPc/bcINjzXeEe2HakGIvhpLeUr k411yiYOfd19chHysZ4BQKwRf3hjFf+aOe13OnPrf/Plurn7b1pnCxNseIXnBUHQi0X/+famO2UU h37YfUoR8rGWAUCsEX94Y+XVzbVqAAY5hRnLADQJNrwi85JzyiMRPFQL8R7EQZ9oACaa3xMNAGKN +MMbK69h9Dw1ANVB7wjqlgGYJdjwispLDrwJpHxp3NxuQByO5xkDMPH82gYAsUb84Y2Vl2p4agCm sx79V41DSA1Ag2DDKyCvEt/tP3j54BzEYV2emQMw8fymBgCxRvzhjZWXPr1PDUAtS/wrxh1st94X EGx4heHNnzHfDIV6vJbqWsRhMC9ZBVCE/CanAZIPxB/e2HktywDUB036sw1ALfcuQQQb3oh5/U7n 7Fj4nxt21HcRhw3wBhwHPK789rS+lHxMTvyT7azpL6XkpQagkann5ocq1hpBxB/exHmREPOhEK8N OuJWmvkmeBs0AKPKby/Ul5EPxB/e2HmtXHP4LANQRfzhTZqXLOOL7/avjJvYMZr5FngbMACjzK9t ABBrxB/e2Hj5Vu9ZBgDxhzcxXl+pKLnjjxvY7TTzIfByGoBR5zc1AIg14g+vgLzNCj/BhjcM3t69 e+a1kq8MpPwJzXyIvBwGYBz5TeYAkA/EHx5HBMODt8o799xzwq7Wlwcd8WOa+Qh4AwzA2I5YVvIl 5APxh4f4w4N3yuHDF5zRj8JnxE3rJpr5CHkZBmCc9ZLnOGDyi/jDQ/zhecw7evTCU+ej3i91dfAl mvkYeOsYgHHXy2YMAPlF/OEh/vA84e3uz5/f0/pdNPMx8tYwAJOol40aAPKL+MND/OF5wFtY2CO7 Onxl3NRup5mPmXeCAZhUvWzEAJDfjYi//CriDw/xh1c43uLinspc2H14V6lv0swnxLMMwCTrJa8B IL+IP7zxiX/u1X8EG95GPj3RE10d/D3NfMI8YwAmXS95DAD5RfzhjY2Xbv2fe5OgJsGGl+Nzklbq MXGT+j7NvAC82AAUoV4GGQDyi/jDG6v4V3MZAOs84RbBhpf1kVLOxQ3q/TTz4vCS0wCLUC9ZBoD8 Iv7wxir+6Xk/2QbAfLlh7v5bBBveunf9Qj012cyHZl4sXl93n1yEelnPAJBfxB/eWMW/Zk77nc7c +t98uW7u/pvW2cIEG97qJ9oZtYOOehfNvJi8fth9ShHqZS0DQH4Rf3hj5dXNtWoABjmFGcsANAk2 vOPEXwQPiZvTDTTz4vIsAzDRejnRAJBfxB/eWHkNo+epAagOekdQtwzALMGGl376/f7JoVBX0MyL zzMGYOL1ZxsA8ov4wxsrL9Xw1ABMZz36rxqHkBqABsGGt3rXL+WhQKov0czd4Jk5ABOvv9QAkF/E H95YeenT+9QA1LLEv2LcwXbrfQHBhpd8puIm/sS4Md2GuLrDS1YBFKH+ktMAycdGefKTSilJv4K3 BV7LMgD1QZP+bANQy71LEMH2mjd/xnxTS/lmxNVB3oDjgMdVfz2tLyUfG+cEUn6rFwRH6VfwNslL DUAjU8/ND1WsNYKIP7xt8R1IP5Dq3xBXR3kbNACjqr9eqC8jH5u+ftyPosfQr+BtgtfKNYfPMgBV xB+eeW/7gKAjbkJcHeZtwACMsv5sA0B+N8fr6fCFR49eeAr9Ct4GePlW71kGAPGHV9FCPYfm6wEv pwEYdf2lBoD8bo0XCPHmKIpq9Ct4Q+VtVvgJtl+8uLm0AqH+D83XE14OAzCO+kvmAJCP4fC0EO+R Up5Kv4I3Ch7BKav474zaoRCfoPl6xBtgAMZVf8kqAPIxPF4g1ae77fZO+h88xB/elnldKc/RUl1H 8/WMl2EAxll/eY4DJr8b5HXEV5IDuOh/8BB/eJvmaSnvG0j5fZqvh7x1DMC4628zBoD86lzLBEMh zqX/wUP84W2YFzeQ34obye00X095axiASdTfRg0A+d0AryNu1ELci/4HD/GHl5d3Unzn/3yar+e8 EwzApOpvIwaA/G6Kd3NsAi6m/8FD/OEN4lXCjno1zbcEPMsATLL+8hoA8rsFXkfdsqvXfQD9D94G mFMEp0S8/fv3T4dCvZHmWxKeMQCTrr88BoD8DoEn9S27+r0H0f/gDRJ+s+9P7k2CmgTbbZ6Usq6l vIZmWSJebACKUH+DDAD5HSIvNgFz3egX6H/wMsS/mssAWOcJtwi2u7yFHTtm4yb8dppluXjJaYBF qL8sA0B+R8K7uavUT9H/4K0h/ul5P9kGwHy5Ye7+WwTbTV6yu1/cgN9Hs3SDFwbBt7s6+Jeu1ld3 dfgXkVLPDIV6vJbyf8b/fO9QiP16p+4mR8UKIc5qt9unJyc2Jq93ksmd8TWV/PO5Qpx8wQUH716E el7PAFAvo+MlS3sjKQ/RT+FZel4zp/1OZ279b75cN3f/TetsYYLt1mP/U+Pm+xGaZeF4N8dC/uFY 1F8ZX78TieAX53u7Dh08eKDt6cFSf0a9TIR3Q9AO9tJP4Rk9r9sGYJBTmLEMQJNgu8VL7gqDjvoA zXKyvJVNlpLXL/JZgRD/Pbl7j9NTKVM9n2gAqJdx7hiovhZ1OiH9tNS8htHz1ABUB70jqFsGYJZg u8Vrt9szsfi/i2Y5fl4s+F9dXmkhgsclWyzbYl/WerYNAPUyfp6W6trkdRH9tJS8VMNTAzCd9ei/ ahxCagAaBNuxO//5+e2x6/87muWYjmjtiB8nd/iRlL9r9mafop7XNgDUy+R4uqM+3u/3T6afloqX Pr1PDUAtS/wrxh1st94XEGyHeEe2HalqKf+aZjlinlLf6AXhq7TU909WWFB/AwyAki+h/orAk29P JojST0vDa1kGoD5o0p9tAGq5dwki2EXa3vcvaZajm53f08EV873ezx86dOA06i8/r6f1pdRfMXhB 3CPop6XhpQagkann5ocq1hpBxN8t3pQW6uU0y6Hzbu4FwZXz/d4DLz549G7U3+Z4vVBfRv0Vh9fT 0XPop6XgtXLN4bMMQBXxd48Xi/9TaW7D4yXvS7VSj9m/f1+b+ts6zzYA1F8heMfmwu4jqGfveflW 71kGAPF3jBd21CU0t6Hwbg6kvFx39HmLi3sq1N/weKkBoP4KxJP6ll4QnE89w9u2WeEn2JO+8xf3 CjriRzS3LfGu11I+XQhxGvU3Gl4yB4D6KyTv+rWWB1LP5eURHFfu/NthFEj1bZrbZnnyU7HwPyKK ohr1N1pesgqA+ismT3fUB5Olw9QzPILjCK93Vu/ugZRfpLltgreyBe99tp2wXp/6Gx0vz3HAiPXk eFqqV1HPiD/BcYCXHOsbD9r309w2xksm9gUi+Plta2zUQ/2NlrcZA0A9j5kn1G9Qz4g/wSk4L3Hr NLeN7MWvPp3swb9t5aQ86m8CvI0aAOp5/LzluURCnEs9I/4Ep6C82KX/Os0tJ68jvhEJ8aht7MU/ cd5GDAD1PMHtgqW6NjlBlHpG/Al2wXhBENxzZd95mlsWz+zN/7woilrUXzF4eQ0A9Tx5XiDE1dRz OcQ/9+o/gj1ZXixmZ8QD8z9pbgPEX6j/N+voU+pvMrw8BoB6Lg4vkvrx1LPXvHTr/9ybBDUJ9mR4 yQE/8aD8B5pbBq8jvmJm9lN/BeQNMgDUc7F48fWj+fld96KevRX/ai4DYJ0n3CLYk+HFzfNPaW7r 8o7F8XnJ/BnzTeqluLwsA0A9F5Sn9OfPO2/fWdSzd+KfnveTbQDMlxvm7r9FsCci/g+gGa3NS2b3 R1Ieol6Kz1vPABRsAtx18b/nRxhvd17JkdfUs1fiXzOn/U5nbv1vvlw3d/9N62xhgj0mXrfd3hkP yu/QjO7Cuz1u1M/Ou3sZ9VeA1StrGICiib/eqbtJTSVPlBhvNk/+HPXsBa9urlUDMMgpzFgGoEmw x8o7KR5870T8T+B1xJd1R19IvTj3JOvPii7+9t871+0+Igr0zYj/ynkB7Xb7dOrZaV7D6HlqAKqD 3hHULQMwS7DHy4sb5hMR/7vwXq+1PoV6cbKe/8wV8U//3t39+fNDra9lDsHyLoFvpJ6d5aUanhqA 6axH/1XjEFID0CDY4+V1pTwnXe+P+OtkXf/3Ail/mXpxl5caAFfEP70WFxfEiStwyjuBUD6AenaO lz69Tw1ALUv8K8YdbLfeFxDsMfLOOuushu6ozyD+RvyTbXyDoEe9uM1LTgN0TfzTv3d5Ga5Ql5V+ 9UBHfS09Mpvx4QyvZRmA+qBJf7YBqOXeJYhgD40XN6aXIf4rl5byr/Iu76P+is3raX2pi+K/xmu5 20u9dFCI11LPTvFSA9DI1HPzQxVrjSDiP2ZepNS9Ef/l67Y4Fk/atsapfdSLm7xeqC9zWfxXx6gI HhzfCd9S5n0DtBAXMz6c4bVyzeGzDEAV8R8/L7nTTWa4I/76hlj8L6Ze/OLZBsBV8V+do6PUT8Vj 9cbybhokvxBFUY3x4QQv3+o9ywAg/pN4RyrVi8su/mGgr406UZ968Y+XGgDXxT/9KKUWYxPw9dKe FaDUsxkfHvE2K/wEe+s8rfWheDDeXmrx1/pD/X5/B/XiJy+ZAzCp+guk+q9hin/6SSanpgd0lfCs gB/v3j2/n/HhH4/gjJG3b9859W4QfLrUj/21fku/32tQL/7yklUAPom/ZQJ0FOgvl3H8RkH4DsYH 4k+wtzI7OtTPKrf4h38ehkGVevGbl+c4YNfEP+UtLOzdE+k7TUCZxu9c2P0fjA/En2Bvgrdr19x5 yaO0Eov/cxYX91SoF/95mzEALoh/ytq9e35vV6qvlnCfjn+XUtYZH4g/wd4A7+jRC0+JVPi+sop/ PwyfQb2Uh7dRA+CS+Ke8npTd5HeXbcdALeXTGR+IP8HeAK8fRf9XScX/WC+KnkC9lIu3EQPgovin vK6Uu+J/h2+XacfAZKvuKIrOYHwg/vBy8A4dOrCjq/RXyij+fR39JvVSPl5eA+Cy+Kcf3dHnxaJ4 U6l2DBTqUsaHe+Kfe/UfwR4erx+GzyznhCH9WOqlnLw8BsAH8U8/gQh+OjYBt5Zox8DbkqcfjA9n eOnW/7k3CWoS7K3z9u7d3U/PGS+T+PeC6GnUS3l5gwyAT+KffiIRPDT+9ztWmh0DO+oqxocz4l/N ZQCs84RbBHvrvJ4Oryyd+If6mdRLuXlZBsBH8bf+7meUabvgoB0cYHwUXvzT836yDYD5csPc/bcI 9tZ4871dR0sn/jp8IfUCbz0D4LP4r74OkPJ15dkuWL6D8VFo8a+Z036nM7f+N1+um7v/pnW2MMHe BO/o0QtP7ergA+V67B++nnX+8NYzAFsV/7AdRi7Eb35+fnv897+/PNsFy6OMj0Ly6uZaNQCDnMKM ZQCaBHvzvLlu9OCSbe/77mSbY+oF3loGoCzin/IWF/eGYRBcV4alv0FHvZvxUThew+h5agCqg94R 1C0DMEuwN89LNv2JB8ZHS3Sq32fDMDydeoG3lgEom/invOVXgFLfUobXgLv7/fsxPgrDSzU8NQDT WY/+q8YhpAagQbC3xouUemBp7vyl/rrWOqBe4K1lAMoq/unVD7uPK8VBQSp8L+OjELz06X1qAGpZ 4l8x7mC79b6AYG+Blxx0Eze/T5bizl+qH2mhD1Iv8O5iAJR8SdnFf/VgJKFeU4Z+MN/r/gzjY+K8 lmUA6oMm/dkGoJZ7lyCCvf5g76hLSrM3uFK/Sr3AW4vX0/pSxH+F1263Z+K/6dO+9wMt5d8yPibO Sw1AI1PPzQ9VrDWCiP/WeRXdUZ8pycEgr6Be4K3H64X6MsT/zo9u6z3x3/dDz7cLPhZ2OrsZHxPl tXLN4bMMQBXxHw7P7ATmvfjHJueDURTVqBd46/FsA1B28V81AVI+2vuDgqR8HeNjorx8q/csA4D4 D4eXPP7/rPd3/h3xjW67vZN6gZfFSw0A4n/C3Aip3urzWQHJeQhCiLMYHwXnbVb4CfbavEAEP1+G I0GTQ0+oF3iDeMkcAMT/rp8gCHbEd8nf8nm7YC3UHzE+3OERnCHwgo76R9/FX0v5fOoFXh5esgog n/jLr5ZF/NNPJIIH+3xWQGJwpJR1xgfiXwpeKMR+78W/oz6+0ff+1EuJV8PkOA64jOJvzQf4a6/P ChDBrzE+EP9S8EKh3uD57N4fZp39Tb3AO5E3yACUWfyTT7fbPTMM9Hd8PSsguWFgfCD+3vO01iIu +Nt8nt2bzF6mXuBthJdlAMou/qtLJaPosT6fFdBV6iDjA/H3mqeFeqHfS3vk2+M/c4p6gbeh12Lr GADE/3heNwje7+1ZAUK8lvGB+HvLi6KoFXTETR6v6725J0RAvcDb8GuxNQwA4n9X3t5dc+clS+c8 PSvgh4uLC4LxURzxz736j2AP5kVSPsbnTT3iv+93GUzwNsM70QAg/uvz8jxFdLW/9EP9ZMZHIXjp 1v+5NwlqEuxM3lQy0cXbTT2E+HD8N1YYTPA2w7MNAOKfzev3+yeHHfU1L/cR0frjjI9CiH81lwGw zhNuEez1P7qjz/N4O8+fBO1gL4MJ3uZ3vFsxAIh/3qXEwa/5e0rgrkOMj4mKf3reT7YBMF9umLv/ FsFe/xM3tst93c4zbt5/ymCCtxVeYgAQ/w3xTgqF+ISnE4pfTH4nJv41c9rvdObW/+bLdXP337TO FibYJ3zmz5hvxs3t+16Kf0d8PZncyGCCtxVebACehPhvjBd0gp/xck5RR30tMTiMj7Hz6uZaNQCD nMKMZQCaBHvtTyTEo3zdyzv52xhM8IbAmyJ+m3iy2FHv8vK14gbOEKFehsJrGD1PDUB10DuCumUA Zgl2xvt/IT7ko/gHUn1s24CJfwxOePBGx0s2z/Hy5kKoK8jv2HiphqcGYDrr0X/VOITUADQIdoZD bwd7fT3II+gEhxlM8OBNlmcfGexNf+mIGwedJUK9DIWXPr1PDUAtS/wrxh1st94XEOyswSnUcz09 xWuJ/MKDN3lefJNxwMeDgqJO8Avkd+S8lmUA6oMm/dkGoJZ7l6DyBntKS3Wth4PzWCTEPPmFB68Y vK7S/593BwUJ8VryO3JeagAamXpufqhirRFE/Ae9+zdr/z08wvP15BcevOLw5nvde3t4UNAN+/fv nya/I+W1cs3hswxAFfHP+fhfqRd4KP636Z26S37hwSsWr6f1B307KChS6t7kd6S8fKv3LAOA+Of4 LC7uqXSl+qp3j+U66tXkFx684vH6Ue8S304J1EK9nPwWgLdZ4S9rsHf3exf7Jv7Jlr9SSkV+4cEr Hi+56QiF+LxXBwV1xJfJL0cEO8fr6vDlvr2T01L+JfmFB6+4vEEnjrq4aZA5G4D8Iv5u8A4fPv+0 MAiu82xCzh1KqUXyCw9ecXkLO3bMJmvo/ToiOHwm+UX8neHt7veO+Cb+oZRvJ7/w4BWfF0j5Ur9O CQz+ifwi/s7wYsf6bGbjUi/w4E2Cl+zR4dMpgfF/v/XQ4j3PIr+IvxO8rtYf9Gs2rvzkNnNYC/mF B6/4vHjMvs+nUwK11Pcnv4h/4XmLiwsiLuLbfVqKk574R37hwXODF0j5SL9OCZQvIb/jF//cq/8I 9gqvK/UlPol/0BE3JROLyC88eO7w5s+Yb2qpfuDLQWSBVJ8mv2PlpVv/594kqEmwj56UHGPp1Tpc oS5jMMGD5x4v2bLbo4PIjs2dffbdyO/YxL+aywBY5wm3CPa2qbhQr/dpHW6k5HkMJnjw3ONpKe/j 11kk8gHkdyzin573k20AzJcb5u6/VfZgJ+vkPduE46MMJnjw3ORddOaR7aFS3/JlR1It1IvI78jF v2ZO+53O3PrffLlu7v6b1tnCpQ127FCf5NMOXL0oegKDCR48d3lRqF/jz46k8p/J70h5dXOtGoBB TmHGMgDNsgc77Ki3+CL+ydrbffsWJYMJHjx3efP93gO9OYukI26VUtbJ70h4DaPnqQGoDnpHULcM wCzB3jYVdsQ3fNmBq6f12xhM8OC5zbv44NG7xeP5Bl/2JdFC3Iv8Dp2XanhqAKazHv1XjUNIDUCD YMd3/+0w8mn7zV1R7zcYTPDguc+Lx/WVHm1K9iTyO1Re+vQ+NQC1LPGvGHew3XpfQLBXHv8/zBfx j//5RwcO7G8zmODBc5+npfwlX5Ymx3/LX5HfofJalgGoD5r0ZxuAWu5dgkoQ7EDKy33Ze7unwr9h MMGD5wdPSnlq3J9+4sME5UCqL5HfofJSA9DI1HPzQxVrjSDif5wBUJ/2Ze/tuW73EQwmePD84cX9 6Z88maB87Lzzzt1JfofGa+Waw2cZgCrif/xHCHGaRwdv3Nbr9U4jv/DgeTRHSco/9GWO0lx37j7k d2i8fKv3LAOA+N91cP2cN6duCfFe8gsPnmdzlIS4wJc5Sr0wehr5HTNvs8JfhuBoKZ/uy6lbyd9C fuHB84u3f//+6Xh83+zFk8pQv478To5HcO7irtUbfDl1K9nOmPzCg+flk8p3+PCkMtT6Q+QX8S8M z54A6LL4a6mui/+cKfILD56HTyqF+j1PnlTeQH4R/0LwoiiqxQV5mxenbgl1BfmFB89PnhbiYl+e VAohziK/iP/EeekJgD4cuamlfAT5hQfPT16/3z85Hue3+9Gv5EXkF/GfOC+SwcN8OW9b79Rd8gsP nr+8WDg/6UW/EurXyS/iP3FeV+uX+CD+gRDf3Dbg/T+DCR48t3m9ILjSh34VG5k/Ib+jF//cq//K GuxuEPyDF+dtd9RbyC88eH7zejp6uhf9Sqol8jtSXrr1f+5NgpplDHYYqP/y47ztO0/ZovjhwfOT t7vfv68P/Up31MfJ70jFv5rLAFjnCbfKFuzDhy84Iy7UY+6L/7IBOJ/ihwfPb97i4l7lR79S3yG/ IxP/9LyfbANgvtwwd/+tsgV7YdfcOZ4MpmMLO3bMUvzw4PnPCzvqa473q+XrrLPOapDfoYt/zZz2 O5259b/5ct3c/Tets4VLE+x+t3d/D8T/jlCIz1P88OCVgxeP+Xe6Lv7JJaWcI79D5dXNtWoABjmF GcsANMsW7EjqX/fBSWsp/5rihwevHLxQqMtcF//llUud4GfI79B4DaPnqQGoDnpHULcMwGwZg62F eo4PTjrZIpRmCQ9eOXjJhF/Xxd+sXHoY+R0KL9Xw1ABMZz36rxqHkBqARmmddEdd6YOTDpX6RZol PHjl4MV96/7Oi//yFTyV/G6Zlz69Tw1ALUv8K8YdbLfeF5Q22EFHfcAHJ90VQtMs4cErBy/dvtxt 8U944UvJ75Z5LcsA1AdN+rMNQC33LkG+Ommprndd/IOOuLXT2TlNs4QHrxw8IcRp7ot/zND6TeR3 y7zUADQy9dz8UMVaIzhV8mCflB6s4fJgCqT6Es0SHrxy8WLjf5PT4h9fURC+g/xumdfKNYfPMgBV xH/btna7fboXj9F08I80S3jwysULO+JzLov/yhX8M/ndMi/f6j3LAEwR7NhBB0HPi8dooX4tzRIe vHLxQinf67b4x5dUXyC/Y+JtVvh9DU6yda7z4h9f/TB8FsUPD165eMneH06Lf8LriG+Q3/HzCE7y BEAEP++6+C8bgG70KIofHrxy8UKhLnVa/FcmMP+I/CL+E+HFDvoR7r9D03fM93v3ofjhwSsXTwv1 xy6Lf3od2XakSn4R/0m8Q3uS8+/Qlt+jyb3kFx68cvFCGTzNdfFPriiKWuQX8R87LxTquc6/Q0se owXBDvILD165eP0w+m3Xxd8cCHQm+UX8x87TUv6F6+KfXPv3758mv/DglYu3K+r9huvin+5iSn4R /7Hz4uJ7vfPv0DriRvILD175eHPd6KGui//y96XcRX5HJ/65V/+VLTjJMhrX36EluwBS/PDglY+3 q9f9766L//JJpm29h/yOhJdu/Z97k6BmmYLd1cHfuf4OLTYAH6P44cErH68f9X7RdfE3TwDOIb8j Ef9qLgNgnSfcKlOwk32oXX+HFhuAf6L44cErHy9S6mLXxX/5EmI/+R26+Kfn/WQbAPPlhrn7b5Up 2D0dvsf1d2hBR/0jxQ8PXvl4XaV+ynnxT5YBSnmI/A5V/GvmtN/pzK3/zZfr5u6/aZ0tXIpg97T+ kOvv0LQQb6P44cErHy9S6ojr4r98E9MODpDfofHq5lo1AIOcwoxlAJplCnY3CD7m/AQaKf+G4ocH r3y82Pxf7Lr4mycA+8jvUHgNo+epAagOekdQtwzAbNmCHQrxCdffoSUrGSh+ePDKx4uUurfr4r98 hfoc8rtlXqrhqQGYznr0XzUOITUAjTIGO+yoz7r+Di0Q4k0UPzx45ePF/ev+zot/fO3u9+5JfrfE S5/epwagliX+FeMOtlvvC0oZ7FDKTzn/Dk2oN9As4cErH09L+Uuui3/y87t3z+8nv1vitSwDUB80 6c82ALXcuwR5GOywI/7V9XdocRN4M80SHrzy8QIpH+m6+CfXOfML8+R3S7zUADQy9dz8UMVaIzhV 5mDHRfhR59+hddRVNEt48MrH00L9tuvin1yLi3sV+d0Sr5VrDp9lAKplF/9lAyDEh91/hybfSrOE B698vNgA/IHr4p9cBw6cew/yuyVevtV7lgGYItjLTwDe7/w7NK3fTbOEB698vFCoF7su/vF1jPyO ibdZ4fc1OPHd8ztcf4cWKf1hih8evPLxAilf57j4b/g0U+qFI4KH9w5Nymucf4emg89Q/PDglY+X 7ALqtPivHGf+ZfKL+E+EFwr1RtffoYVBcB3FDw9e+Xi6oz7utPivGIB/Jb+I/2TeoXXUq11/hxYb gB9Q/PDglY8X94PrnRb/HIeZUS+I/8h4WqgXOf8OLf7f5+fnt5NfePDKw9u375x6MoHOZfFPlzGT X8R/Qu/Q1O87/w4tOUxjZ9Qmv/DglYe3sGtuwXnxX9nJ9FLyi/hP5h2a2UjD9cdooRD7yS88eOXh zfd793Ne/Ff2MflD8jta8c+9+q9swYlE8HDnxX/lQKD7kV948MrD2xWGj3Nf/OPeJeVvkd+R8dKt /3NvEtQsU7D7Ue8SHx6jaSkfTfHDg1ceXl+HL3Jd/E3vehD5HZn4V3MZAOs84VaZgr2rO3eRD4/R tFDPofjhwSsPr6v11a6L//ITgCC4J/kdifin5/1kGwDz5Ya5+2+VKdgLC3v3+PAYLb5eT/HDg1ce XiDVv7ku/sklpTyT/A5d/GvmtN/pzK3/zZfr5u6/aZ0tXIpgX3DBoXv48Bgt6KgPUPzw4JWDd+jQ wVrQEbe6Lv7x3/Dj+M+cIr9D5dXNtWoABjmFGcsANMsW7LCjvuv8YzQhvknxw4NXDl4kxLzr4r8y AVD9O/kdKq9h9Dw1ANVB7wjqlgGYLWOwQyk/5cNg0lqfwmCCB89/XiDlL7ver8z1D+R3aLxUw1MD MJ316L9qHEJqABplDXbYUX/vw2CKpDzEYIIHz3+elvL5Hoh/sgTwcvI7FF769D41ALUs8a8Yd7Dd el9Q2mCHQrzCk8H0SAYTPHj+8+Lx/k7X+9XKFTyN/A6F17IMQH3QpD/bANRy7xLk7WCSz/BjMKkX MZjgwfOeNxV2xI0e9Ks7+t3oV8jvUHipAWhk6rn5oYq1RnCq7MHO+z6t8DsGav1uBhM8eH7zwk5n txf9Kv75+f6uC8jvUHitXHP4LANQRfyNAQiCe/owmOLru0ePXngqgwkePH95kRCP8qRf3Xb48AVn kN+h8PKt3rMMAOJvPu12+3QPBtPydc7uXQsMJnjw/OWFQrzWj36lvkh+x8zbrPD7Hpy4MG9wXfyT ay7sPpzihwfPX17YUf/hw81KFIRvJb+T4xGc4131h10Xf8N7EfmFB89T8Q/Djg/iv3zp8PnkF/Ev BC8U6jUeiP+6WwJT/PDguc/TUv6qF+KfXFJfQn4R/0LwYgPwZNfFP91bu91uz5BfePB8fFKp3ujJ k8o7wnYYkV/EvxC82Fnf13Xxv/OSF5FfePC8400lZ3748aRSfG+bdQgQ+UX8J8rTWgd+iP+yAfhD 8gsPnl+8rlIHvbjzX+lR7yO/iH9heEePXnhKV+ob3Rf/wYOLwQQPnoOvKaV8th/ir+7QIv9kZepl 6+Kfe/VfmYMdqfC97ov/8nVbFEUt8gsPnj+8oKP+xZvXlB11CfkdCy/d+j/3JkHNsga7p8OXeSD+ 6VOAB1D88OD5wesJEfgzR2n56HJBfsci/tVcBsA6T7hV1mDPhd1f90P8V47ZZDDBg+cHL5LBU7wR f6muI79jEf/0vJ9sA2C+3DB3/62yBjt2pbt8EH9rkE0xmODBc58XKf0RPyYoL19L5Hfk4l8zp/1O Z279b75cN3f/Tets4TIG+6Swo77ruvivXkLsZzDBg+c2b3F+bq9H4p9MAPxt8jtSXt1cqwZgkFOY sQxAs8zB1kK8zQvxX76C5zCY4MFzm9cPw2f7Iv7LPyPlOeR3ZLyG0fPUAFQHvSOoWwZgtuzBDqV8 ph/inww09QXreGAGEzx4DvIipT/ni/gnT1iTJ63kdyS8VMNTAzCd9ei/ahxCagAaBHvbtkipe3sh /oaxuz9/PoMJHjw3eXvm+hd7I/7Lc5Pk35DfkfDSp/epAahliX/FuIPt1vsCgh1/+v3+yck6ej/O 29Z39HT4AgYTPHhu8qJQv8afpcnJvCT1ePI7El7LMgD1QZP+bANQy71LUEmCHUr5EW+O3JT6K4uL eyrkFx48t3jnnbfvrHhM3+SN+MeXlHKO/I6ElxqARqaemx+qWGsEEf8TPlrK5/ty5ObKrFtxL/IL D55bvH7YfZxP4h8I8Z/kd2S8Vq45fJYBqCL+a3/iQr2fN0durrx3eyX5hQfPLV48dj/qi/ibvUle RX5Hxsu3es8yAIj/Op9kHkAg5U98OXgj/lu+v7Bjxyz5hQfPDV4vCM73SfzNjcgDye+EeZsV/rIF O5TyvV7tvS3lr5JfePDc4AVCvMkn8Q864scL7b0t8ssRwU7wQhn8vi/ib3YF/DD5hQev+LwwDDv2 E0g/9iWR7yC/iL8zvN39/n/zafvNdGtg8gsPXrF5WqgX+iX+6o6ejp5KfhF/Z3iHD59/WqjUt3za hCMU6gryCw9ecXlCiNOSOTs+iX/888cWF/fuJr+Iv1O8ng6v9GkTjqAjfqS1vgf5hQevmLz47v/3 PBP/+Ar+mfwi/s7xelH4UJ/W4ZqTuH6f/MKDVzye2YX0O36Jv76jF0a/R34Rf+d4u3fvPiWZverV bFwhvhlF4Sz5zcWrMD7gjfEgsmf4Jv7JtTi/a5H8Tlb8c6/+I9jH8+JifqtvE3LmwvCJ5HfAdtBh 2Ikb8p8wPuCNg6e1PiXv3b9bq5OCj5LfifLSrf9zbxLUJNh38gIpH+ndOzmlv3L06OG7k9/1xT+Q 6ktxvJZoRvDGwYvN5rP9E399Ry+InkZ+Jyr+1VwGwDpPuEWw7/zMnX323QadDuji4OxH0WPIb6b4 32EbAJoRvFHxkom5eWb+O7gvyW3x33Y29TIx8U/P+8k2AObLDXP33yLYd3Hn7/BtcIaBvvaiM49s J7/riv+qAaAZwRslT0v1Mg/FP9n8553kd2LiXzOn/U5nbv1vvlw3d/9N62xhgm0+kRCP8m9wLp8R 8Ejyu674LxsAmhG8UfKS43EH7frnan+JRPBQ6mUivLq5Vg3AIKcwYxmAJsG+yyA9db3VAE5vF9wR X4miqIb4ryn+yXUVzQjeKHmDJhk7e3PREd9rt9sz1MvYeQ2j56kBqA56R1C3DMAswV5noHbUW7wS /3RfgI56AuK/pvjf0dP6apoRvFHxtJT39VH8zeFjf0G9jJ2XanhqAKazHv1XjUNIDUCDYK//iUTw YN/Ef+U1gPp2sgQJ8b9r/Ho6vIZmBG8UvPn5+e2hlF/wUfzN4T/nUy9j5aVP71MDUMsS/4pxB9ut 9wUEO/s1QD0u7Bt8En9rsD4P8V9jB7M7DQDNCN5w60/K/+Wx+H+Sehk7r2UZgPqgSX+2Aajl3iWo 5MHWSr3cP/FfOau7J0SA+B8fP2MAaEbwhsqLOp24AtUtfor/8qmjj6Vexs5LDUAjU8/ND1WsNYKI f07efL932LsjglcnBKq3lKL57ozaecR/xQAszwGgGcEbKi++Q367r+KvpfpBFEUt6mXsvFauOXyW Aagi/hvjHT164aldpT7lnfibK1Lq3oj/cfG7ivEBb5g8LeUjvL3zzzn5j3oZCS/f6j3LACD+m+DN ReGTfBR/8+ju83v27J5B/PUdJ+4EyPiAt1WeEOKsdB6Rj+K/bADaeg/1UmDeZoWfYK9c55137s7k MZd34p/ydPjHiL/alAFgfMAbcPd/jc/in+yYSr24wyM4m+QFUl7upfiv/PyPd+/edR7ivzEDwPiA l/neXwS/5rf4Lx81fj/qBfH3nteV8hwfxd+a/PbBCy88dGrJxT+3AWB8wMv6dIXQJx72491qoo74 XPynTlEviH8peFqI9/go/nfygieUXPxzGQDGB7ysz/79+6dDIT7stfgvzx8Kfo16QfxLw9NSPtBf 8V/+/27WO3W3xOI/0AAwPuANfPQv5fN8F38t1XXJzobUC+JfJl4l7Kj/8HUvb3NOwAePbDtSLan4 ZxoAxge8geKv1M/GNXTM6zv/pE8I9RTqBfEvHS+S8nf93c5zdXD/XknFf10DwPiAN+ijtRbJORu+ i3+yrLHf759MvRRb/HOv/iPY+XlJ4Ycd9V3PZ/felnWwh8fiv6YBYHzAG/RZPujHeu/vsfjf5QaB eikcL936P/cmQU2CvaF3fM/2foJPR3xZSnlqycT/LgaAZgQv192/VK8qg/gnNz/2SaLUSyHFv5rL AFjnCbcI9gYGu9b3SA/28HywJ9viThVT/OUXRxS/JZoRvI1w4lr8rVKI/8rd/x9QL4UW//S8n2wD YL7cMHf/LYK9sY9W8mW+D3azz/fvlEj8Vw0AzQherj4gxH8LOuLWMoh/fH0nvfunXgop/jVz2u90 5tb/5st1c/fftM4WJtg5eYu7FuaSHfR8Fv/lnb6k/Eko5eGSiP+yAaAZwcvzUUr1033+S3EzINRT qZfC8urmWjUAg5zCjGUAmgR747yeDl/ls/iv8qT++r7d87tKIP7LpwHSjOAN+kRRdEZaj+V4Eqiu a7fbM9RLIXkNo+epAagOekdQtwzALMHeHG9hYe+eeHDc6rX4r3KCjx46dGCH5+KfbIl8Nc0IXtbn rLPOaqQz/ssg/uZV4KOpl0LyUg1PDcB01qP/qnEIqQFoEOyt8WJnfKn/4m8urd+0uLin4qv4r5yJ EF5DM4K33ifZJCuU8m/LJP5hR332ojOPbKdeCsdLn96nBqCWJf4V4w62W+8LCPYWeea87x96L/6G p4X6f3wV/xMMAM0I3omfqfhO+H+XSvwTltC/SL0UkteyDEB90KQ/2wDUcu8SRLAH8mJR/OMyiL/1 OPB/+ij+lgGgGcG7yyeu+z8vm/jH17uol8LyUgPQyNRz80MVa40g4j9EnhDitLV2B/R1u+CVZU/y It/E3xyLfDXNCN6Jn/SAn5KJ/+175vr3ol4Ky2vlmsNnGYAq4j8aXtwgnlQG8bdMwPeCIFgYdj66 7fbOSYm/4V1FPcM7YWw/q4Tif0cvCF9NvRSal2/1nmUAEP8R8aIoqgVS/XsZxN/aLvjrYTuMPBL/ gccBMz5K9thfqD8qo/jHP3/Dgb17AurFA95mhZ9gb4wXieAhpRH/O2cI/0ci3J6I/4YNAOPD6zv/ Py2p+N/Ri8InUi/+8QjOaHlT8QB6f2nEP72E+LyU8kwPxH9DBoDx4S3vpFCsLO8to/h3tf74+eff 83TqBfEn2BvkxWJ4bjyQjpWteQRS/dvi4oJ2XPxzGwDGh8fr/IV6Q2nFP9C37e73jlAviD/B3iQv lOLyMjaPUOvPLSzs6Tks/rkMAOPDT978GfNNLcTbSiz+d/RC/QrqBfEn2FvgnbdnXsWD6btlax7L l1JfSA5KclT8BxoAxoefvOQVViDVx8os/mGgrz948ECbekH8CfYWeXNh9ITSiX/K64gvr7U6wAHx zzQAjA9Pj/Rt6z3LNVti8U+ufje6hHpB/An2EHiHD59/Wqj1h0on/neuDviaUmrRMfFf1wAwPjyd syPlzyV7WpRd/Hs6fDP14pf45179R7BHw4tEuBCL3U9KJ/7WZkH2joEOiP+aBoB69vTOX6inxPm+ rezi31XqGwsLeyT14g0v3fo/9yZBTYI9Gl4o1HPLKP72tsGBEL/iiPjfxQBQz/7xVo7zXZnpX3rx X3n0/8vUi1fiX81lAKzzhFsEezS8drs9E3bE58oo/ifsGvgNR/7eJerZX14QBL1Qyk8h/ubRfxBc Sb14Jf7peT/ZBsB8uWHu/lsEe3S8UIgL0r0BSin+bvGWqGc/eclOnUFH3MT4MJfUX5mbmzuVevFG /GvmtN/pzK3/zZfr5u6/aZ0tTLBHxAuFejHi6gRviXr2i5c8hQukvJzxcdx1e3z3f5R68YZXN9eq ARjkFGYsA9Ak2KPlLezYMRtK+QXEuvC8q6hnf3jJSpRAqk8zPo6/IqX+iHrxhtcwep4agOqgdwR1 ywDMEuzx8LpKHUxnHdOMCnoEqtZXU89e8E7SQj016IgfMz6Ov2JD9E9xfCrUixe8VMNTAzCd9ei/ ahxCagAaBHu8vFDKZ9KMCnwKmg6voZ7d5umduhuPs/dRz2tt0qW+q5SS1IsXvPTpfWoAalniXzHu YLv1voBgj5m3f//+6bg5/TPNqKB7od9pAKhn93iVUKgnx/n8IfW8Hk8+gHrxhteyDEB90KQ/2wDU cu8SRLCHztvT331OGAQ/oBkVcke0a6hn93i6o88LOupfqOf1ebqjXkC9eMVLDUAjU8/ND1WsNYKI /4R5u6LebyDWBVwXvTIHgHp2hCelPFVL+edxLm+nnjPv/N+XHHVM/XnFa+Waw2cZgCriXxxeV+s3 ItaF411FPTvBm4qEeFQgxDep5wG8jvpav9M5m/rzjpdv9Z5lABD/AvEW2ntb8eD8LGJdKN4S9Vxs Xnw3ezQ9upd6zuYtr4IQ4gLqr8S8zQo/wR7DWQGdzu54oN6MWBeGt0Q9F5OXjBUt5TXUc36eVuo3 qT94iH+BeclhOYh1YXhL1HOxeD0hglj4/3K99/zU8zo8IV5B/cFD/B3gaaFeTnMrBG+Jei4GLxH+ sKNenfdIber5ON47NzLpj/pD/An2BHnz8/PbQynfS3ObOG+Jep78a7Hkjj+v8FPPJ/A66rPJ6gjq Dx7BcYgXBMGOuOl9leY2Ud4S9TwZXqTUEfOO/xj1vDleINW3o04npP7gERwHecmGJrGDv4XmNjHe EvU8Pt7Bg+edEYng4YNm9VPPuXg/DKU8n/qDR3Ac5iXnltPcJsZbop5Hz9szt/vcbhC+NLljpf6G wrt9I9v8Us/+i3/u1X8Eu3i8XqifRXObCG+J+hsN7+DBA+1eFD22p/WHqL8h84R4LPUHLxV+s+9P 7k2CmgS7WLyjRy88NdL6jTS3sfOWqL/h8fbtO6c+1+v+Ulfrt8R5uIX6GwVPPov6g2eJfzWXAbDO E24R7OLxDh++4Iy4cb6HZjlW3hL1tzVeu92eSR5Hx7G8sivV96i/0fGScxCoP3iW+Kfn/WQbAPPl hrn7bxHsYvJ6vd5poRCfoFmOjbdE/W2cJ6VUsRg9Ouyov0uP46X+Rs57fRz6KeoPntHzmjntdzpz 63/z5bq5+29aZwsT7ALyuu32zkCI/6RZjoW3RP0N5mmt7xGJ4MFaqpcFUn6R+hszr6PeknejH+q5 FLy6uVYNwCCnMGMZgCbBLjYvvsOaixvtt2iWI+ddRf3dhXdSJMR8cvpeLPiv0h31Geplou/8/3b/ /v3T9FN4htcwep4agOqgdwR1ywDMEmw3eKEQ+4OOuIlmOTpeT+ury1x/Cwt7pBY62ZDn0cn21EFH fSAW/R9QLwV55y/E26IoqtFP4Vlz+GYtAzCd9ei/ahxCagAaBNstXrJbmr1REM1yuLyeDq+ZdL2s dXc3pPqbmjv77Lst380HwX36Yfdx/TB8Xvw3v7mr9EdCpb5FvRT6sf/fSynr9FN41uq9pmUAalni XzHuYLv1voBgO8iL787us3zON81y6DzLAEwsv8kpbnF+fxTfeV8XSvnJ+HpfV+u3xaJ9Vfzv9/qu Dl/ZC8KXx4L9gvj/e15cD8+P79ZfFEj50lCoS+P/fF38v/11MiFv+Q5+5ZH99fbe+tSLc7P9r0nO C6H/wbN4LcsA1AdN+rMNQC33LkEEu5C8uLnfP23oNMvh8YwBmGh+EwNAPuDZE1N55w9vDV5qABqZ em5+qGKtEUT8PeDFdwUPjpvFbTTL4fHMHIDJmjvLACCGZd/hT10Rl0SF/gdvDV4r1xw+ywBUEX+/ eLui3sPCIPgJzXJovKsmnd/UAJCPsk/4Uy/cxjp/eOvz8q3eswwA4u8hb67b/ZW4YdxK8x0Kb2nS +Q2luJx8lH6p3zPof/CGwtus8BNsd3hayl9IJo7RfLfMW5p0fntBcAX5KCcvmdcTj+Vfpf/BGwWP 4HjMi+8aLoobyPdpvlubcDXp/Pb08QYAcS2N+H8/VOpn6X/wEH94m+IFQXDPuJl8h+a7ad7SpPNr GwDyURre9aEQ59L/4CH+8LbE60q5a9DZATRfnes44EnkNzUA5KMkd/4d9S/RzqhN/4OH+MMbCi+S 8hDNd1O8pUnnN5kDQD5KIv5CXL2wY8cs/Q8e4g9vKLwwDDuBVP9O890Ub2nS+U1WAZCPEvCEem5c BifR/+Ah/vAQ/2Lwliad3xN3AkRc/eIlhytFIngI/QreKMU/9+o/go3408zXNwBjX82xCQNAft3g JeMzaAd76VfwRshLt/7PvUlQk2Aj/jTzuxqASeR3owaA/Doi/kJcLaU8lX4Fb8TiX81lAKzzhFsE 212e1log/kPjLU06vxsxAOS3+LzlzX2Eegr9Ct4YxD897yfbAJgvN8zdf4tgI/408zsNwCTzm9cA kF8nxP+rQSc4TL+CNwbxr5nTfqczt/43X66bu/+mdbYwwUb8y97Mlyad3zwGgPw6IP5CXd1ut0+n X8EbA69urlUDMMgpzFgGoEmwEX+a+fJ11aTzO8gAkN+C86S+pavUY+lX8MbEaxg9Tw1AddA7grpl AGYJtnvir6W6luY7fF5P66snPqEzwwCQ32LzwkD/az8IdtOv4I2Jl2p4agCmsx79V41DSA1Ag2Aj /jTzO3k9HV4z6XpZzwCQ30Lzbuvq8PmHDh2s0a/gjYmXPr1PDUAtS/wrxh1st94XEGzEn2Zu8SwD MLF6WcsAkN/i8iKlP7e737uYfgVvzLyWZQDqgyb92QaglnuXIIKN+JeIZwzAROvlRANAfovJC4Pg J3G9vOCCCw7enX4FbwK81AA0MvXc/FDFWiOI+CP+NPM1eGYOwETrxTYA5LeYvPiu/xPxXf9P0a/g TZDXyjWHzzIAVcTfLZ5SSiL+Y+VdNel6SQ0A+SgeL77r/0EvCv/v88+/5+n0K3gT5uVbvWcZAMQf 8aeZZ/OWJl0vyWmA5KOAE0RV+LfnzC/M06/gOcXbrPATbMS/hLylSddLLwiuIB8F4kn1hV393oPo V/Bc5xEcxB9eNm9p0vXS08cbAPI7GV7QETf1dfSMo0cP351+BQ/xJ9iIv/+8pUnXi20AyMdEeLcl r2EWFxc0/Qoe4k+wxyb+YUf9B818orylSddLagDIxwR4HfX3XSn30q/gIf4EG/EvH29p0vWSzAEg H+Pl6Y76YCjlUfoVPMSfYCP+5eUtTbpeksfP5GNcPPmpeOzdn34FD/En2Ig/vKVJ10ue44DJ71Z5 8pORCB4cp2KKfgXPR/HPvfqPYE+GJ6VUiH/heEuTrpfNGADyq/M+6v+4lvJBqfDTr+B5yEu3/s+9 SVCTYCP+8O5qACZRLxs1AORX51jSp/4xvuv/OfoVvBKIfzWXAbDOE24RbMQf3vEGYFL1shEDQH71 gOV8aqmr1EH6FbySiH963k+2ATBfbpi7/xbBRvzh3WkAJlkveQ0A+V2H1xE3aqFemIw1+hW8Eol/ zZz2O5259b/5ct3c/Tets4UJNuJfdt7SpOsljwEgv2vwhPhEJOVj5s+Yb9Kv4JWMVzfXqgEY5BRm LAPQJNjjEH/xZZp54XlXTbpeBhkA8qvtjXtu0VL+ZRyzC+hX8ErKaxg9Tw1AddA7grplAGYJNuIP b+XqaX31pOslywCQ3xWeFuJDWqnf1FqfQr+CV2JequGpAZjOevRfNQ4hNQANgo34w7OOfNXhNZOu v/UMQOnzK9V/RjL4k0iIefoLPHirT+9TA1DLEv+KcQfbrfcFBBvxh2fxLAMwsfpbywCUNr9KfbOr w1fu6nbvvbi4p0J/gQdvldeyDEB90KQ/2wDUcu8SRLAR/xLxjAGYaP2daADKlo8wCK7rhfoVu/v9 +x4+fP5p9Bd48NbkpQagkann5ocq1hpBxB/xh7cGz8wBmGj92QagJPk4Fkj1sUipZ+3qzh09evTC U+kv8OAN5LVyzeGzDEAV8Uf84WXyrpp0/aUGwOd8BFJ+KxDiTfF/PrLf6ZxNf4EHb8O8fKv3LAOA +CP+8LJ5S5Ouv+Q0QO/y0RE3hh31d1qop8YG59xt7MUPD954eJsVfoKN+JeQtzTp+usFwRXO5yMe C8kdvu6oJ0RS7ov/tJPoL/DgTZZHcBB/eNm8pUnXX08fbwCKHj8t1XXx//fWUMpnx9cD4vFwJv0F HjzEvyy8ypFtR6r2ddGZR7ZffODoaRcfPHq31Sv+78n/fuJ381zwxsNLcjnp+rMNQMFm53+7p/UH kn+/Xhg9rd/t3b/b7Z5JP4AHD/GHBw/eEHipARj/kbnipkCqTwdC/Z9Aysvju/n/FSr1PyIlD+zb t9ghv/DgIf7w4MEbIW9X1HuYVvKVyTv0lYlz4t2xGH8kvj4VX19IDpRafuzeEV+Pv/PNZEZ9LODX x//51eVXUYG+tquDz3SD4KORCt/XVfrtWsq/WlldIP8k/uenL2+jK+UDkz30o04n7Pf7J5MPePAQ f4INDx48ePDgIf4EGx48ePDgwXNJ/HOv/iPY8ODBgwcPnhe8dOv/3JsENQk2PHjw4MGD57z4V3MZ AOs84RbBhgcPHjx48JwW//S8n2wDYL7cMHf/LYINDx48ePDgOSv+NXPa73Tm1v/my3Vz99+0zhYm 2PDgwYMHD55bvLq5Vg3AIKcwYxmAJsGGBw8ePHjwnOM1jJ6nBqA66B1B3TIAswQbHjx48ODBc46X anhqAKazHv1XjUNIDUCDYMODBw8ePHjO8dKn96kBqGWJf8W4g+3W+wKCDQ8ePHjw4LnHa1kGoD5o 0p9tAGq5dwki2PDgwYMHD17ReKkBaGTqufmhirVGEPGHBw8ePHjw3OW1cs3hswxAFfGHBw8ePHjw nOflW71nGQDEHx48ePDgwSsLb7PCT7DhwYMHDx48P3gEBx48ePDgwUP8CQ48ePDgwYOH+BNsePDg wYMHD/En2PDgwYMHDx7iDw8ePHjw4MFD/OHBgwcPHjx4RRT/3Kv/CDY8ePDgwYPnBS/d+j/3JkFN gg0PHjx48OA5L/7VXAbAOk+4RbDhwYMHDx48p8U/Pe8n2wCYLzfM3X+LYMODBw8ePHjOin/NnPY7 nbn1v/ly3dz9N62zhQk2PHjw4MGD5xavbq5VAzDIKcxYBqBJsOHBgwcPHjzneA2j56kBqA56R1C3 DMAswYYHDx48ePCc46UanhqA6axH/1XjEFID0CDY8ODBgwcPnnO89Ol9agBqWeJfMe5gu/W+gGDD gwcPHjx47vFalgGoD5r0ZxuAWu5dggg2PHjw4MGDVzReagAamXpufqhirRFE/OHBgwcPHjx3ea1c c/gsA1BF/OHBgwcPHjzneflW71kGAPGHBw8ePHjwysLbrPATbHjw4MGDB88PHsGBBw8ePHjwEH+C Aw8ePHjw4CH+BBsePHjw4MFD/Ak2PHjw4MGDh/jDgwcPHjx48BB/ePDgwYMHD14RxT/36j+CDQ8e PHjw4HnBS7f+z71JUJNgw4MHDx48eM6LfzWXAbDOE24RbHjw4MGDB89p8U/P+8k2AObLDXP33yLY 8ODBgwcPnrPiXzOn/U5nbv1vvlw3d/9N62xhgg0PHjx48OC5xauba9UADHIKM5YBaBJsePDgwYMH zzlew+h5agCqg94R1C0DMEuw4cGDBw8ePOd4qYanBmA669F/1TiE1AA0CDY8ePDgwYPnHC99ep8a gFqW+FeMO9huvS8g2PDgwYMHD557vJZlAOqDJv3ZBqCWe5cggg0PHjx48OAVjZcagEamnpsfqlhr BBF/ePDgwYMHz11eK9ccPssAVBF/ePDgwYMHz3levtV7lgFA/OHBgwcPHryy8DYr/AQbHjx48ODB 84NHcODBgwcPHjzEn+DAgwcPHjx4iD/BhgcPHjx48BB/gg0PHjx48OAh/vDgwYMHDx48xB8ePHjw 4MGDV0Txz736j2DDgwcPHjx4XvDSrf9zbxLUJNjw4MGDBw+e8+JfzWUArPOEWwQbHjx48ODBc1r8 0/N+sg2A+XLD3P23CDY8ePDgwYPnrPjXzGm/05lb/5sv183df9M6W5hgw4MHDx48eG7x6uZaNQCD nMKMZQCaBBsePHjw4MFzjtcwep4agOqgdwR1ywDMEmx48ODBgwfPOV6q4akBmM569F81DiE1AA2C DQ8ePHjw4DnHS5/epwagliX+FeMOtlvvCwg2PHjw4MGD5x6vZRmA+qBJf7YBqOXeJYhgw4MHDx48 eEXjpQagkann5ocq1hpBxB8ePHjw4MFzl9fKNYfPMgBVxB8ePHjw4MFznpdv9Z5lABB/ePDgwYMH ryy8zQo/wYYHDx48ePD84BEcePDgwYMHD/EnOPDgwYMHDx7if/wvt88IaA1hu2B48ODBgwcP3hh5 m/nl9hkBzSFsFwwPHjx48ODBGyNvM7+8Ye0vPDuE7YLhwYMHDx48eGPkbfSXT1lnBMxYhwtMwYMH Dx48ePDc4KXMjfzymnVGQH2L2wXDgwcPHjx48CbDq+TdJGjKOiMgvaa3+MvhwYMHDx48eOPnVXMZ AOvL09ZVHcIvhwcPHjx48OBNhpfLAFROvLZt4QMPHjx48ODBKwRvapBbOMm6prb4y+HBgwcPHjx4 BeH9/85AoTnuW2ViAAAAAElFTkSuQmCC "
     id="image3499"
     x="14.441033"
     y="3.9384618" /></svg>
