{
  "nextResupply": 0,
  "items": [
    {
      "_id": "61e0a288033bdc459438be58",
      "_tpl": "5b44cd8b86f774503d30cba2",
      "parentId": "hideout",
      "slotId": "hideout",
      "upd": {
        "BuyRestrictionMax": 2,
        "BuyRestrictionCurrent": 0,
        "StackObjectsCount": 500
      }
    },
    {
      "_id": "61e0a288033bdc459438be5c",
      "_tpl": "545cdae64bdc2d39198b4568",
      "parentId": "hideout",
      "slotId": "hideout",
      "upd": {
        "BuyRestrictionMax": 3,
        "BuyRestrictionCurrent": 0,
        "StackObjectsCount": 8998
      }
    },
    {
      "_id": "61e0a288033bdc459438be5e",
      "_tpl": "5b432f3d5acfc4704b4a1dfb",
      "parentId": "hideout",
      "slotId": "hideout",
      "upd": {
        "BuyRestrictionMax": 10,
        "BuyRestrictionCurrent": 0,
        "StackObjectsCount": 1420000,
        "UnlimitedCount": true
      }
    },
    {
      "_id": "61e0a288033bdc459438be60",
      "_tpl": "5aa7e3abe5b5b000171d064d",
      "parentId": "hideout",
      "slotId": "hideout",
      "upd": {
        "StackObjectsCount": 1852
      }
    },
    {
      "_id": "61e0a288033bdc459438be62",
      "_tpl": "5aa2a7e8e5b5b00016327c16",
      "parentId": "hideout",
      "slotId": "hideout",
      "upd": {
        "StackObjectsCount": 19952
      }
    },
    {
      "_id": "61e0a288033bdc459438be64",
      "_tpl": "5b432d215acfc4771e1c6624",
      "parentId": "hideout",
      "slotId": "hideout",
      "upd": {
        "BuyRestrictionMax": 4,
        "BuyRestrictionCurrent": 0,
        "StackObjectsCount": 4694
      }
    },
    {
      "_id": "61e0a288033bdc459438be66",
      "_tpl": "5b3f3b0e86f7746752107cda",
      "parentId": "hideout",
      "slotId": "hideout",
      "upd": {
        "StackObjectsCount": 1420000,
        "UnlimitedCount": true
      }
    },
    {
      "_id": "61e0a288033bdc459438be68",
      "_tpl": "5b4325355acfc40019478126",
      "parentId": "hideout",
      "slotId": "hideout",
      "upd": {
        "BuyRestrictionMax": 7,
        "BuyRestrictionCurrent": 0,
        "StackObjectsCount": 1420000,
        "UnlimitedCount": true
      }
    },
    {
      "_id": "61e0a288033bdc459438be6a",
      "_tpl": "5aa7e373e5b5b000137b76f0",
      "parentId": "hideout",
      "slotId": "hideout",
      "upd": {
        "StackObjectsCount": 197
      }
    },
    {
      "_id": "61e0a288033bdc459438be6c",
      "_tpl": "5aa7e373e5b5b000137b76f0",
      "parentId": "hideout",
      "slotId": "hideout",
      "upd": {
        "StackObjectsCount": 1977
      }
    },
    {
      "_id": "61e0a288033bdc459438be6e",
      "_tpl": "545cdb794bdc2d3a198b456a",
      "parentId": "hideout",
      "slotId": "hideout",
      "upd": {
        "StackObjectsCount": 149
      }
    },
    {
      "_id": "61e0a288033bdc459438be70",
      "_tpl": "5ab8e79e86f7742d8b372e78",
      "parentId": "hideout",
      "slotId": "hideout",
      "upd": {
        "BuyRestrictionMax": 4,
        "BuyRestrictionCurrent": 0,
        "StackObjectsCount": 831
      }
    },
    {
      "_id": "61e0a288033bdc459438be72",
      "_tpl": "5b4327aa5acfc400175496e0",
      "parentId": "hideout",
      "slotId": "hideout",
      "upd": {
        "StackObjectsCount": 1963
      }
    },
    {
      "_id": "61e0a288033bdc459438be74",
      "_tpl": "5ab8dced86f774646209ec87",
      "parentId": "hideout",
      "slotId": "hideout",
      "upd": {
        "BuyRestrictionMax": 2,
        "BuyRestrictionCurrent": 0,
        "StackObjectsCount": 1921
      }
    },
    {
      "_id": "61e0a288033bdc459438be76",
      "_tpl": "5aa7cfc0e5b5b00015693143",
      "parentId": "hideout",
      "slotId": "hideout",
      "upd": {
        "BuyRestrictionMax": 5,
        "BuyRestrictionCurrent": 0,
        "StackObjectsCount": 19989
      }
    },
    {
      "_id": "61e0a288033bdc459438be78",
      "_tpl": "5b44c8ea86f7742d1627baf1",
      "parentId": "hideout",
      "slotId": "hideout",
      "upd": {
        "BuyRestrictionMax": 5,
        "BuyRestrictionCurrent": 0,
        "StackObjectsCount": 1952
      }
    },
    {
      "_id": "61e0a288033bdc459438be7a",
      "_tpl": "5b40e1525acfc4771e1c6611",
      "parentId": "hideout",
      "slotId": "hideout",
      "upd": {
        "StackObjectsCount": 1949
      }
    },
    {
      "_id": "61e0a288033bdc459438be7e",
      "_tpl": "5b40e2bc5acfc40016388216",
      "parentId": "hideout",
      "slotId": "hideout",
      "upd": {
        "BuyRestrictionMax": 4,
        "BuyRestrictionCurrent": 0,
        "StackObjectsCount": 1977
      }
    },
    {
      "_id": "61e0a288033bdc459438be80",
      "_tpl": "5aa7e276e5b5b000171d0647",
      "parentId": "hideout",
      "slotId": "hideout",
      "upd": {
        "BuyRestrictionMax": 1,
        "BuyRestrictionCurrent": 0,
        "StackObjectsCount": 17
      }
    },
    {
      "_id": "61e0a288033bdc459438be82",
      "_tpl": "5b432b6c5acfc4001a599bf0",
      "parentId": "hideout",
      "slotId": "hideout",
      "upd": {
        "BuyRestrictionMax": 10,
        "BuyRestrictionCurrent": 0,
        "StackObjectsCount": 1496
      }
    },
    {
      "_id": "61e0a288033bdc459438be84",
      "_tpl": "592c2d1a86f7746dbe2af32a",
      "parentId": "hideout",
      "slotId": "hideout",
      "upd": {
        "StackObjectsCount": 4951
      }
    },
    {
      "_id": "61e0a288033bdc459438be86",
      "_tpl": "545cdae64bdc2d39198b4568",
      "parentId": "hideout",
      "slotId": "hideout",
      "upd": {
        "BuyRestrictionMax": 2,
        "BuyRestrictionCurrent": 0,
        "StackObjectsCount": 14528
      }
    },
    {
      "_id": "61e0a288033bdc459438be88",
      "_tpl": "544a5caa4bdc2d1a388b4568",
      "parentId": "hideout",
      "slotId": "hideout",
      "upd": {
        "BuyRestrictionMax": 2,
        "BuyRestrictionCurrent": 0,
        "StackObjectsCount": 4994
      }
    },
    {
      "_id": "61e0a288033bdc459438be8a",
      "_tpl": "5b44cad286f77402a54ae7e5",
      "parentId": "hideout",
      "slotId": "hideout",
      "upd": {
        "BuyRestrictionMax": 1,
        "BuyRestrictionCurrent": 0,
        "StackObjectsCount": 78
      }
    },
    {
      "_id": "61e0a288033bdc459438be8e",
      "_tpl": "5b43271c5acfc432ff4dce65",
      "parentId": "hideout",
      "slotId": "hideout",
      "upd": {
        "StackObjectsCount": 1971
      }
    },
    {
      "_id": "61e0a288033bdc459438be90",
      "_tpl": "5ab8f04f86f774585f4237d8",
      "parentId": "hideout",
      "slotId": "hideout",
      "upd": {
        "StackObjectsCount": 1420000,
        "UnlimitedCount": true
      }
    },
    {
      "_id": "61e0a288033bdc459438be92",
      "_tpl": "5b44d22286f774172b0c9de8",
      "parentId": "hideout",
      "slotId": "hideout",
      "upd": {
        "BuyRestrictionMax": 2,
        "BuyRestrictionCurrent": 0,
        "StackObjectsCount": 471
      }
    },
    {
      "_id": "61e0a288033bdc459438be94",
      "_tpl": "5b3f3af486f774679e752c1f",
      "parentId": "hideout",
      "slotId": "hideout",
      "upd": {
        "StackObjectsCount": 1420000,
        "UnlimitedCount": true
      }
    },
    {
      "_id": "61e0a288033bdc459438be96",
      "_tpl": "5c0e746986f7741453628fe5",
      "parentId": "hideout",
      "slotId": "hideout",
      "upd": {
        "BuyRestrictionMax": 1,
        "BuyRestrictionCurrent": 0,
        "StackObjectsCount": 1864
      }
    },
    {
      "_id": "61e0a288033bdc459438be98",
      "_tpl": "5b432b965acfc47a8774094e",
      "parentId": "hideout",
      "slotId": "hideout",
      "upd": {
        "StackObjectsCount": 1844
      }
    },
    {
      "_id": "61e0a288033bdc459438be9a",
      "_tpl": "5ca21c6986f77479963115a7",
      "parentId": "hideout",
      "slotId": "hideout",
      "upd": {
        "BuyRestrictionMax": 1,
        "BuyRestrictionCurrent": 0,
        "StackObjectsCount": 1951
      }
    },
    {
      "_id": "61e0a288033bdc459438be9c",
      "_tpl": "5ab8e4ed86f7742d8e50c7fa",
      "parentId": "hideout",
      "slotId": "hideout",
      "upd": {
        "BuyRestrictionMax": 1,
        "BuyRestrictionCurrent": 0,
        "StackObjectsCount": 1847
      }
    },
    {
      "_id": "61e0a288033bdc459438be9e",
      "_tpl": "5b40e5e25acfc4001a599bea",
      "parentId": "hideout",
      "slotId": "hideout",
      "upd": {
        "StackObjectsCount": 1420000,
        "UnlimitedCount": true
      }
    },
    {
      "_id": "61e0a288033bdc459438bea0",
      "_tpl": "5d5d87f786f77427997cfaef",
      "parentId": "hideout",
      "slotId": "hideout",
      "upd": {
        "BuyRestrictionMax": 1,
        "BuyRestrictionCurrent": 0,
        "StackObjectsCount": 1989
      }
    },
    {
      "_id": "61e0a288033bdc459438bea4",
      "_tpl": "5aa2ba71e5b5b000137b758f",
      "parentId": "hideout",
      "slotId": "hideout",
      "upd": {
        "BuyRestrictionMax": 4,
        "BuyRestrictionCurrent": 0,
        "StackObjectsCount": 8018
      }
    },
    {
      "_id": "61e0a288033bdc459438bea6",
      "_tpl": "5ab8ebf186f7742d8b372e80",
      "parentId": "hideout",
      "slotId": "hideout",
      "upd": {
        "BuyRestrictionMax": 2,
        "BuyRestrictionCurrent": 0,
        "StackObjectsCount": 1899
      }
    },
    {
      "_id": "61e0a288033bdc459438bea8",
      "_tpl": "5b44c6ae86f7742d1627baea",
      "parentId": "hideout",
      "slotId": "hideout",
      "upd": {
        "BuyRestrictionMax": 3,
        "BuyRestrictionCurrent": 0,
        "StackObjectsCount": 1944
      }
    },
    {
      "_id": "61e0a288033bdc459438beaa",
      "_tpl": "5b40e4035acfc47a87740943",
      "parentId": "hideout",
      "slotId": "hideout",
      "upd": {
        "BuyRestrictionMax": 3,
        "BuyRestrictionCurrent": 0,
        "StackObjectsCount": 5663
      }
    },
    {
      "_id": "61e0a288033bdc459438beac",
      "_tpl": "5c0e5bab86f77461f55ed1f3",
      "parentId": "hideout",
      "slotId": "hideout",
      "upd": {
        "BuyRestrictionMax": 3,
        "BuyRestrictionCurrent": 0,
        "StackObjectsCount": 14787
      }
    },
    {
      "_id": "61e0a288033bdc459438beae",
      "_tpl": "5a7c4850e899ef00150be885",
      "parentId": "hideout",
      "slotId": "hideout",
      "upd": {
        "BuyRestrictionMax": 4,
        "BuyRestrictionCurrent": 0,
        "StackObjectsCount": 5075
      }
    },
    {
      "_id": "61e0a288033bdc459438beb0",
      "_tpl": "5645bc214bdc2d363b8b4571",
      "parentId": "hideout",
      "slotId": "hideout",
      "upd": {
        "StackObjectsCount": 32964
      }
    },
    {
      "_id": "61e0a288033bdc459438beb2",
      "_tpl": "60a283193cb70855c43a381d",
      "parentId": "hideout",
      "slotId": "hideout",
      "upd": {
        "BuyRestrictionMax": 1,
        "BuyRestrictionCurrent": 0,
        "StackObjectsCount": 1992
      }
    },
    {
      "_id": "61e0a288033bdc459438beb4",
      "_tpl": "618bb76513f5097c8d5aa2d5",
      "parentId": "hideout",
      "slotId": "hideout",
      "upd": {
        "BuyRestrictionMax": 5,
        "BuyRestrictionCurrent": 0,
        "StackObjectsCount": 5762
      }
    },
    {
      "_id": "61e0a288033bdc459438beb6",
      "_tpl": "619cf0335771dd3c390269ae",
      "parentId": "hideout",
      "slotId": "hideout",
      "upd": {
        "BuyRestrictionMax": 5,
        "BuyRestrictionCurrent": 0,
        "StackObjectsCount": 5974
      }
    },
    {
      "_id": "61e0a288033bdc459438beb8",
      "_tpl": "5aa2ba19e5b5b00014028f4e",
      "parentId": "hideout",
      "slotId": "hideout",
      "upd": {
        "BuyRestrictionMax": 10,
        "BuyRestrictionCurrent": 0,
        "StackObjectsCount": 1425000,
        "UnlimitedCount": true
      }
    },
    {
      "_id": "61e0a288033bdc459438beba",
      "_tpl": "5ab8dab586f77441cd04f2a2",
      "parentId": "hideout",
      "slotId": "hideout",
      "upd": {
        "StackObjectsCount": 1973
      }
    },
    {
      "_id": "61e0a288033bdc459438bebc",
      "_tpl": "5b3f3ade86f7746b6b790d8e",
      "parentId": "hideout",
      "slotId": "hideout",
      "upd": {
        "StackObjectsCount": 1420000,
        "UnlimitedCount": true
      }
    },
    {
      "_id": "61e0a288033bdc459438bebe",
      "_tpl": "5648a69d4bdc2ded0b8b457b",
      "parentId": "hideout",
      "slotId": "hideout",
      "upd": {
        "BuyRestrictionMax": 6,
        "BuyRestrictionCurrent": 0,
        "StackObjectsCount": 39615
      }
    },
    {
      "_id": "61e0a288033bdc459438bec0",
      "_tpl": "5b44d22286f774172b0c9de8",
      "parentId": "hideout",
      "slotId": "hideout",
      "upd": {
        "BuyRestrictionMax": 3,
        "BuyRestrictionCurrent": 0,
        "StackObjectsCount": 1935
      }
    },
    {
      "_id": "61e0a289033bdc459438bec2",
      "_tpl": "5645bcc04bdc2d363b8b4572",
      "parentId": "hideout",
      "slotId": "hideout",
      "upd": {
        "BuyRestrictionMax": 8,
        "BuyRestrictionCurrent": 0,
        "StackObjectsCount": 57237
      }
    },
    {
      "_id": "61e0a289033bdc459438bec4",
      "_tpl": "6034d2d697633951dc245ea6",
      "parentId": "hideout",
      "slotId": "hideout",
      "upd": {
        "BuyRestrictionMax": 3,
        "BuyRestrictionCurrent": 0,
        "StackObjectsCount": 3984
      }
    },
    {
      "_id": "61e0a289033bdc459438bec6",
      "_tpl": "5ab8f85d86f7745cd93a1cf5",
      "parentId": "hideout",
      "slotId": "hideout",
      "upd": {
        "BuyRestrictionMax": 10,
        "BuyRestrictionCurrent": 0,
        "StackObjectsCount": 1420000,
        "UnlimitedCount": true
      }
    },
    {
      "_id": "61e0a289033bdc459438bec8",
      "_tpl": "5aa7e373e5b5b000137b76f0",
      "parentId": "hideout",
      "slotId": "hideout",
      "upd": {
        "BuyRestrictionMax": 3,
        "BuyRestrictionCurrent": 0,
        "StackObjectsCount": 692
      }
    },
    {
      "_id": "61e0a289033bdc459438beca",
      "_tpl": "5b40e61f5acfc4001a599bec",
      "parentId": "hideout",
      "slotId": "hideout",
      "upd": {
        "StackObjectsCount": 1425000,
        "UnlimitedCount": true
      }
    },
    {
      "_id": "61e0a289033bdc459438becc",
      "_tpl": "5c0e57ba86f7747fa141986d",
      "parentId": "hideout",
      "slotId": "hideout",
      "upd": {
        "StackObjectsCount": 1961
      }
    },
    {
      "_id": "61e0a289033bdc459438bece",
      "_tpl": "5648a7494bdc2d9d488b4583",
      "parentId": "hideout",
      "slotId": "hideout",
      "upd": {
        "BuyRestrictionMax": 3,
        "BuyRestrictionCurrent": 0,
        "StackObjectsCount": 6638
      }
    },
    {
      "_id": "61e0a289033bdc459438bed0",
      "_tpl": "5c1a1cc52e221602b3136e3d",
      "parentId": "hideout",
      "slotId": "hideout",
      "upd": {
        "StackObjectsCount": 1986
      }
    },
    {
      "_id": "61e0a289033bdc459438bed2",
      "_tpl": "5c0e774286f77468413cc5b2",
      "parentId": "hideout",
      "slotId": "hideout",
      "upd": {
        "BuyRestrictionMax": 1,
        "BuyRestrictionCurrent": 0,
        "StackObjectsCount": 12
      }
    },
    {
      "_id": "61e0a289033bdc459438bed4",
      "_tpl": "5c0919b50db834001b7ce3b9",
      "parentId": "hideout",
      "slotId": "hideout",
      "upd": {
        "BuyRestrictionMax": 1,
        "BuyRestrictionCurrent": 0,
        "StackObjectsCount": 1993
      }
    },
    {
      "_id": "61e0a289033bdc459438bed6",
      "_tpl": "545cdb794bdc2d3a198b456a",
      "parentId": "hideout",
      "slotId": "hideout",
      "upd": {
        "BuyRestrictionMax": 2,
        "BuyRestrictionCurrent": 0,
        "StackObjectsCount": 196
      }
    },
    {
      "_id": "61e0a289033bdc459438bed8",
      "_tpl": "557ff21e4bdc2d89578b4586",
      "parentId": "hideout",
      "slotId": "hideout",
      "upd": {
        "StackObjectsCount": 1425000,
        "UnlimitedCount": true
      }
    },
    {
      "_id": "61e0a289033bdc459438beda",
      "_tpl": "5b46238386f7741a693bcf9c",
      "parentId": "hideout",
      "slotId": "hideout",
      "upd": {
        "BuyRestrictionMax": 4,
        "BuyRestrictionCurrent": 0,
        "StackObjectsCount": 7947
      }
    },
    {
      "_id": "61e0a289033bdc459438bedc",
      "_tpl": "5c0e6a1586f77404597b4965",
      "parentId": "hideout",
      "slotId": "hideout",
      "upd": {
        "StackObjectsCount": 1674
      }
    },
    {
      "_id": "61e0a289033bdc459438bede",
      "_tpl": "5c0d32fcd174af02a1659c75",
      "parentId": "hideout",
      "slotId": "hideout",
      "upd": {
        "StackObjectsCount": 1967
      }
    },
    {
      "_id": "61e0a289033bdc459438bee0",
      "_tpl": "618cfae774bb2d036a049e7c",
      "parentId": "hideout",
      "slotId": "hideout",
      "upd": {
        "BuyRestrictionMax": 4,
        "BuyRestrictionCurrent": 0,
        "StackObjectsCount": 1981
      }
    },
    {
      "_id": "61e0a289033bdc459438bee2",
      "_tpl": "5b4329f05acfc47a86086aa1",
      "parentId": "hideout",
      "slotId": "hideout",
      "upd": {
        "BuyRestrictionMax": 1,
        "BuyRestrictionCurrent": 0,
        "StackObjectsCount": 37
      }
    },
    {
      "_id": "61e0a289033bdc459438bee4",
      "_tpl": "5aa7d03ae5b5b00016327db5",
      "parentId": "hideout",
      "slotId": "hideout",
      "upd": {
        "BuyRestrictionMax": 3,
        "BuyRestrictionCurrent": 0,
        "StackObjectsCount": 1842
      }
    },
    {
      "_id": "61e0a289033bdc459438bee6",
      "_tpl": "5ac4c50d5acfc40019262e87",
      "parentId": "hideout",
      "slotId": "hideout",
      "upd": {
        "StackObjectsCount": 1881
      }
    },
    {
      "_id": "61e0a289033bdc459438bee8",
      "_tpl": "5b432b2f5acfc4771e1c6622",
      "parentId": "hideout",
      "slotId": "hideout",
      "upd": {
        "BuyRestrictionMax": 7,
        "BuyRestrictionCurrent": 0,
        "StackObjectsCount": 1871
      }
    },
    {
      "_id": "61e0a289033bdc459438beea",
      "_tpl": "5c091a4e0db834001d5addc8",
      "parentId": "hideout",
      "slotId": "hideout",
      "upd": {
        "BuyRestrictionMax": 2,
        "BuyRestrictionCurrent": 0,
        "StackObjectsCount": 1962
      }
    },
    {
      "_id": "61e0a289033bdc459438beec",
      "_tpl": "5c165d832e2216398b5a7e36",
      "parentId": "hideout",
      "slotId": "hideout",
      "upd": {
        "StackObjectsCount": 1967
      }
    },
    {
      "_id": "61e0a289033bdc459438beee",
      "_tpl": "5c0e51be86f774598e797894",
      "parentId": "hideout",
      "slotId": "hideout",
      "upd": {
        "BuyRestrictionMax": 2,
        "BuyRestrictionCurrent": 0,
        "StackObjectsCount": 8626
      }
    },
    {
      "_id": "61e0a289033bdc459438bef0",
      "_tpl": "5ab8dced86f774646209ec87",
      "parentId": "hideout",
      "slotId": "hideout",
      "upd": {
        "StackObjectsCount": 1996
      }
    },
    {
      "_id": "61e0a289033bdc459438bef2",
      "_tpl": "5c0e53c886f7747fa54205c7",
      "parentId": "hideout",
      "slotId": "hideout",
      "upd": {
        "StackObjectsCount": 1900
      }
    },
    {
      "_id": "61e0a289033bdc459438bef4",
      "_tpl": "5c0e722886f7740458316a57",
      "parentId": "hideout",
      "slotId": "hideout",
      "upd": {
        "StackObjectsCount": 1945
      }
    },
    {
      "_id": "61e0a289033bdc459438bef6",
      "_tpl": "5ab8e79e86f7742d8b372e78",
      "parentId": "hideout",
      "slotId": "hideout",
      "upd": {
        "BuyRestrictionMax": 3,
        "BuyRestrictionCurrent": 0,
        "StackObjectsCount": 5523
      }
    },
    {
      "_id": "61e0a289033bdc459438bef8",
      "_tpl": "59e7643b86f7742cbf2c109a",
      "parentId": "hideout",
      "slotId": "hideout",
      "upd": {
        "BuyRestrictionMax": 4,
        "BuyRestrictionCurrent": 0,
        "StackObjectsCount": 14601
      }
    },
    {
      "_id": "61e0a289033bdc459438befa",
      "_tpl": "5ab8f4ff86f77431c60d91ba",
      "parentId": "hideout",
      "slotId": "hideout",
      "upd": {
        "BuyRestrictionMax": 5,
        "BuyRestrictionCurrent": 0,
        "StackObjectsCount": 8662
      }
    },
    {
      "_id": "61e0a289033bdc459438befc",
      "_tpl": "5aa7e454e5b5b0214e506fa2",
      "parentId": "hideout",
      "slotId": "hideout",
      "upd": {
        "BuyRestrictionMax": 4,
        "BuyRestrictionCurrent": 0,
        "StackObjectsCount": 1911
      }
    },
    {
      "_id": "61e0a289033bdc459438befe",
      "_tpl": "5b3f3b0186f774021a2afef7",
      "parentId": "hideout",
      "slotId": "hideout",
      "upd": {
        "StackObjectsCount": 1420000,
        "UnlimitedCount": true
      }
    },
    {
      "_id": "61e0a289033bdc459438bf00",
      "_tpl": "5b3f16c486f7747c327f55f7",
      "parentId": "hideout",
      "slotId": "hideout",
      "upd": {
        "StackObjectsCount": 1420000,
        "UnlimitedCount": true
      }
    },
    {
      "_id": "61e0a289033bdc459438bf02",
      "_tpl": "5929a2a086f7744f4b234d43",
      "parentId": "hideout",
      "slotId": "hideout",
      "upd": {
        "BuyRestrictionMax": 6,
        "BuyRestrictionCurrent": 0,
        "StackObjectsCount": 5831
      }
    },
    {
      "_id": "61e0a289033bdc459438bf04",
      "_tpl": "592c2d1a86f7746dbe2af32a",
      "parentId": "hideout",
      "slotId": "hideout",
      "upd": {
        "BuyRestrictionMax": 1,
        "BuyRestrictionCurrent": 0,
        "StackObjectsCount": 168
      }
    },
    {
      "_id": "61e0a289033bdc459438bf06",
      "_tpl": "5a16b672fcdbcb001912fa83",
      "parentId": "hideout",
      "slotId": "hideout",
      "upd": {
        "StackObjectsCount": 1646
      }
    },
    {
      "_id": "61e0a289033bdc459438bf08",
      "_tpl": "572b7f1624597762ae139822",
      "parentId": "hideout",
      "slotId": "hideout",
      "upd": {
        "StackObjectsCount": 1425000,
        "UnlimitedCount": true
      }
    },
    {
      "_id": "61e0a289033bdc459438bf0a",
      "_tpl": "5ac8d6885acfc400180ae7b0",
      "parentId": "hideout",
      "slotId": "hideout",
      "upd": {
        "BuyRestrictionMax": 1,
        "BuyRestrictionCurrent": 0,
        "StackObjectsCount": 1457
      }
    },
    {
      "_id": "61e0a289033bdc459438bf0c",
      "_tpl": "5648a7494bdc2d9d488b4583",
      "parentId": "hideout",
      "slotId": "hideout",
      "upd": {
        "StackObjectsCount": 1454000,
        "UnlimitedCount": true
      }
    },
    {
      "_id": "61e0a289033bdc459438bf0e",
      "_tpl": "544a5cde4bdc2d39388b456b",
      "parentId": "hideout",
      "slotId": "hideout",
      "upd": {
        "BuyRestrictionMax": 8,
        "BuyRestrictionCurrent": 0,
        "StackObjectsCount": 107464
      }
    },
    {
      "_id": "61e0a289033bdc459438bf10",
      "_tpl": "5ab8f39486f7745cd93a1cca",
      "parentId": "hideout",
      "slotId": "hideout",
      "upd": {
        "BuyRestrictionMax": 4,
        "BuyRestrictionCurrent": 0,
        "StackObjectsCount": 15865
      }
    },
    {
      "_id": "61e0a289033bdc459438bf12",
      "_tpl": "5aa2b986e5b5b00014028f4c",
      "parentId": "hideout",
      "slotId": "hideout",
      "upd": {
        "StackObjectsCount": 7575
      }
    },
    {
      "_id": "61e0a289033bdc459438bf14",
      "_tpl": "5aa2b9ede5b5b000137b758b",
      "parentId": "hideout",
      "slotId": "hideout",
      "upd": {
        "BuyRestrictionMax": 3,
        "BuyRestrictionCurrent": 0,
        "StackObjectsCount": 1997
      }
    },
    {
      "_id": "61e0a289033bdc459438bf16",
      "_tpl": "5aa2b87de5b5b00016327c25",
      "parentId": "hideout",
      "slotId": "hideout",
      "upd": {
        "StackObjectsCount": 19898
      }
    },
    {
      "_id": "61e0a289033bdc459438bf18",
      "_tpl": "5aa7e3abe5b5b000171d064d",
      "parentId": "hideout",
      "slotId": "hideout",
      "upd": {
        "StackObjectsCount": 1940
      }
    },
    {
      "_id": "61e0a289033bdc459438bf1a",
      "_tpl": "5b40e3f35acfc40016388218",
      "parentId": "hideout",
      "slotId": "hideout",
      "upd": {
        "StackObjectsCount": 1839
      }
    },
    {
      "_id": "61e0a289033bdc459438bf1c",
      "_tpl": "5aa2ba46e5b5b000137b758d",
      "parentId": "hideout",
      "slotId": "hideout",
      "upd": {
        "StackObjectsCount": 816
      }
    },
    {
      "_id": "61e0a289033bdc459438bf1e",
      "_tpl": "5c0e3eb886f7742015526062",
      "parentId": "hideout",
      "slotId": "hideout",
      "upd": {
        "BuyRestrictionMax": 1,
        "BuyRestrictionCurrent": 0,
        "StackObjectsCount": 15128
      }
    },
    {
      "_id": "61e0a289033bdc459438bf20",
      "_tpl": "5aa7d193e5b5b000171d063f",
      "parentId": "hideout",
      "slotId": "hideout",
      "upd": {
        "BuyRestrictionMax": 6,
        "BuyRestrictionCurrent": 0,
        "StackObjectsCount": 4995
      }
    },
    {
      "_id": "61e0a289033bdc459438bf22",
      "_tpl": "5ab8ebf186f7742d8b372e80",
      "parentId": "hideout",
      "slotId": "hideout",
      "upd": {
        "BuyRestrictionMax": 1,
        "BuyRestrictionCurrent": 0,
        "StackObjectsCount": 1934
      }
    },
    {
      "_id": "61e0a289033bdc459438bf24",
      "_tpl": "5b44d0de86f774503d30cba8",
      "parentId": "hideout",
      "slotId": "hideout",
      "upd": {
        "BuyRestrictionMax": 2,
        "BuyRestrictionCurrent": 0,
        "StackObjectsCount": 878
      }
    },
    {
      "_id": "61e0a289033bdc459438bf26",
      "_tpl": "5645bcc04bdc2d363b8b4572",
      "parentId": "hideout",
      "slotId": "hideout",
      "upd": {
        "BuyRestrictionMax": 5,
        "BuyRestrictionCurrent": 0,
        "StackObjectsCount": 1888
      }
    },
    {
      "_id": "61e0a289033bdc459438bf28",
      "_tpl": "59e7711e86f7746cae05fbe1",
      "parentId": "hideout",
      "slotId": "hideout",
      "upd": {
        "StackObjectsCount": 1420000,
        "UnlimitedCount": true
      }
    },
    {
      "_id": "61e0a289033bdc459438bf2a",
      "_tpl": "5ca20ee186f774799474abc2",
      "parentId": "hideout",
      "slotId": "hideout",
      "upd": {
        "BuyRestrictionMax": 1,
        "BuyRestrictionCurrent": 0,
        "StackObjectsCount": 200
      }
    },
    {
      "_id": "61e0a289033bdc459438bf2c",
      "_tpl": "5c06c6a80db834001b735491",
      "parentId": "hideout",
      "slotId": "hideout",
      "upd": {
        "StackObjectsCount": 1470000,
        "UnlimitedCount": true
      }
    },
    {
      "_id": "61e0a289033bdc459438bf2e",
      "_tpl": "5ca2151486f774244a3b8d30",
      "parentId": "hideout",
      "slotId": "hideout",
      "upd": {
        "BuyRestrictionMax": 1,
        "BuyRestrictionCurrent": 0,
        "StackObjectsCount": 1978
      }
    },
    {
      "_id": "61e0a289033bdc459438bf30",
      "_tpl": "5ca20d5986f774331e7c9602",
      "parentId": "hideout",
      "slotId": "hideout",
      "upd": {
        "BuyRestrictionMax": 8,
        "BuyRestrictionCurrent": 0,
        "StackObjectsCount": 67742
      }
    },
    {
      "_id": "61e0a289033bdc459438bf32",
      "_tpl": "5ca20abf86f77418567a43f2",
      "parentId": "hideout",
      "slotId": "hideout",
      "upd": {
        "StackObjectsCount": 19684
      }
    },
    {
      "_id": "61e0a289033bdc459438bf34",
      "_tpl": "5aa2ba19e5b5b00014028f4e",
      "parentId": "hideout",
      "slotId": "hideout",
      "upd": {
        "BuyRestrictionMax": 4,
        "BuyRestrictionCurrent": 0,
        "StackObjectsCount": 19989
      }
    },
    {
      "_id": "61e0a289033bdc459438bf36",
      "_tpl": "5ca2113f86f7740b2547e1d2",
      "parentId": "hideout",
      "slotId": "hideout",
      "upd": {
        "BuyRestrictionMax": 2,
        "BuyRestrictionCurrent": 0,
        "StackObjectsCount": 1992
      }
    },
    {
      "_id": "61e0a289033bdc459438bf38",
      "_tpl": "5d5d940f86f7742797262046",
      "parentId": "hideout",
      "slotId": "hideout",
      "upd": {
        "BuyRestrictionMax": 2,
        "BuyRestrictionCurrent": 0,
        "StackObjectsCount": 1864
      }
    },
    {
      "_id": "61e0a289033bdc459438bf3a",
      "_tpl": "5d6d3943a4b9360dbc46d0cc",
      "parentId": "hideout",
      "slotId": "hideout",
      "upd": {
        "StackObjectsCount": 1958
      }
    },
    {
      "_id": "61e0a289033bdc459438bf3c",
      "_tpl": "5d5d85c586f774279a21cbdb",
      "parentId": "hideout",
      "slotId": "hideout",
      "upd": {
        "BuyRestrictionMax": 8,
        "BuyRestrictionCurrent": 0,
        "StackObjectsCount": 19926
      }
    },
    {
      "_id": "61e0a289033bdc459438bf3e",
      "_tpl": "5d5d646386f7742797261fd9",
      "parentId": "hideout",
      "slotId": "hideout",
      "upd": {
        "BuyRestrictionMax": 3,
        "BuyRestrictionCurrent": 0,
        "StackObjectsCount": 16510
      }
    },
    {
      "_id": "61e0a289033bdc459438bf40",
      "_tpl": "5d6d2ef3a4b93618084f58bd",
      "parentId": "hideout",
      "slotId": "hideout",
      "upd": {
        "BuyRestrictionMax": 10,
        "BuyRestrictionCurrent": 0,
        "StackObjectsCount": 1425000,
        "UnlimitedCount": true
      }
    },
    {
      "_id": "61e0a289033bdc459438bf42",
      "_tpl": "5d5fca1ea4b93635fd598c07",
      "parentId": "hideout",
      "slotId": "hideout",
      "upd": {
        "StackObjectsCount": 19118
      }
    },
    {
      "_id": "61e0a289033bdc459438bf44",
      "_tpl": "5d5d87f786f77427997cfaef",
      "parentId": "hideout",
      "slotId": "hideout",
      "upd": {
        "BuyRestrictionMax": 2,
        "BuyRestrictionCurrent": 0,
        "StackObjectsCount": 1987
      }
    },
    {
      "_id": "61e0a289033bdc459438bf46",
      "_tpl": "5d6d3829a4b9361bc8618943",
      "parentId": "hideout",
      "slotId": "hideout",
      "upd": {
        "BuyRestrictionMax": 3,
        "BuyRestrictionCurrent": 0,
        "StackObjectsCount": 19956
      }
    },
    {
      "_id": "61e0a289033bdc459438bf48",
      "_tpl": "5d6d3716a4b9361bc8618872",
      "parentId": "hideout",
      "slotId": "hideout",
      "upd": {
        "BuyRestrictionMax": 3,
        "BuyRestrictionCurrent": 0,
        "StackObjectsCount": 19992
      }
    },
    {
      "_id": "61e0a289033bdc459438bf4a",
      "_tpl": "5d6d3be5a4b9361bc73bc763",
      "parentId": "hideout",
      "slotId": "hideout",
      "upd": {
        "BuyRestrictionMax": 4,
        "BuyRestrictionCurrent": 0,
        "StackObjectsCount": 19998
      }
    },
    {
      "_id": "61e0a289033bdc459438bf4c",
      "_tpl": "5d6d2e22a4b9361bd5780d05",
      "parentId": "hideout",
      "slotId": "hideout",
      "upd": {
        "StackObjectsCount": 19931
      }
    },
    {
      "_id": "61e0a289033bdc459438bf4e",
      "_tpl": "5b4329f05acfc47a86086aa1",
      "parentId": "hideout",
      "slotId": "hideout",
      "upd": {
        "BuyRestrictionMax": 1,
        "BuyRestrictionCurrent": 0,
        "StackObjectsCount": 1979
      }
    },
    {
      "_id": "61e0a289033bdc459438bf50",
      "_tpl": "5c0e746986f7741453628fe5",
      "parentId": "hideout",
      "slotId": "hideout",
      "upd": {
        "BuyRestrictionMax": 1,
        "BuyRestrictionCurrent": 0,
        "StackObjectsCount": 6452
      }
    },
    {
      "_id": "61e0a289033bdc459438bf52",
      "_tpl": "5d6d3829a4b9361bc8618943",
      "parentId": "hideout",
      "slotId": "hideout",
      "upd": {
        "BuyRestrictionMax": 2,
        "BuyRestrictionCurrent": 0,
        "StackObjectsCount": 1978
      }
    },
    {
      "_id": "61e0a289033bdc459438bf54",
      "_tpl": "5a16bb52fcdbcb001a3b00dc",
      "parentId": "hideout",
      "slotId": "hideout",
      "upd": {
        "BuyRestrictionMax": 4,
        "BuyRestrictionCurrent": 0,
        "StackObjectsCount": 1976
      }
    },
    {
      "_id": "61e0a289033bdc459438bf56",
      "_tpl": "5df8a42886f77412640e2e75",
      "parentId": "hideout",
      "slotId": "hideout",
      "upd": {
        "BuyRestrictionMax": 3,
        "BuyRestrictionCurrent": 0,
        "StackObjectsCount": 19987
      }
    },
    {
      "_id": "61e0a289033bdc459438bf58",
      "_tpl": "5df8a2ca86f7740bfe6df777",
      "parentId": "hideout",
      "slotId": "hideout",
      "upd": {
        "BuyRestrictionMax": 6,
        "BuyRestrictionCurrent": 0,
        "StackObjectsCount": 19102
      }
    },
    {
      "_id": "61e0a289033bdc459438bf5a",
      "_tpl": "5e4abc1f86f774069619fbaa",
      "parentId": "hideout",
      "slotId": "hideout",
      "upd": {
        "StackObjectsCount": 1425000,
        "UnlimitedCount": true
      }
    },
    {
      "_id": "61e0a289033bdc459438bf5c",
      "_tpl": "5e4abb5086f77406975c9342",
      "parentId": "hideout",
      "slotId": "hideout",
      "upd": {
        "BuyRestrictionMax": 1,
        "BuyRestrictionCurrent": 0,
        "StackObjectsCount": 44
      }
    },
    {
      "_id": "61e0a289033bdc459438bf5e",
      "_tpl": "5f60c74e3b85f6263c145586",
      "parentId": "hideout",
      "slotId": "hideout",
      "upd": {
        "BuyRestrictionMax": 1,
        "BuyRestrictionCurrent": 0,
        "StackObjectsCount": 1825
      }
    },
    {
      "_id": "61e0a289033bdc459438bf60",
      "_tpl": "5f60c85b58eff926626a60f7",
      "parentId": "hideout",
      "slotId": "hideout",
      "upd": {
        "BuyRestrictionMax": 1,
        "BuyRestrictionCurrent": 0,
        "StackObjectsCount": 1831
      }
    },
    {
      "_id": "61e0a289033bdc459438bf62",
      "_tpl": "5f60e6403b85f6263c14558c",
      "parentId": "hideout",
      "slotId": "hideout",
      "upd": {
        "BuyRestrictionMax": 5,
        "BuyRestrictionCurrent": 0,
        "StackObjectsCount": 19987
      }
    },
    {
      "_id": "61e0a289033bdc459438bf64",
      "_tpl": "5f5e467b0bc58666c37e7821",
      "parentId": "hideout",
      "slotId": "hideout",
      "upd": {
        "BuyRestrictionMax": 3,
        "BuyRestrictionCurrent": 0,
        "StackObjectsCount": 18855
      }
    },
    {
      "_id": "61e0a289033bdc459438bf66",
      "_tpl": "5f5e46b96bdad616ad46d613",
      "parentId": "hideout",
      "slotId": "hideout",
      "upd": {
        "BuyRestrictionMax": 3,
        "BuyRestrictionCurrent": 0,
        "StackObjectsCount": 19903
      }
    },
    {
      "_id": "61e0a289033bdc459438bf68",
      "_tpl": "5f60e7788adaa7100c3adb49",
      "parentId": "hideout",
      "slotId": "hideout",
      "upd": {
        "BuyRestrictionMax": 3,
        "BuyRestrictionCurrent": 0,
        "StackObjectsCount": 19999
      }
    },
    {
      "_id": "61e0a289033bdc459438bf6a",
      "_tpl": "5f60e784f2bcbb675b00dac7",
      "parentId": "hideout",
      "slotId": "hideout",
      "upd": {
        "BuyRestrictionMax": 5,
        "BuyRestrictionCurrent": 0,
        "StackObjectsCount": 19978
      }
    },
    {
      "_id": "61e0a289033bdc459438bf6c",
      "_tpl": "5fd4c60f875c30179f5d04c2",
      "parentId": "hideout",
      "slotId": "hideout",
      "upd": {
        "BuyRestrictionMax": 8,
        "BuyRestrictionCurrent": 0,
        "StackObjectsCount": 199964
      }
    },
    {
      "_id": "61e0a289033bdc459438bf6e",
      "_tpl": "544a5caa4bdc2d1a388b4568",
      "parentId": "hideout",
      "slotId": "hideout",
      "upd": {
        "BuyRestrictionMax": 1,
        "BuyRestrictionCurrent": 0,
        "StackObjectsCount": 1942
      }
    },
    {
      "_id": "61e0a289033bdc459438bf70",
      "_tpl": "5645bc214bdc2d363b8b4571",
      "parentId": "hideout",
      "slotId": "hideout",
      "upd": {
        "BuyRestrictionMax": 1,
        "BuyRestrictionCurrent": 0,
        "StackObjectsCount": 1850
      }
    },
    {
      "_id": "61e0a289033bdc459438bf72",
      "_tpl": "5ca20d5986f774331e7c9602",
      "parentId": "hideout",
      "slotId": "hideout",
      "upd": {
        "BuyRestrictionMax": 3,
        "BuyRestrictionCurrent": 0,
        "StackObjectsCount": 9901
      }
    },
    {
      "_id": "61e0a289033bdc459438bf74",
      "_tpl": "5c0e446786f7742013381639",
      "parentId": "hideout",
      "slotId": "hideout",
      "upd": {
        "BuyRestrictionMax": 2,
        "BuyRestrictionCurrent": 0,
        "StackObjectsCount": 1995
      }
    },
    {
      "_id": "61e0a289033bdc459438bf76",
      "_tpl": "603648ff5a45383c122086ac",
      "parentId": "hideout",
      "slotId": "hideout",
      "upd": {
        "BuyRestrictionMax": 8,
        "BuyRestrictionCurrent": 0,
        "StackObjectsCount": 11853
      }
    },
    {
      "_id": "61e0a289033bdc459438bf78",
      "_tpl": "5d5d646386f7742797261fd9",
      "parentId": "hideout",
      "slotId": "hideout",
      "upd": {
        "BuyRestrictionMax": 2,
        "BuyRestrictionCurrent": 0,
        "StackObjectsCount": 1982
      }
    },
    {
      "_id": "61e0a289033bdc459438bf7a",
      "_tpl": "6034d0230ca681766b6a0fb5",
      "parentId": "hideout",
      "slotId": "hideout",
      "upd": {
        "StackObjectsCount": 1420000,
        "UnlimitedCount": true
      }
    },
    {
      "_id": "61e0a289033bdc459438bf7c",
      "_tpl": "6034d103ca006d2dca39b3f0",
      "parentId": "hideout",
      "slotId": "hideout",
      "upd": {
        "BuyRestrictionMax": 4,
        "BuyRestrictionCurrent": 0,
        "StackObjectsCount": 4800
      }
    },
    {
      "_id": "61e0a289033bdc459438bf7e",
      "_tpl": "60a6220e953894617404b00a",
      "parentId": "hideout",
      "slotId": "hideout",
      "upd": {
        "BuyRestrictionMax": 6,
        "BuyRestrictionCurrent": 0,
        "StackObjectsCount": 7955
      }
    },
    {
      "_id": "61e0a289033bdc459438bf80",
      "_tpl": "60b52e5bc7d8103275739d67",
      "parentId": "hideout",
      "slotId": "hideout",
      "upd": {
        "StackObjectsCount": 1420000,
        "UnlimitedCount": true
      }
    },
    {
      "_id": "61e0a289033bdc459438bf82",
      "_tpl": "609e8540d5c319764c2bc2e9",
      "parentId": "hideout",
      "slotId": "hideout",
      "upd": {
        "BuyRestrictionMax": 2,
        "BuyRestrictionCurrent": 0,
        "StackObjectsCount": 4748
      }
    },
    {
      "_id": "61e0a289033bdc459438bf84",
      "_tpl": "60a621c49c197e4e8c4455e6",
      "parentId": "hideout",
      "slotId": "hideout",
      "upd": {
        "BuyRestrictionMax": 3,
        "BuyRestrictionCurrent": 0,
        "StackObjectsCount": 3994
      }
    },
    {
      "_id": "61e0a289033bdc459438bf86",
      "_tpl": "60a272cc93ef783291411d8e",
      "parentId": "hideout",
      "slotId": "hideout",
      "upd": {
        "BuyRestrictionMax": 4,
        "BuyRestrictionCurrent": 0,
        "StackObjectsCount": 4920
      }
    },
    {
      "_id": "61e0a289033bdc459438bf88",
      "_tpl": "60a2828e8689911a226117f9",
      "parentId": "hideout",
      "slotId": "hideout",
      "upd": {
        "BuyRestrictionMax": 4,
        "BuyRestrictionCurrent": 0,
        "StackObjectsCount": 4533
      }
    },
    {
      "_id": "61e0a289033bdc459438bf8a",
      "_tpl": "61bc85697113f767765c7fe7",
      "parentId": "hideout",
      "slotId": "hideout",
      "upd": {
        "BuyRestrictionMax": 2,
        "BuyRestrictionCurrent": 0,
        "StackObjectsCount": 12456
      }
    },
    {
      "_id": "61e0a289033bdc459438bf8c",
      "_tpl": "61bcc89aef0f505f0c6cd0fc",
      "parentId": "hideout",
      "slotId": "hideout",
      "upd": {
        "BuyRestrictionMax": 2,
        "BuyRestrictionCurrent": 0,
        "StackObjectsCount": 5736
      }
    },
    {
      "_id": "8dbec7bdd5679cc8a22ad7cd",
      "_tpl": "5fd4c474dd870108a754b241",
      "parentId": "hideout",
      "slotId": "hideout",
      "upd": {
        "BuyRestrictionMax": 1,
        "BuyRestrictionCurrent": 0,
        "StackObjectsCount": 2000,
        "UnlimitedCount": false
      }
    },
    {
      "_id": "07620747e7cf2dfe7228262c",
      "_tpl": "5aa7e4a4e5b5b000137b76f2",
      "parentId": "hideout",
      "slotId": "hideout",
      "upd": {
        "BuyRestrictionMax": 4,
        "BuyRestrictionCurrent": 0,
        "StackObjectsCount": 999999,
        "UnlimitedCount": true
      }
    },
    {
      "_id": "2927cf4598186e4dbaa00f7e",
      "_tpl": "5bffe7930db834001b734a39",
      "parentId": "hideout",
      "slotId": "hideout",
      "upd": {
        "BuyRestrictionMax": 1,
        "BuyRestrictionCurrent": 0,
        "StackObjectsCount": 200,
        "UnlimitedCount": false
      }
    },
    {
      "_id": "758b83b84920338da57630c3",
      "_tpl": "5e4ac41886f77406a511c9a8",
      "parentId": "hideout",
      "slotId": "hideout",
      "upd": {
        "BuyRestrictionMax": 1,
        "BuyRestrictionCurrent": 0,
        "StackObjectsCount": 2000,
        "UnlimitedCount": false
      }
    }
  ],
  "barter_scheme": {
    "61e0a288033bdc459438be58": [
      [
        {
          "count": 3,
          "_tpl": "59e3639286f7741777737013"
        }
      ]
    ],
    "61e0a288033bdc459438be5c": [
      [
        {
          "count": 46065,
          "_tpl": "5449016a4bdc2d6f028b456f"
        }
      ]
    ],
    "61e0a288033bdc459438be5e": [
      [
        {
          "count": 3565,
          "_tpl": "5449016a4bdc2d6f028b456f"
        }
      ]
    ],
    "61e0a288033bdc459438be60": [
      [
        {
          "count": 19260,
          "_tpl": "5449016a4bdc2d6f028b456f"
        }
      ]
    ],
    "61e0a288033bdc459438be62": [
      [
        {
          "count": 1823,
          "_tpl": "5449016a4bdc2d6f028b456f"
        }
      ]
    ],
    "61e0a288033bdc459438be64": [
      [
        {
          "count": 55203,
          "_tpl": "5449016a4bdc2d6f028b456f"
        }
      ]
    ],
    "61e0a288033bdc459438be66": [
      [
        {
          "count": 593,
          "_tpl": "5449016a4bdc2d6f028b456f"
        }
      ]
    ],
    "61e0a288033bdc459438be68": [
      [
        {
          "count": 4485,
          "_tpl": "5449016a4bdc2d6f028b456f"
        }
      ]
    ],
    "61e0a288033bdc459438be6a": [
      [
        {
          "count": 3,
          "_tpl": "5aa7e373e5b5b000137b76f0"
        }
      ]
    ],
    "61e0a288033bdc459438be6c": [
      [
        {
          "count": 4,
          "_tpl": "59e366c186f7741778269d85"
        }
      ]
    ],
    "61e0a288033bdc459438be6e": [
      [
        {
          "count": 4,
          "_tpl": "545cdb794bdc2d3a198b456a"
        }
      ]
    ],
    "61e0a288033bdc459438be70": [
      [
        {
          "count": 126351,
          "_tpl": "5449016a4bdc2d6f028b456f"
        }
      ]
    ],
    "61e0a288033bdc459438be72": [
      [
        {
          "count": 2409,
          "_tpl": "5449016a4bdc2d6f028b456f"
        }
      ]
    ],
    "61e0a288033bdc459438be74": [
      [
        {
          "count": 3,
          "_tpl": "5aa2b923e5b5b000137b7589"
        },
        {
          "count": 3,
          "_tpl": "5ac4c50d5acfc40019262e87"
        }
      ]
    ],
    "61e0a288033bdc459438be76": [
      [
        {
          "count": 7,
          "_tpl": "59f32c3b86f77472a31742f0",
          "side": "Any",
          "level": 10
        }
      ]
    ],
    "61e0a288033bdc459438be78": [
      [
        {
          "count": 37373,
          "_tpl": "5449016a4bdc2d6f028b456f"
        }
      ]
    ],
    "61e0a288033bdc459438be7a": [
      [
        {
          "count": 86563,
          "_tpl": "5449016a4bdc2d6f028b456f"
        }
      ]
    ],
    "61e0a288033bdc459438be7e": [
      [
        {
          "count": 68448,
          "_tpl": "5449016a4bdc2d6f028b456f"
        }
      ]
    ],
    "61e0a288033bdc459438be80": [
      [
        {
          "count": 6,
          "_tpl": "5d1b31ce86f7742523398394"
        },
        {
          "count": 5,
          "_tpl": "590c2c9c86f774245b1f03f2"
        },
        {
          "count": 5,
          "_tpl": "590c2b4386f77425357b6123"
        }
      ]
    ],
    "61e0a288033bdc459438be82": [
      [
        {
          "count": 7584,
          "_tpl": "5449016a4bdc2d6f028b456f"
        }
      ]
    ],
    "61e0a288033bdc459438be84": [
      [
        {
          "count": 51181,
          "_tpl": "5449016a4bdc2d6f028b456f"
        }
      ]
    ],
    "61e0a288033bdc459438be86": [
      [
        {
          "count": 4,
          "_tpl": "590a3cd386f77436f20848cb"
        }
      ]
    ],
    "61e0a288033bdc459438be88": [
      [
        {
          "count": 7,
          "_tpl": "5d40412b86f7743cb332ac3a"
        },
        {
          "count": 5,
          "_tpl": "5d4041f086f7743cac3f22a7"
        }
      ]
    ],
    "61e0a288033bdc459438be8a": [
      [
        {
          "count": 5,
          "_tpl": "5b432c305acfc40019478128"
        },
        {
          "count": 6,
          "_tpl": "5b4326435acfc433000ed01d"
        }
      ]
    ],
    "61e0a288033bdc459438be8e": [
      [
        {
          "count": 2215,
          "_tpl": "5449016a4bdc2d6f028b456f"
        }
      ]
    ],
    "61e0a288033bdc459438be90": [
      [
        {
          "count": 2046,
          "_tpl": "5449016a4bdc2d6f028b456f"
        }
      ]
    ],
    "61e0a288033bdc459438be92": [
      [
        {
          "count": 1,
          "_tpl": "5af0484c86f7740f02001f7f"
        },
        {
          "count": 1,
          "_tpl": "57514643245977207f2c2d09"
        },
        {
          "count": 1,
          "_tpl": "575146b724597720a27126d5"
        }
      ]
    ],
    "61e0a288033bdc459438be94": [
      [
        {
          "count": 637,
          "_tpl": "5449016a4bdc2d6f028b456f"
        }
      ]
    ],
    "61e0a288033bdc459438be96": [
      [
        {
          "count": 101232,
          "_tpl": "5449016a4bdc2d6f028b456f"
        }
      ]
    ],
    "61e0a288033bdc459438be98": [
      [
        {
          "count": 1,
          "_tpl": "577e1c9d2459773cd707c525"
        }
      ]
    ],
    "61e0a288033bdc459438be9a": [
      [
        {
          "count": 6,
          "_tpl": "590c595c86f7747884343ad7"
        },
        {
          "count": 2,
          "_tpl": "5c12688486f77426843c7d32"
        }
      ]
    ],
    "61e0a288033bdc459438be9c": [
      [
        {
          "count": 3,
          "_tpl": "5751435d24597720a27126d1"
        }
      ]
    ],
    "61e0a288033bdc459438be9e": [
      [
        {
          "count": 2028,
          "_tpl": "5449016a4bdc2d6f028b456f"
        }
      ]
    ],
    "61e0a288033bdc459438bea0": [
      [
        {
          "count": 1,
          "_tpl": "5d235a5986f77443f6329bc6"
        },
        {
          "count": 3,
          "_tpl": "5734758f24597738025ee253"
        }
      ]
    ],
    "61e0a288033bdc459438bea4": [
      [
        {
          "count": 28272,
          "_tpl": "5449016a4bdc2d6f028b456f"
        }
      ]
    ],
    "61e0a288033bdc459438bea6": [
      [
        {
          "count": 1,
          "_tpl": "59e3577886f774176a362503"
        },
        {
          "count": 3,
          "_tpl": "5673de654bdc2d180f8b456d"
        },
        {
          "count": 5,
          "_tpl": "544fb6cc4bdc2d34748b456e"
        }
      ]
    ],
    "61e0a288033bdc459438bea8": [
      [
        {
          "count": 6,
          "_tpl": "5d1b392c86f77425243e98fe"
        }
      ]
    ],
    "61e0a288033bdc459438beaa": [
      [
        {
          "count": 64197,
          "_tpl": "5449016a4bdc2d6f028b456f"
        }
      ]
    ],
    "61e0a288033bdc459438beac": [
      [
        {
          "count": 51443,
          "_tpl": "5449016a4bdc2d6f028b456f"
        }
      ]
    ],
    "61e0a288033bdc459438beae": [
      [
        {
          "count": 2,
          "_tpl": "59e3556c86f7741776641ac2"
        }
      ]
    ],
    "61e0a288033bdc459438beb0": [
      [
        {
          "count": 34548,
          "_tpl": "5449016a4bdc2d6f028b456f"
        }
      ]
    ],
    "61e0a288033bdc459438beb2": [
      [
        {
          "count": 420635,
          "_tpl": "5449016a4bdc2d6f028b456f"
        }
      ]
    ],
    "61e0a288033bdc459438beb4": [
      [
        {
          "count": 42180,
          "_tpl": "5449016a4bdc2d6f028b456f"
        }
      ]
    ],
    "61e0a288033bdc459438beb6": [
      [
        {
          "count": 44400,
          "_tpl": "5449016a4bdc2d6f028b456f"
        }
      ]
    ],
    "61e0a288033bdc459438beb8": [
      [
        {
          "count": 5007,
          "_tpl": "5449016a4bdc2d6f028b456f"
        }
      ]
    ],
    "61e0a288033bdc459438beba": [
      [
        {
          "count": 48263,
          "_tpl": "5449016a4bdc2d6f028b456f"
        }
      ]
    ],
    "61e0a288033bdc459438bebc": [
      [
        {
          "count": 993,
          "_tpl": "5449016a4bdc2d6f028b456f"
        }
      ]
    ],
    "61e0a288033bdc459438bebe": [
      [
        {
          "count": 45177,
          "_tpl": "5449016a4bdc2d6f028b456f"
        }
      ]
    ],
    "61e0a288033bdc459438bec0": [
      [
        {
          "count": 64553,
          "_tpl": "5449016a4bdc2d6f028b456f"
        }
      ]
    ],
    "61e0a289033bdc459438bec2": [
      [
        {
          "count": 28917,
          "_tpl": "5449016a4bdc2d6f028b456f"
        }
      ]
    ],
    "61e0a289033bdc459438bec4": [
      [
        {
          "count": 68931,
          "_tpl": "5449016a4bdc2d6f028b456f"
        }
      ]
    ],
    "61e0a289033bdc459438bec6": [
      [
        {
          "count": 4727,
          "_tpl": "5449016a4bdc2d6f028b456f"
        }
      ]
    ],
    "61e0a289033bdc459438bec8": [
      [
        {
          "count": 6,
          "_tpl": "59f32c3b86f77472a31742f0",
          "side": "Any",
          "level": 20
        }
      ]
    ],
    "61e0a289033bdc459438beca": [
      [
        {
          "count": 1923,
          "_tpl": "5449016a4bdc2d6f028b456f"
        }
      ]
    ],
    "61e0a289033bdc459438becc": [
      [
        {
          "count": 76035,
          "_tpl": "5449016a4bdc2d6f028b456f"
        }
      ]
    ],
    "61e0a289033bdc459438bece": [
      [
        {
          "count": 3,
          "_tpl": "572b7fa524597762b747ce82"
        }
      ]
    ],
    "61e0a289033bdc459438bed0": [
      [
        {
          "count": 5217,
          "_tpl": "5449016a4bdc2d6f028b456f"
        }
      ]
    ],
    "61e0a289033bdc459438bed2": [
      [
        {
          "count": 8,
          "_tpl": "59e3556c86f7741776641ac2"
        },
        {
          "count": 2,
          "_tpl": "5e2af41e86f774755a234b67"
        }
      ]
    ],
    "61e0a289033bdc459438bed4": [
      [
        {
          "count": 2,
          "_tpl": "5d235b4d86f7742e017bc88a"
        }
      ]
    ],
    "61e0a289033bdc459438bed6": [
      [
        {
          "count": 2,
          "_tpl": "5d1b376e86f774252519444e"
        },
        {
          "count": 5,
          "_tpl": "5d40407c86f774318526545a"
        }
      ]
    ],
    "61e0a289033bdc459438bed8": [
      [
        {
          "count": 1853,
          "_tpl": "5449016a4bdc2d6f028b456f"
        }
      ]
    ],
    "61e0a289033bdc459438beda": [
      [
        {
          "count": 27828,
          "_tpl": "5449016a4bdc2d6f028b456f"
        }
      ]
    ],
    "61e0a289033bdc459438bedc": [
      [
        {
          "count": 1,
          "_tpl": "590de71386f774347051a052"
        }
      ]
    ],
    "61e0a289033bdc459438bede": [
      [
        {
          "count": 3552,
          "_tpl": "5449016a4bdc2d6f028b456f"
        }
      ]
    ],
    "61e0a289033bdc459438bee0": [
      [
        {
          "count": 49950,
          "_tpl": "5449016a4bdc2d6f028b456f"
        }
      ]
    ],
    "61e0a289033bdc459438bee2": [
      [
        {
          "count": 146442,
          "_tpl": "5449016a4bdc2d6f028b456f"
        }
      ]
    ],
    "61e0a289033bdc459438bee4": [
      [
        {
          "count": 2,
          "_tpl": "59e770b986f7742cbd762754"
        }
      ]
    ],
    "61e0a289033bdc459438bee6": [
      [
        {
          "count": 1,
          "_tpl": "573474f924597738002c6174"
        }
      ]
    ],
    "61e0a289033bdc459438bee8": [
      [
        {
          "count": 26575,
          "_tpl": "5449016a4bdc2d6f028b456f"
        }
      ]
    ],
    "61e0a289033bdc459438beea": [
      [
        {
          "count": 4,
          "_tpl": "5d235b4d86f7742e017bc88a"
        }
      ]
    ],
    "61e0a289033bdc459438beec": [
      [
        {
          "count": 38295,
          "_tpl": "5449016a4bdc2d6f028b456f"
        }
      ]
    ],
    "61e0a289033bdc459438beee": [
      [
        {
          "count": 77995,
          "_tpl": "5449016a4bdc2d6f028b456f"
        }
      ]
    ],
    "61e0a289033bdc459438bef0": [
      [
        {
          "count": 10,
          "_tpl": "59f32c3b86f77472a31742f0",
          "side": "Any",
          "level": 20
        }
      ]
    ],
    "61e0a289033bdc459438bef2": [
      [
        {
          "count": 67821,
          "_tpl": "5449016a4bdc2d6f028b456f"
        }
      ]
    ],
    "61e0a289033bdc459438bef4": [
      [
        {
          "count": 4,
          "_tpl": "5c0fa877d174af02a012e1cf"
        },
        {
          "count": 1,
          "_tpl": "5e8f3423fd7471236e6e3b64"
        }
      ]
    ],
    "61e0a289033bdc459438bef6": [
      [
        {
          "count": 2,
          "_tpl": "5734758f24597738025ee253"
        },
        {
          "count": 3,
          "_tpl": "5af0484c86f7740f02001f7f"
        }
      ]
    ],
    "61e0a289033bdc459438bef8": [
      [
        {
          "count": 18776,
          "_tpl": "5449016a4bdc2d6f028b456f"
        }
      ]
    ],
    "61e0a289033bdc459438befa": [
      [
        {
          "count": 7535,
          "_tpl": "5449016a4bdc2d6f028b456f"
        }
      ]
    ],
    "61e0a289033bdc459438befc": [
      [
        {
          "count": 64479,
          "_tpl": "5449016a4bdc2d6f028b456f"
        }
      ]
    ],
    "61e0a289033bdc459438befe": [
      [
        {
          "count": 585,
          "_tpl": "5449016a4bdc2d6f028b456f"
        }
      ]
    ],
    "61e0a289033bdc459438bf00": [
      [
        {
          "count": 810,
          "_tpl": "5449016a4bdc2d6f028b456f"
        }
      ]
    ],
    "61e0a289033bdc459438bf02": [
      [
        {
          "count": 23780,
          "_tpl": "5449016a4bdc2d6f028b456f"
        }
      ]
    ],
    "61e0a289033bdc459438bf04": [
      [
        {
          "count": 5,
          "_tpl": "57347c1124597737fb1379e3"
        },
        {
          "count": 1,
          "_tpl": "59faf98186f774067b6be103"
        }
      ]
    ],
    "61e0a289033bdc459438bf06": [
      [
        {
          "count": 12985,
          "_tpl": "5449016a4bdc2d6f028b456f"
        }
      ]
    ],
    "61e0a289033bdc459438bf08": [
      [
        {
          "count": 2874,
          "_tpl": "5449016a4bdc2d6f028b456f"
        }
      ]
    ],
    "61e0a289033bdc459438bf0a": [
      [
        {
          "count": 148092,
          "_tpl": "5449016a4bdc2d6f028b456f"
        }
      ]
    ],
    "61e0a289033bdc459438bf0c": [
      [
        {
          "count": 29154,
          "_tpl": "5449016a4bdc2d6f028b456f"
        }
      ]
    ],
    "61e0a289033bdc459438bf0e": [
      [
        {
          "count": 12496,
          "_tpl": "5449016a4bdc2d6f028b456f"
        }
      ]
    ],
    "61e0a289033bdc459438bf10": [
      [
        {
          "count": 4793,
          "_tpl": "5449016a4bdc2d6f028b456f"
        }
      ]
    ],
    "61e0a289033bdc459438bf12": [
      [
        {
          "count": 2252,
          "_tpl": "5449016a4bdc2d6f028b456f"
        }
      ]
    ],
    "61e0a289033bdc459438bf14": [
      [
        {
          "count": 1,
          "_tpl": "5e2af29386f7746d4159f077"
        }
      ]
    ],
    "61e0a289033bdc459438bf16": [
      [
        {
          "count": 1916,
          "_tpl": "5449016a4bdc2d6f028b456f"
        }
      ]
    ],
    "61e0a289033bdc459438bf18": [
      [
        {
          "count": 2,
          "_tpl": "59e366c186f7741778269d85"
        }
      ]
    ],
    "61e0a289033bdc459438bf1a": [
      [
        {
          "count": 61239,
          "_tpl": "5449016a4bdc2d6f028b456f"
        }
      ]
    ],
    "61e0a289033bdc459438bf1c": [
      [
        {
          "count": 2268,
          "_tpl": "5449016a4bdc2d6f028b456f"
        }
      ]
    ],
    "61e0a289033bdc459438bf1e": [
      [
        {
          "count": 56660,
          "_tpl": "5449016a4bdc2d6f028b456f"
        }
      ]
    ],
    "61e0a289033bdc459438bf20": [
      [
        {
          "count": 65370,
          "_tpl": "5449016a4bdc2d6f028b456f"
        }
      ]
    ],
    "61e0a289033bdc459438bf22": [
      [
        {
          "count": 1,
          "_tpl": "5c1267ee86f77416ec610f72"
        },
        {
          "count": 1,
          "_tpl": "5734758f24597738025ee253"
        }
      ]
    ],
    "61e0a289033bdc459438bf24": [
      [
        {
          "count": 7,
          "_tpl": "5d235b4d86f7742e017bc88a"
        }
      ]
    ],
    "61e0a289033bdc459438bf26": [
      [
        {
          "count": 3,
          "_tpl": "57347b8b24597737dd42e192"
        }
      ]
    ],
    "61e0a289033bdc459438bf28": [
      [
        {
          "count": 8137,
          "_tpl": "5449016a4bdc2d6f028b456f"
        }
      ]
    ],
    "61e0a289033bdc459438bf2a": [
      [
        {
          "count": 1,
          "_tpl": "57347ca924597744596b4e71"
        },
        {
          "count": 4,
          "_tpl": "57347baf24597738002c6178"
        }
      ]
    ],
    "61e0a289033bdc459438bf2c": [
      [
        {
          "count": 22456,
          "_tpl": "5449016a4bdc2d6f028b456f"
        }
      ]
    ],
    "61e0a289033bdc459438bf2e": [
      [
        {
          "count": 239800,
          "_tpl": "5449016a4bdc2d6f028b456f"
        }
      ]
    ],
    "61e0a289033bdc459438bf30": [
      [
        {
          "count": 23444,
          "_tpl": "5449016a4bdc2d6f028b456f"
        }
      ]
    ],
    "61e0a289033bdc459438bf32": [
      [
        {
          "count": 29381,
          "_tpl": "5449016a4bdc2d6f028b456f"
        }
      ]
    ],
    "61e0a289033bdc459438bf34": [
      [
        {
          "count": 1,
          "_tpl": "590c2c9c86f774245b1f03f2"
        }
      ]
    ],
    "61e0a289033bdc459438bf36": [
      [
        {
          "count": 7,
          "_tpl": "59e366c186f7741778269d85"
        }
      ]
    ],
    "61e0a289033bdc459438bf38": [
      [
        {
          "count": 45133,
          "_tpl": "5449016a4bdc2d6f028b456f"
        }
      ]
    ],
    "61e0a289033bdc459438bf3a": [
      [
        {
          "count": 1665,
          "_tpl": "5449016a4bdc2d6f028b456f"
        }
      ]
    ],
    "61e0a289033bdc459438bf3c": [
      [
        {
          "count": 35076,
          "_tpl": "5449016a4bdc2d6f028b456f"
        }
      ]
    ],
    "61e0a289033bdc459438bf3e": [
      [
        {
          "count": 55312,
          "_tpl": "5449016a4bdc2d6f028b456f"
        }
      ]
    ],
    "61e0a289033bdc459438bf40": [
      [
        {
          "count": 7437,
          "_tpl": "5449016a4bdc2d6f028b456f"
        }
      ]
    ],
    "61e0a289033bdc459438bf42": [
      [
        {
          "count": 3885,
          "_tpl": "5449016a4bdc2d6f028b456f"
        }
      ]
    ],
    "61e0a289033bdc459438bf44": [
      [
        {
          "count": 5,
          "_tpl": "5d403f9186f7743cac3f229b"
        }
      ]
    ],
    "61e0a289033bdc459438bf46": [
      [
        {
          "count": 3,
          "_tpl": "59e366c186f7741778269d85"
        }
      ]
    ],
    "61e0a289033bdc459438bf48": [
      [
        {
          "count": 163075,
          "_tpl": "5449016a4bdc2d6f028b456f"
        }
      ]
    ],
    "61e0a289033bdc459438bf4a": [
      [
        {
          "count": 36852,
          "_tpl": "5449016a4bdc2d6f028b456f"
        }
      ]
    ],
    "61e0a289033bdc459438bf4c": [
      [
        {
          "count": 6216,
          "_tpl": "5449016a4bdc2d6f028b456f"
        }
      ]
    ],
    "61e0a289033bdc459438bf4e": [
      [
        {
          "count": 4,
          "_tpl": "590c2d8786f774245b1f03f3"
        },
        {
          "count": 4,
          "_tpl": "590c311186f77424d1667482"
        },
        {
          "count": 1,
          "_tpl": "5d40419286f774318526545f"
        }
      ]
    ],
    "61e0a289033bdc459438bf50": [
      [
        {
          "count": 4,
          "_tpl": "59e3556c86f7741776641ac2"
        },
        {
          "count": 2,
          "_tpl": "5d40412b86f7743cb332ac3a"
        }
      ]
    ],
    "61e0a289033bdc459438bf52": [
      [
        {
          "count": 37019,
          "_tpl": "5449016a4bdc2d6f028b456f"
        }
      ]
    ],
    "61e0a289033bdc459438bf54": [
      [
        {
          "count": 16859,
          "_tpl": "5449016a4bdc2d6f028b456f"
        }
      ]
    ],
    "61e0a289033bdc459438bf56": [
      [
        {
          "count": 3,
          "_tpl": "5734773724597737fd047c14"
        }
      ]
    ],
    "61e0a289033bdc459438bf58": [
      [
        {
          "count": 27079,
          "_tpl": "5449016a4bdc2d6f028b456f"
        }
      ]
    ],
    "61e0a289033bdc459438bf5a": [
      [
        {
          "count": 10013,
          "_tpl": "5449016a4bdc2d6f028b456f"
        }
      ]
    ],
    "61e0a289033bdc459438bf5c": [
      [
        {
          "count": 3,
          "_tpl": "5c0e655586f774045612eeb2"
        },
        {
          "count": 4,
          "_tpl": "5e2af41e86f774755a234b67"
        },
        {
          "count": 4,
          "_tpl": "5e2af4d286f7746d4159f07a"
        }
      ]
    ],
    "61e0a289033bdc459438bf5e": [
      [
        {
          "count": 5,
          "_tpl": "5e2af4d286f7746d4159f07a"
        },
        {
          "count": 6,
          "_tpl": "59e366c186f7741778269d85"
        },
        {
          "count": 1,
          "_tpl": "5e2af41e86f774755a234b67"
        }
      ]
    ],
    "61e0a289033bdc459438bf60": [
      [
        {
          "count": 4,
          "_tpl": "59e366c186f7741778269d85"
        },
        {
          "count": 1,
          "_tpl": "57347c5b245977448d35f6e1"
        }
      ]
    ],
    "61e0a289033bdc459438bf62": [
      [
        {
          "count": 18315,
          "_tpl": "5449016a4bdc2d6f028b456f"
        }
      ]
    ],
    "61e0a289033bdc459438bf64": [
      [
        {
          "count": 53680,
          "_tpl": "5449016a4bdc2d6f028b456f"
        }
      ]
    ],
    "61e0a289033bdc459438bf66": [
      [
        {
          "count": 88245,
          "_tpl": "5449016a4bdc2d6f028b456f"
        }
      ]
    ],
    "61e0a289033bdc459438bf68": [
      [
        {
          "count": 33966,
          "_tpl": "5449016a4bdc2d6f028b456f"
        }
      ]
    ],
    "61e0a289033bdc459438bf6a": [
      [
        {
          "count": 13517,
          "_tpl": "5449016a4bdc2d6f028b456f"
        }
      ]
    ],
    "61e0a289033bdc459438bf6c": [
      [
        {
          "count": 35538,
          "_tpl": "5449016a4bdc2d6f028b456f"
        }
      ]
    ],
    "61e0a289033bdc459438bf6e": [
      [
        {
          "count": 2,
          "_tpl": "5734758f24597738025ee253"
        },
        {
          "count": 2,
          "_tpl": "5b3b713c5acfc4330140bd8d"
        }
      ]
    ],
    "61e0a289033bdc459438bf70": [
      [
        {
          "count": 2,
          "_tpl": "573474f924597738002c6174"
        }
      ]
    ],
    "61e0a289033bdc459438bf72": [
      [
        {
          "count": 1,
          "_tpl": "5c0d2727d174af02a012cf58"
        }
      ]
    ],
    "61e0a289033bdc459438bf74": [
      [
        {
          "count": 3,
          "_tpl": "5c0e446786f7742013381639"
        }
      ]
    ],
    "61e0a289033bdc459438bf76": [
      [
        {
          "count": 39371,
          "_tpl": "5449016a4bdc2d6f028b456f"
        }
      ]
    ],
    "61e0a289033bdc459438bf78": [
      [
        {
          "count": 4,
          "_tpl": "5d5d646386f7742797261fd9"
        }
      ]
    ],
    "61e0a289033bdc459438bf7a": [
      [
        {
          "count": 20979,
          "_tpl": "5449016a4bdc2d6f028b456f"
        }
      ]
    ],
    "61e0a289033bdc459438bf7c": [
      [
        {
          "count": 38295,
          "_tpl": "5449016a4bdc2d6f028b456f"
        }
      ]
    ],
    "61e0a289033bdc459438bf7e": [
      [
        {
          "count": 39960,
          "_tpl": "5449016a4bdc2d6f028b456f"
        }
      ]
    ],
    "61e0a289033bdc459438bf80": [
      [
        {
          "count": 3519,
          "_tpl": "5449016a4bdc2d6f028b456f"
        }
      ]
    ],
    "61e0a289033bdc459438bf82": [
      [
        {
          "count": 56610,
          "_tpl": "5449016a4bdc2d6f028b456f"
        }
      ]
    ],
    "61e0a289033bdc459438bf84": [
      [
        {
          "count": 41625,
          "_tpl": "5449016a4bdc2d6f028b456f"
        }
      ]
    ],
    "61e0a289033bdc459438bf86": [
      [
        {
          "count": 39960,
          "_tpl": "5449016a4bdc2d6f028b456f"
        }
      ]
    ],
    "61e0a289033bdc459438bf88": [
      [
        {
          "count": 24420,
          "_tpl": "5449016a4bdc2d6f028b456f"
        }
      ]
    ],
    "61e0a289033bdc459438bf8a": [
      [
        {
          "count": 1,
          "_tpl": "61bf83814088ec1a363d7097"
        },
        {
          "count": 1,
          "_tpl": "5e2af4a786f7746d3f3c3400"
        }
      ]
    ],
    "61e0a289033bdc459438bf8c": [
      [
        {
          "count": 1,
          "_tpl": "61bf83814088ec1a363d7097"
        },
        {
          "count": 2,
          "_tpl": "5e2af41e86f774755a234b67"
        }
      ]
    ],
    "8dbec7bdd5679cc8a22ad7cd": [
      [
        {
          "count": 5,
          "_tpl": "5ab8f20c86f7745cdb629fb2"
        },
        {
          "count": 5,
          "_tpl": "59e7708286f7742cbd762753"
        },
        {
          "count": 5,
          "_tpl": "5aa2b923e5b5b000137b7589"
        }
      ]
    ],
    "07620747e7cf2dfe7228262c": [
      [
        {
          "count": 41771,
          "_tpl": "5449016a4bdc2d6f028b456f"
        }
      ]
    ],
    "2927cf4598186e4dbaa00f7e": [
      [
        {
          "count": 1,
          "_tpl": "5780cf7f2459777de4559322"
        },
        {
          "count": 1,
          "_tpl": "5a0dc95c86f77452440fc675"
        },
        {
          "count": 5,
          "_tpl": "5c12688486f77426843c7d32"
        }
      ]
    ],
    "758b83b84920338da57630c3": [
      [
        {
          "count": 3,
          "_tpl": "5e2af41e86f774755a234b67"
        },
        {
          "count": 1,
          "_tpl": "5d403f9186f7743cac3f229b"
        },
        {
          "count": 3,
          "_tpl": "5e2af4a786f7746d3f3c3400"
        }
      ]
    ]
  },
  "loyal_level_items": {
    "61e0a288033bdc459438be58": 4,
    "61e0a288033bdc459438be5c": 3,
    "61e0a288033bdc459438be5e": 3,
    "61e0a288033bdc459438be60": 3,
    "61e0a288033bdc459438be62": 1,
    "61e0a288033bdc459438be64": 2,
    "61e0a288033bdc459438be66": 1,
    "61e0a288033bdc459438be68": 2,
    "61e0a288033bdc459438be6a": 3,
    "61e0a288033bdc459438be6c": 4,
    "61e0a288033bdc459438be6e": 4,
    "61e0a288033bdc459438be70": 3,
    "61e0a288033bdc459438be72": 3,
    "61e0a288033bdc459438be74": 3,
    "61e0a288033bdc459438be76": 2,
    "61e0a288033bdc459438be78": 2,
    "61e0a288033bdc459438be7a": 4,
    "61e0a288033bdc459438be7e": 4,
    "61e0a288033bdc459438be80": 4,
    "61e0a288033bdc459438be82": 4,
    "61e0a288033bdc459438be84": 3,
    "61e0a288033bdc459438be86": 2,
    "61e0a288033bdc459438be88": 3,
    "61e0a288033bdc459438be8a": 3,
    "61e0a288033bdc459438be8e": 2,
    "61e0a288033bdc459438be90": 1,
    "61e0a288033bdc459438be92": 2,
    "61e0a288033bdc459438be94": 1,
    "61e0a288033bdc459438be96": 4,
    "61e0a288033bdc459438be98": 1,
    "61e0a288033bdc459438be9a": 4,
    "61e0a288033bdc459438be9c": 1,
    "61e0a288033bdc459438be9e": 1,
    "61e0a288033bdc459438bea0": 4,
    "61e0a288033bdc459438bea4": 3,
    "61e0a288033bdc459438bea6": 2,
    "61e0a288033bdc459438bea8": 4,
    "61e0a288033bdc459438beaa": 2,
    "61e0a288033bdc459438beac": 2,
    "61e0a288033bdc459438beae": 1,
    "61e0a288033bdc459438beb0": 2,
    "61e0a288033bdc459438beb2": 4,
    "61e0a288033bdc459438beb4": 2,
    "61e0a288033bdc459438beb6": 3,
    "61e0a288033bdc459438beb8": 2,
    "61e0a288033bdc459438beba": 3,
    "61e0a288033bdc459438bebc": 1,
    "61e0a288033bdc459438bebe": 3,
    "61e0a288033bdc459438bec0": 2,
    "61e0a289033bdc459438bec2": 2,
    "61e0a289033bdc459438bec4": 4,
    "61e0a289033bdc459438bec6": 3,
    "61e0a289033bdc459438bec8": 4,
    "61e0a289033bdc459438beca": 1,
    "61e0a289033bdc459438becc": 3,
    "61e0a289033bdc459438bece": 1,
    "61e0a289033bdc459438bed0": 4,
    "61e0a289033bdc459438bed2": 4,
    "61e0a289033bdc459438bed4": 4,
    "61e0a289033bdc459438bed6": 4,
    "61e0a289033bdc459438bed8": 1,
    "61e0a289033bdc459438beda": 2,
    "61e0a289033bdc459438bedc": 3,
    "61e0a289033bdc459438bede": 3,
    "61e0a289033bdc459438bee0": 4,
    "61e0a289033bdc459438bee2": 4,
    "61e0a289033bdc459438bee4": 2,
    "61e0a289033bdc459438bee6": 1,
    "61e0a289033bdc459438bee8": 4,
    "61e0a289033bdc459438beea": 3,
    "61e0a289033bdc459438beec": 4,
    "61e0a289033bdc459438beee": 2,
    "61e0a289033bdc459438bef0": 4,
    "61e0a289033bdc459438bef2": 3,
    "61e0a289033bdc459438bef4": 3,
    "61e0a289033bdc459438bef6": 3,
    "61e0a289033bdc459438bef8": 2,
    "61e0a289033bdc459438befa": 4,
    "61e0a289033bdc459438befc": 2,
    "61e0a289033bdc459438befe": 1,
    "61e0a289033bdc459438bf00": 1,
    "61e0a289033bdc459438bf02": 2,
    "61e0a289033bdc459438bf04": 2,
    "61e0a289033bdc459438bf06": 2,
    "61e0a289033bdc459438bf08": 1,
    "61e0a289033bdc459438bf0a": 3,
    "61e0a289033bdc459438bf0c": 1,
    "61e0a289033bdc459438bf0e": 1,
    "61e0a289033bdc459438bf10": 2,
    "61e0a289033bdc459438bf12": 1,
    "61e0a289033bdc459438bf14": 3,
    "61e0a289033bdc459438bf16": 1,
    "61e0a289033bdc459438bf18": 2,
    "61e0a289033bdc459438bf1a": 3,
    "61e0a289033bdc459438bf1c": 2,
    "61e0a289033bdc459438bf1e": 1,
    "61e0a289033bdc459438bf20": 2,
    "61e0a289033bdc459438bf22": 4,
    "61e0a289033bdc459438bf24": 3,
    "61e0a289033bdc459438bf26": 2,
    "61e0a289033bdc459438bf28": 1,
    "61e0a289033bdc459438bf2a": 4,
    "61e0a289033bdc459438bf2c": 1,
    "61e0a289033bdc459438bf2e": 3,
    "61e0a289033bdc459438bf30": 1,
    "61e0a289033bdc459438bf32": 2,
    "61e0a289033bdc459438bf34": 2,
    "61e0a289033bdc459438bf36": 4,
    "61e0a289033bdc459438bf38": 3,
    "61e0a289033bdc459438bf3a": 3,
    "61e0a289033bdc459438bf3c": 2,
    "61e0a289033bdc459438bf3e": 2,
    "61e0a289033bdc459438bf40": 4,
    "61e0a289033bdc459438bf42": 2,
    "61e0a289033bdc459438bf44": 3,
    "61e0a289033bdc459438bf46": 3,
    "61e0a289033bdc459438bf48": 3,
    "61e0a289033bdc459438bf4a": 4,
    "61e0a289033bdc459438bf4c": 3,
    "61e0a289033bdc459438bf4e": 3,
    "61e0a289033bdc459438bf50": 3,
    "61e0a289033bdc459438bf52": 4,
    "61e0a289033bdc459438bf54": 2,
    "61e0a289033bdc459438bf56": 3,
    "61e0a289033bdc459438bf58": 1,
    "61e0a289033bdc459438bf5a": 1,
    "61e0a289033bdc459438bf5c": 4,
    "61e0a289033bdc459438bf5e": 4,
    "61e0a289033bdc459438bf60": 4,
    "61e0a289033bdc459438bf62": 3,
    "61e0a289033bdc459438bf64": 2,
    "61e0a289033bdc459438bf66": 3,
    "61e0a289033bdc459438bf68": 4,
    "61e0a289033bdc459438bf6a": 2,
    "61e0a289033bdc459438bf6c": 2,
    "61e0a289033bdc459438bf6e": 2,
    "61e0a289033bdc459438bf70": 1,
    "61e0a289033bdc459438bf72": 1,
    "61e0a289033bdc459438bf74": 2,
    "61e0a289033bdc459438bf76": 2,
    "61e0a289033bdc459438bf78": 2,
    "61e0a289033bdc459438bf7a": 1,
    "61e0a289033bdc459438bf7c": 3,
    "61e0a289033bdc459438bf7e": 2,
    "61e0a289033bdc459438bf80": 2,
    "61e0a289033bdc459438bf82": 3,
    "61e0a289033bdc459438bf84": 3,
    "61e0a289033bdc459438bf86": 3,
    "61e0a289033bdc459438bf88": 2,
    "61e0a289033bdc459438bf8a": 2,
    "61e0a289033bdc459438bf8c": 3,
    "8dbec7bdd5679cc8a22ad7cd": 3,
    "07620747e7cf2dfe7228262c": 3,
    "2927cf4598186e4dbaa00f7e": 4,
    "758b83b84920338da57630c3": 4
  }
}